automatic DPDK test reports
 help / color / mirror / Atom feed
* [dpdk-test-report] |FAILURE| pw(108357) sid(21894) job(PER_PATCH_BUILD2385)[v6] crypto/openssl: openssl 3.0 support on sym crypto routine
@ 2022-05-13 10:20 sys_stv
  0 siblings, 0 replies; only message in thread
From: sys_stv @ 2022-05-13 10:20 UTC (permalink / raw)
  To: test-report, kai.ji

[-- Attachment #1: Type: text/plain, Size: 16453 bytes --]


Test-Label: Intel-compilation
Test-Status: FAILURE
http://dpdk.org/patch/108357

_Compilation issues_

Submitter: Kai Ji <kai.ji@intel.com>
Date: 2022-02-25 15:13:56
Reply_mail: 20220225151356.73397-1-kai.ji@intel.com

DPDK git baseline: Repo:dpdk-next-crypto, CommitID: f741d4f2b55c3d25ad2b3f96630e8c39cb08330d


Meson Build Summary: 23 Builds Done, 20 Successful, 3 Failures, 0 Blocked

+--------------+------------+--------------+------------+------------+-----------+----------+------------+
| os           | gcc-static | clang-static | icc-static | gcc-shared | gcc-debug | document | gcc-16byte |
+--------------+------------+--------------+------------+------------+-----------+----------+------------+
| FC35-64      | pass       | pass         |            |            |           |          |            |
| FreeBSD13-64 | pass       | pass         |            | pass       | pass      |          |            |
| RHEL84-64    | pass       | pass         |            | pass       | pass      |          |            |
| SUSE15-64    | pass       | pass         |            |            |           |          |            |
| UB2004-32    | pass       |              |            |            |           |          |            |
| UB2004-64    | pass       | pass         |            |            |           | pass     |            |
| RHEL85-64    | pass       |              |            |            |           |          |            |
| UB2204-32    | pass       |              |            |            |           |          |            |
| UB2204-64    | fail       | pass         |            |            |           | fail     | fail       |
| CentOS7.9-64 | pass       |              |            |            |           |          |            |
+--------------+------------+--------------+------------+------------+-----------+----------+------------+

Comments: 
Because of DPDK bug (https://bugs.dpdk.org/show_bug.cgi?id=928),
All the dpdk-next-* branch add `Ddisable_drivers=event/cnxk` option when build with ICC complier. 
 
Test environment and configuration as below:


OS: FC35-64
	Kernel Version: 5.14.16-301.fc35.x86_64
	GCC Version: gcc (GCC) 11.2.1 20210728 (Red Hat 11.2.1-1)
	Clang Version: 13.0.0 (Fedora 13.0.0~rc1-1.fc35)
	x86_64-native-linuxapp-gcc
	x86_64-native-linuxapp-clang

OS: FreeBSD13-64
	Kernel Version: 13.0-RELEASE
	GCC Version: gcc (FreeBSD Ports Collection) 10.3.0
	Clang Version: 11.0.1 (git@github.com:llvm/llvm-project.git llvmorg-11.0.1-0-g43ff75f2c3fe)
	x86_64-native-bsdapp-gcc
	x86_64-native-bsdapp-clang
	x86_64-native-bsdapp-gcc+shared
	x86_64-native-bsdapp-gcc+debug

OS: RHEL84-64
	Kernel Version: 4.18.0-348.7.1.el8_5.x86_64
	GCC Version: gcc (GCC) 8.5.0 20210514 (Red Hat 8.5.0-4)
	Clang Version: 12.0.1 (Red Hat 12.0.1-4.module_el8.5.0+1025+93159d6c)
	x86_64-native-linuxapp-gcc
	x86_64-native-linuxapp-clang
	x86_64-native-linuxapp-gcc+shared
	x86_64-native-linuxapp-gcc+debug

OS: SUSE15-64
	Kernel Version: 5.3.18-57-default
	GCC Version: gcc (SUSE Linux) 7.5.0
	Clang Version: 11.0.1
	x86_64-native-linuxapp-clang
	x86_64-native-linuxapp-gcc

OS: UB2004-32
	Kernel Version: 5.8.0-48-generic
	GCC Version: gcc (Ubuntu 10.3.0-1ubuntu1~20.04) 10.3.0
	Clang Version: 10.0.0-4ubuntu1
	i686-native-linuxapp-gcc

OS: UB2004-64
	Kernel Version: 5.8.0-48-generic
	GCC Version: gcc (Ubuntu 10.3.0-1ubuntu1~20.04) 10.3.0
	Clang Version: 10.0.0-4ubuntu1
	x86_64-native-linuxapp-clang
	x86_64-native-linuxapp-gcc
	x86_64-native-linuxapp-doc

OS: RHEL85-64
	Kernel Version: 4.18.0-348.7.1.el8_5.x86_64
	GCC Version: gcc (GCC) 8.5.0 20210514 (Red Hat 8.5.0-4)
	Clang Version: 12.0.1 (Red Hat 12.0.1-4.module_el8.5.0+1025+93159d6c)
	ICC Version: 19.1.3.304 (gcc version 8.5.0 compatibility)
	x86_64-native-linuxapp-gcc

OS: UB2204-32
	Kernel Version: 5.15.0-25-generic
	GCC Version: gcc (Ubuntu 11.2.0-19ubuntu1) 11.2.0
	Clang Version: NA
	i686-native-linuxapp-gcc

OS: UB2204-64
	Kernel Version: 5.15.0-25-generic
	GCC Version: gcc (Ubuntu 11.2.0-19ubuntu1) 11.2.0
	Clang Version: 14.0.0-1ubuntu1
	x86_64-native-linuxapp-gcc+16byte
	x86_64-native-linuxapp-gcc
	x86_64-native-linuxapp-clang
	x86_64-native-linuxapp-doc

OS: CentOS7.9-64
	Kernel Version: 3.10.0-1160.el7.x86_64
	GCC Version: gcc (GCC) 4.8.5 20150623 (Red Hat 4.8.5-44)
	Clang Version: 3.4.2 (tags/RELEASE_34/dot2-final)
	x86_64-native-linuxapp-gcc



*Build Failed #1:
OS: UB2204-64
Target: x86_64-native-linuxapp-gcc+16byte
FAILED: drivers/libtmp_rte_crypto_openssl.a.p/crypto_openssl_rte_openssl_pmd.c.o 
gcc -Idrivers/libtmp_rte_crypto_openssl.a.p -Idrivers -I../drivers -Idrivers/crypto/openssl -I../drivers/crypto/openssl -Ilib/cryptodev -I../lib/cryptodev -I. -I.. -Iconfig -I../config -Ilib/eal/include -I../lib/eal/include -Ilib/eal/linux/include -I../lib/eal/linux/include -Ilib/eal/x86/include -I../lib/eal/x86/include -Ilib/eal/common -I../lib/eal/common -Ilib/eal -I../lib/eal -Ilib/kvargs -I../lib/kvargs -Ilib/metrics -I../lib/metrics -Ilib/telemetry -I../lib/telemetry -Ilib/mbuf -I../lib/mbuf -Ilib/mempool -I../lib/mempool -Ilib/ring -I../lib/ring -Ilib/rcu -I../lib/rcu -Idrivers/bus/vdev -I../drivers/bus/vdev -fdiagnostics-color=always -D_FILE_OFFSET_BITS=64 -Wall -Winvalid-pch -Wextra -Werror -O3 -include rte_config.h -Wcast-qual -Wdeprecated -Wformat -Wformat-nonliteral -Wformat-security -Wmissing-declarations -Wmissing-prototypes -Wnested-externs -Wold-style-definition -Wpointer-arith -Wsign-compare -Wstrict-prototypes -Wundef -Wwrite-strings -Wno-address-of-packed-member -Wno-packed-not-aligned -Wno-missing-field-initializers -Wno-zero-length-bounds -D_GNU_SOURCE -DRTE_LIBRTE_I40E_16BYTE_RX_DESC -DRTE_LIBRTE_ICE_16BYTE_RX_DESC -fPIC -march=native -DALLOW_EXPERIMENTAL_API -DALLOW_INTERNAL_API -Wno-format-truncation -DOPENSSL_API_COMPAT=0x10100000L -DRTE_LOG_DEFAULT_LOGTYPE=pmd.crypto.openssl -MD -MQ drivers/libtmp_rte_crypto_openssl.a.p/crypto_openssl_rte_openssl_pmd.c.o -MF drivers/libtmp_rte_crypto_openssl.a.p/crypto_openssl_rte_openssl_pmd.c.o.d -o drivers/libtmp_rte_crypto_openssl.a.p/crypto_openssl_rte_openssl_pmd.c.o -c ../drivers/crypto/openssl/rte_openssl_pmd.c
In file included from /usr/include/string.h:535,
                 from ../lib/eal/include/rte_uuid.h:19,
                 from ../lib/eal/include/rte_eal.h:21,
                 from ../lib/eal/include/rte_lcore.h:16,
                 from ../lib/eal/include/generic/rte_spinlock.h:21,
                 from ../lib/eal/x86/include/rte_spinlock.h:12,
                 from ../lib/mempool/rte_mempool.h:41,
                 from ../lib/mbuf/rte_mbuf.h:38,
                 from ../lib/cryptodev/rte_crypto.h:20,
                 from ../lib/cryptodev/rte_cryptodev.h:22,
                 from ../drivers/crypto/openssl/rte_openssl_pmd.c:7:
In function ‘memcpy’,
    inlined from ‘openssl_set_session_auth_parameters’ at ../drivers/crypto/openssl/rte_openssl_pmd.c:653:3,
    inlined from ‘openssl_set_session_parameters’ at ../drivers/crypto/openssl/rte_openssl_pmd.c:780:9:
/usr/include/x86_64-linux-gnu/bits/string_fortified.h:29:10: error: ‘__builtin_memcpy’ forming offset [4, 8] is out of the bounds [0, 4] [-Werror=array-bounds]
   29 |   return __builtin___memcpy_chk (__dest, __src, __len,
      |          ^~~~~~~~~~~~~~~~~~~~~~~~~~~~~~~~~~~~~~~~~~~~~
   30 |                                  __glibc_objsize0 (__dest));
      |                                  ~~~~~~~~~~~~~~~~~~~~~~~~~~
cc1: all warnings being treated as errors
[2484/3631] Compiling C object drivers/libtmp_rte_crypto_virtio.a.p/crypto_virtio_virtio_pci.c.o
[2485/3631] Compiling C object drivers/libtmp_rte_crypto_virtio.a.p/crypto_virtio_virtio_rxtx.c.o
[2486/3631] Compiling C object drivers/libtmp_rte_crypto_virtio.a.p/crypto_virtio_virtio_cryptodev.c.o
[2487/3631] Compiling C object drivers/libtmp_rte_compress_isal.a.p/compress_isal_isal_compress_pmd_ops.c.o
[2488/3631] Compiling C object drivers/libtmp_rte_compress_octeontx.a.p/compress_octeontx_otx_zip.c.o
[2489/3631] Compiling C object drivers/libtmp_rte_compress_isal.a.p/compress_isal_isal_compress_pmd.c.o
[2490/3631] Compiling C object drivers/libtmp_rte_crypto_scheduler.a.p/crypto_scheduler_scheduler_multicore.c.o
[2491/3631] Compiling C object drivers/libtmp_rte_compress_octeontx.a.p/compress_octeontx_otx_zip_pmd.c.o
[2492/3631] Compiling C object drivers/libtmp_rte_crypto_octeontx.a.p/crypto_octeontx_otx_cryptodev_ops.c.o
ninja: build stopped




*Build Failed #2:
OS: UB2204-64
Target: x86_64-native-linuxapp-gcc
FAILED: drivers/libtmp_rte_crypto_openssl.a.p/crypto_openssl_rte_openssl_pmd.c.o 
gcc -Idrivers/libtmp_rte_crypto_openssl.a.p -Idrivers -I../drivers -Idrivers/crypto/openssl -I../drivers/crypto/openssl -Ilib/cryptodev -I../lib/cryptodev -I. -I.. -Iconfig -I../config -Ilib/eal/include -I../lib/eal/include -Ilib/eal/linux/include -I../lib/eal/linux/include -Ilib/eal/x86/include -I../lib/eal/x86/include -Ilib/eal/common -I../lib/eal/common -Ilib/eal -I../lib/eal -Ilib/kvargs -I../lib/kvargs -Ilib/metrics -I../lib/metrics -Ilib/telemetry -I../lib/telemetry -Ilib/mbuf -I../lib/mbuf -Ilib/mempool -I../lib/mempool -Ilib/ring -I../lib/ring -Ilib/rcu -I../lib/rcu -Idrivers/bus/vdev -I../drivers/bus/vdev -fdiagnostics-color=always -D_FILE_OFFSET_BITS=64 -Wall -Winvalid-pch -Wextra -Werror -O3 -include rte_config.h -Wcast-qual -Wdeprecated -Wformat -Wformat-nonliteral -Wformat-security -Wmissing-declarations -Wmissing-prototypes -Wnested-externs -Wold-style-definition -Wpointer-arith -Wsign-compare -Wstrict-prototypes -Wundef -Wwrite-strings -Wno-address-of-packed-member -Wno-packed-not-aligned -Wno-missing-field-initializers -Wno-zero-length-bounds -D_GNU_SOURCE -fPIC -march=native -DALLOW_EXPERIMENTAL_API -DALLOW_INTERNAL_API -Wno-format-truncation -DOPENSSL_API_COMPAT=0x10100000L -DRTE_LOG_DEFAULT_LOGTYPE=pmd.crypto.openssl -MD -MQ drivers/libtmp_rte_crypto_openssl.a.p/crypto_openssl_rte_openssl_pmd.c.o -MF drivers/libtmp_rte_crypto_openssl.a.p/crypto_openssl_rte_openssl_pmd.c.o.d -o drivers/libtmp_rte_crypto_openssl.a.p/crypto_openssl_rte_openssl_pmd.c.o -c ../drivers/crypto/openssl/rte_openssl_pmd.c
In file included from /usr/include/string.h:535,
                 from ../lib/eal/include/rte_uuid.h:19,
                 from ../lib/eal/include/rte_eal.h:21,
                 from ../lib/eal/include/rte_lcore.h:16,
                 from ../lib/eal/include/generic/rte_spinlock.h:21,
                 from ../lib/eal/x86/include/rte_spinlock.h:12,
                 from ../lib/mempool/rte_mempool.h:41,
                 from ../lib/mbuf/rte_mbuf.h:38,
                 from ../lib/cryptodev/rte_crypto.h:20,
                 from ../lib/cryptodev/rte_cryptodev.h:22,
                 from ../drivers/crypto/openssl/rte_openssl_pmd.c:7:
In function ‘memcpy’,
    inlined from ‘openssl_set_session_auth_parameters’ at ../drivers/crypto/openssl/rte_openssl_pmd.c:653:3,
    inlined from ‘openssl_set_session_parameters’ at ../drivers/crypto/openssl/rte_openssl_pmd.c:780:9:
/usr/include/x86_64-linux-gnu/bits/string_fortified.h:29:10: error: ‘__builtin_memcpy’ forming offset [4, 8] is out of the bounds [0, 4] [-Werror=array-bounds]
   29 |   return __builtin___memcpy_chk (__dest, __src, __len,
      |          ^~~~~~~~~~~~~~~~~~~~~~~~~~~~~~~~~~~~~~~~~~~~~
   30 |                                  __glibc_objsize0 (__dest));
      |                                  ~~~~~~~~~~~~~~~~~~~~~~~~~~
cc1: all warnings being treated as errors
[2475/3631] Compiling C object drivers/libtmp_rte_crypto_scheduler.a.p/crypto_scheduler_scheduler_pmd_ops.c.o
[2476/3631] Linking target drivers/librte_crypto_cnxk.so.22.2
[2477/3631] Compiling C object drivers/libtmp_rte_crypto_virtio.a.p/crypto_virtio_virtio_pci.c.o
[2478/3631] Compiling C object drivers/libtmp_rte_crypto_virtio.a.p/crypto_virtio_virtio_rxtx.c.o
[2479/3631] Compiling C object drivers/libtmp_rte_crypto_virtio.a.p/crypto_virtio_virtqueue.c.o
[2480/3631] Compiling C object drivers/libtmp_rte_crypto_scheduler.a.p/crypto_scheduler_scheduler_multicore.c.o
[2481/3631] Generating symbol file drivers/librte_crypto_dpaa2_sec.so.22.2.p/librte_crypto_dpaa2_sec.so.22.2.symbols
[2482/3631] Compiling C object drivers/libtmp_rte_crypto_virtio.a.p/crypto_virtio_virtio_cryptodev.c.o
[2483/3631] Compiling C object drivers/libtmp_rte_crypto_octeontx.a.p/crypto_octeontx_otx_cryptodev_ops.c.o
ninja: build stopped




*Build Failed #3:
OS: UB2204-64
Target: x86_64-native-linuxapp-doc
FAILED: drivers/libtmp_rte_crypto_openssl.a.p/crypto_openssl_rte_openssl_pmd.c.o 
gcc -Idrivers/libtmp_rte_crypto_openssl.a.p -Idrivers -I../drivers -Idrivers/crypto/openssl -I../drivers/crypto/openssl -Ilib/cryptodev -I../lib/cryptodev -I. -I.. -Iconfig -I../config -Ilib/eal/include -I../lib/eal/include -Ilib/eal/linux/include -I../lib/eal/linux/include -Ilib/eal/x86/include -I../lib/eal/x86/include -Ilib/eal/common -I../lib/eal/common -Ilib/eal -I../lib/eal -Ilib/kvargs -I../lib/kvargs -Ilib/metrics -I../lib/metrics -Ilib/telemetry -I../lib/telemetry -Ilib/mbuf -I../lib/mbuf -Ilib/mempool -I../lib/mempool -Ilib/ring -I../lib/ring -Ilib/rcu -I../lib/rcu -Idrivers/bus/vdev -I../drivers/bus/vdev -fdiagnostics-color=always -D_FILE_OFFSET_BITS=64 -Wall -Winvalid-pch -Wextra -Werror -O3 -include rte_config.h -Wcast-qual -Wdeprecated -Wformat -Wformat-nonliteral -Wformat-security -Wmissing-declarations -Wmissing-prototypes -Wnested-externs -Wold-style-definition -Wpointer-arith -Wsign-compare -Wstrict-prototypes -Wundef -Wwrite-strings -Wno-address-of-packed-member -Wno-packed-not-aligned -Wno-missing-field-initializers -Wno-zero-length-bounds -D_GNU_SOURCE -fPIC -march=native -DALLOW_EXPERIMENTAL_API -DALLOW_INTERNAL_API -Wno-format-truncation -DOPENSSL_API_COMPAT=0x10100000L -DRTE_LOG_DEFAULT_LOGTYPE=pmd.crypto.openssl -MD -MQ drivers/libtmp_rte_crypto_openssl.a.p/crypto_openssl_rte_openssl_pmd.c.o -MF drivers/libtmp_rte_crypto_openssl.a.p/crypto_openssl_rte_openssl_pmd.c.o.d -o drivers/libtmp_rte_crypto_openssl.a.p/crypto_openssl_rte_openssl_pmd.c.o -c ../drivers/crypto/openssl/rte_openssl_pmd.c
In file included from /usr/include/string.h:535,
                 from ../lib/eal/include/rte_uuid.h:19,
                 from ../lib/eal/include/rte_eal.h:21,
                 from ../lib/eal/include/rte_lcore.h:16,
                 from ../lib/eal/include/generic/rte_spinlock.h:21,
                 from ../lib/eal/x86/include/rte_spinlock.h:12,
                 from ../lib/mempool/rte_mempool.h:41,
                 from ../lib/mbuf/rte_mbuf.h:38,
                 from ../lib/cryptodev/rte_crypto.h:20,
                 from ../lib/cryptodev/rte_cryptodev.h:22,
                 from ../drivers/crypto/openssl/rte_openssl_pmd.c:7:
In function ‘memcpy’,
    inlined from ‘openssl_set_session_auth_parameters’ at ../drivers/crypto/openssl/rte_openssl_pmd.c:653:3,
    inlined from ‘openssl_set_session_parameters’ at ../drivers/crypto/openssl/rte_openssl_pmd.c:780:9:
/usr/include/x86_64-linux-gnu/bits/string_fortified.h:29:10: error: ‘__builtin_memcpy’ forming offset [4, 8] is out of the bounds [0, 4] [-Werror=array-bounds]
   29 |   return __builtin___memcpy_chk (__dest, __src, __len,
      |          ^~~~~~~~~~~~~~~~~~~~~~~~~~~~~~~~~~~~~~~~~~~~~
   30 |                                  __glibc_objsize0 (__dest));
      |                                  ~~~~~~~~~~~~~~~~~~~~~~~~~~
cc1: all warnings being treated as errors
[2481/3460] Compiling C object drivers/libtmp_rte_crypto_virtio.a.p/crypto_virtio_virtio_cryptodev.c.o
[2482/3460] Compiling C object drivers/libtmp_rte_crypto_virtio.a.p/crypto_virtio_virtqueue.c.o
[2483/3460] Generating symbol file drivers/librte_crypto_dpaa2_sec.so.22.2.p/librte_crypto_dpaa2_sec.so.22.2.symbols
[2484/3460] Compiling C object drivers/libtmp_rte_crypto_virtio.a.p/crypto_virtio_virtio_pci.c.o
[2485/3460] Compiling C object drivers/libtmp_rte_crypto_virtio.a.p/crypto_virtio_virtio_rxtx.c.o
[2486/3460] Compiling C object drivers/libtmp_rte_compress_isal.a.p/compress_isal_isal_compress_pmd_ops.c.o
[2487/3460] Compiling C object drivers/libtmp_rte_crypto_scheduler.a.p/crypto_scheduler_scheduler_multicore.c.o
[2488/3460] Compiling C object drivers/libtmp_rte_compress_isal.a.p/compress_isal_isal_compress_pmd.c.o
[2489/3460] Compiling C object drivers/libtmp_rte_crypto_octeontx.a.p/crypto_octeontx_otx_cryptodev_ops.c.o
ninja: build stopped


DPDK STV team

^ permalink raw reply	[flat|nested] only message in thread

only message in thread, other threads:[~2022-05-13 10:21 UTC | newest]

Thread overview: (only message) (download: mbox.gz / follow: Atom feed)
-- links below jump to the message on this page --
2022-05-13 10:20 [dpdk-test-report] |FAILURE| pw(108357) sid(21894) job(PER_PATCH_BUILD2385)[v6] crypto/openssl: openssl 3.0 support on sym crypto routine sys_stv

automatic DPDK test reports

This inbox may be cloned and mirrored by anyone:

	git clone --mirror http://inbox.dpdk.org/test-report/0 test-report/git/0.git

	# If you have public-inbox 1.1+ installed, you may
	# initialize and index your mirror using the following commands:
	public-inbox-init -V2 test-report test-report/ http://inbox.dpdk.org/test-report \
		test-report@dpdk.org
	public-inbox-index test-report

Example config snippet for mirrors.
Newsgroup available over NNTP:
	nntp://inbox.dpdk.org/inbox.dpdk.test-report


AGPL code for this site: git clone https://public-inbox.org/public-inbox.git