automatic DPDK test reports
 help / color / mirror / Atom feed
* [dpdk-test-report] |FAILURE| pw(111134) sid(22929) job(PER_PATCH_BUILD2391)[v2, 6/6] examples/ipsec-secgw: cleanup worker state before exit
@ 2022-05-13 22:25 sys_stv
  0 siblings, 0 replies; only message in thread
From: sys_stv @ 2022-05-13 22:25 UTC (permalink / raw)
  To: test-report, pbhagavatula

[-- Attachment #1: Type: text/plain, Size: 33065 bytes --]


Test-Label: Intel-compilation
Test-Status: FAILURE
http://dpdk.org/patch/111134

_Compilation issues_

Submitter: Pavan Nikhilesh Bhagavatula <pbhagavatula@marvell.com>
Date: 2022-05-13 16:07:19
Reply_mail: <20220513160719.10558-6-pbhagavatula@marvell.com>

DPDK git baseline: Repo:dpdk-next-eventdev, CommitID: ce8be2eff5edfdf3422a9aacd60593f74f72dcd8


Meson Build Summary: 23 Builds Done, 22 Successful, 1 Failures, 0 Blocked

+--------------+------------+--------------+------------+------------+-----------+----------+------------+
| os           | gcc-static | clang-static | icc-static | gcc-shared | gcc-debug | document | gcc-16byte |
+--------------+------------+--------------+------------+------------+-----------+----------+------------+
| FC35-64      | pass       | pass         |            |            |           |          |            |
| FreeBSD13-64 | pass       | pass         |            | pass       | pass      |          |            |
| RHEL84-64    | pass       | pass         |            | pass       | pass      |          |            |
| SUSE15-64    | pass       | pass         |            |            |           |          |            |
| UB2004-32    | pass       |              |            |            |           |          |            |
| UB2004-64    | pass       | pass         |            |            |           | fail     |            |
| UB2204-32    | pass       |              |            |            |           |          |            |
| UB2204-64    | pass       | pass         |            |            |           | pass     | pass       |
| RHEL85-64    | pass       |              |            |            |           |          |            |
| CentOS7.9-64 | pass       |              |            |            |           |          |            |
+--------------+------------+--------------+------------+------------+-----------+----------+------------+

Comments: 
Because of DPDK bug (https://bugs.dpdk.org/show_bug.cgi?id=928),
All the dpdk-next-* branch add `Ddisable_drivers=event/cnxk` option when build with ICC complier. 
 
Test environment and configuration as below:


OS: FC35-64
	Kernel Version: 5.14.16-301.fc35.x86_64
	GCC Version: gcc (GCC) 11.2.1 20210728 (Red Hat 11.2.1-1)
	Clang Version: 13.0.0 (Fedora 13.0.0~rc1-1.fc35)
	x86_64-native-linuxapp-gcc
	x86_64-native-linuxapp-clang

OS: FreeBSD13-64
	Kernel Version: 13.0-RELEASE
	GCC Version: gcc (FreeBSD Ports Collection) 10.3.0
	Clang Version: 11.0.1 (git@github.com:llvm/llvm-project.git llvmorg-11.0.1-0-g43ff75f2c3fe)
	x86_64-native-bsdapp-gcc
	x86_64-native-bsdapp-clang
	x86_64-native-bsdapp-gcc+shared
	x86_64-native-bsdapp-gcc+debug

OS: RHEL84-64
	Kernel Version: 4.18.0-348.7.1.el8_5.x86_64
	GCC Version: gcc (GCC) 8.5.0 20210514 (Red Hat 8.5.0-4)
	Clang Version: 12.0.1 (Red Hat 12.0.1-4.module_el8.5.0+1025+93159d6c)
	x86_64-native-linuxapp-gcc
	x86_64-native-linuxapp-clang
	x86_64-native-linuxapp-gcc+shared
	x86_64-native-linuxapp-gcc+debug

OS: SUSE15-64
	Kernel Version: 5.3.18-57-default
	GCC Version: gcc (SUSE Linux) 7.5.0
	Clang Version: 11.0.1
	x86_64-native-linuxapp-clang
	x86_64-native-linuxapp-gcc

OS: UB2004-32
	Kernel Version: 5.8.0-48-generic
	GCC Version: gcc (Ubuntu 10.3.0-1ubuntu1~20.04) 10.3.0
	Clang Version: 10.0.0-4ubuntu1
	i686-native-linuxapp-gcc

OS: UB2004-64
	Kernel Version: 5.8.0-48-generic
	GCC Version: gcc (Ubuntu 10.3.0-1ubuntu1~20.04) 10.3.0
	Clang Version: 10.0.0-4ubuntu1
	x86_64-native-linuxapp-clang
	x86_64-native-linuxapp-gcc
	x86_64-native-linuxapp-doc

OS: UB2204-32
	Kernel Version: 5.15.0-25-generic
	GCC Version: gcc (Ubuntu 11.2.0-19ubuntu1) 11.2.0
	Clang Version: NA
	i686-native-linuxapp-gcc

OS: UB2204-64
	Kernel Version: 5.15.0-25-generic
	GCC Version: gcc (Ubuntu 11.2.0-19ubuntu1) 11.2.0
	Clang Version: 14.0.0-1ubuntu1
	x86_64-native-linuxapp-gcc+16byte
	x86_64-native-linuxapp-gcc
	x86_64-native-linuxapp-clang
	x86_64-native-linuxapp-doc

OS: RHEL85-64
	Kernel Version: 4.18.0-348.7.1.el8_5.x86_64
	GCC Version: gcc (GCC) 8.5.0 20210514 (Red Hat 8.5.0-4)
	Clang Version: 12.0.1 (Red Hat 12.0.1-4.module_el8.5.0+1025+93159d6c)
	ICC Version: 19.1.3.304 (gcc version 8.5.0 compatibility)
	x86_64-native-linuxapp-gcc

OS: CentOS7.9-64
	Kernel Version: 3.10.0-1160.el7.x86_64
	GCC Version: gcc (GCC) 4.8.5 20150623 (Red Hat 4.8.5-44)
	Clang Version: 3.4.2 (tags/RELEASE_34/dot2-final)
	x86_64-native-linuxapp-gcc



*Build Failed #1:
OS: UB2004-64
Target: x86_64-native-linuxapp-doc
FAILED: drivers/libtmp_rte_event_cnxk.a.p/event_cnxk_tx_cn9k_tx_0_15_dual_seg.c.o 
gcc -Idrivers/libtmp_rte_event_cnxk.a.p -Idrivers -I../drivers -Idrivers/event/cnxk -I../drivers/event/cnxk -Ilib/eventdev -I../lib/eventdev -I. -I.. -Iconfig -I../config -Ilib/eal/include -I../lib/eal/include -Ilib/eal/linux/include -I../lib/eal/linux/include -Ilib/eal/x86/include -I../lib/eal/x86/include -Ilib/eal/common -I../lib/eal/common -Ilib/eal -I../lib/eal -Ilib/kvargs -I../lib/kvargs -Ilib/metrics -I../lib/metrics -Ilib/telemetry -I../lib/telemetry -Ilib/ring -I../lib/ring -Ilib/ethdev -I../lib/ethdev -Ilib/net -I../lib/net -Ilib/mbuf -I../lib/mbuf -Ilib/mempool -I../lib/mempool -Ilib/meter -I../lib/meter -Ilib/hash -I../lib/hash -Ilib/rcu -I../lib/rcu -Ilib/timer -I../lib/timer -Ilib/cryptodev -I../lib/cryptodev -Idrivers/bus/pci -I../drivers/bus/pci -I../drivers/bus/pci/linux -Ilib/pci -I../lib/pci -Idrivers/common/cnxk -I../drivers/common/cnxk -Ilib/security -I../lib/security -Idrivers/net/cnxk -I../drivers/net/cnxk -Idrivers/bus/vdev -I../drivers/bus/vdev -Idrivers/mempool/cnxk -I../drivers/mempool/cnxk -Idrivers/crypto/cnxk -I../drivers/crypto/cnxk -fdiagnostics-color=always -D_FILE_OFFSET_BITS=64 -Wall -Winvalid-pch -Wextra -Werror -O3 -include rte_config.h -Wcast-qual -Wdeprecated -Wformat -Wformat-nonliteral -Wformat-security -Wmissing-declarations -Wmissing-prototypes -Wnested-externs -Wold-style-definition -Wpointer-arith -Wsign-compare -Wstrict-prototypes -Wundef -Wwrite-strings -Wno-address-of-packed-member -Wno-packed-not-aligned -Wno-missing-field-initializers -Wno-zero-length-bounds -D_GNU_SOURCE -fPIC -march=native -DALLOW_EXPERIMENTAL_API -DALLOW_INTERNAL_API -Wno-format-truncation -flax-vector-conversions -Wno-strict-aliasing -DRTE_LOG_DEFAULT_LOGTYPE=pmd.event.cnxk -MD -MQ drivers/libtmp_rte_event_cnxk.a.p/event_cnxk_tx_cn9k_tx_0_15_dual_seg.c.o -MF drivers/libtmp_rte_event_cnxk.a.p/event_cnxk_tx_cn9k_tx_0_15_dual_seg.c.o.d -o drivers/libtmp_rte_event_cnxk.a.p/event_cnxk_tx_cn9k_tx_0_15_dual_seg.c.o -c ../drivers/event/cnxk/tx/cn9k/tx_0_15_dual_seg.c
In file included from ../drivers/net/cnxk/cnxk_ethdev.h:23,
                 from ../drivers/event/cnxk/cn9k_worker.h:11,
                 from ../drivers/event/cnxk/tx/cn9k/tx_0_15_dual_seg.c:5:
../drivers/common/cnxk/roc_api.h:38:10: fatal error: hw/npa.h: No such file or directory
compilation terminated.
[2792/3383] Compiling C object drivers/libtmp_rte_event_cnxk.a.p/event_cnxk_tx_cn9k_tx_80_95_dual.c.o
FAILED: drivers/libtmp_rte_event_cnxk.a.p/event_cnxk_tx_cn9k_tx_80_95_dual.c.o 
gcc -Idrivers/libtmp_rte_event_cnxk.a.p -Idrivers -I../drivers -Idrivers/event/cnxk -I../drivers/event/cnxk -Ilib/eventdev -I../lib/eventdev -I. -I.. -Iconfig -I../config -Ilib/eal/include -I../lib/eal/include -Ilib/eal/linux/include -I../lib/eal/linux/include -Ilib/eal/x86/include -I../lib/eal/x86/include -Ilib/eal/common -I../lib/eal/common -Ilib/eal -I../lib/eal -Ilib/kvargs -I../lib/kvargs -Ilib/metrics -I../lib/metrics -Ilib/telemetry -I../lib/telemetry -Ilib/ring -I../lib/ring -Ilib/ethdev -I../lib/ethdev -Ilib/net -I../lib/net -Ilib/mbuf -I../lib/mbuf -Ilib/mempool -I../lib/mempool -Ilib/meter -I../lib/meter -Ilib/hash -I../lib/hash -Ilib/rcu -I../lib/rcu -Ilib/timer -I../lib/timer -Ilib/cryptodev -I../lib/cryptodev -Idrivers/bus/pci -I../drivers/bus/pci -I../drivers/bus/pci/linux -Ilib/pci -I../lib/pci -Idrivers/common/cnxk -I../drivers/common/cnxk -Ilib/security -I../lib/security -Idrivers/net/cnxk -I../drivers/net/cnxk -Idrivers/bus/vdev -I../drivers/bus/vdev -Idrivers/mempool/cnxk -I../drivers/mempool/cnxk -Idrivers/crypto/cnxk -I../drivers/crypto/cnxk -fdiagnostics-color=always -D_FILE_OFFSET_BITS=64 -Wall -Winvalid-pch -Wextra -Werror -O3 -include rte_config.h -Wcast-qual -Wdeprecated -Wformat -Wformat-nonliteral -Wformat-security -Wmissing-declarations -Wmissing-prototypes -Wnested-externs -Wold-style-definition -Wpointer-arith -Wsign-compare -Wstrict-prototypes -Wundef -Wwrite-strings -Wno-address-of-packed-member -Wno-packed-not-aligned -Wno-missing-field-initializers -Wno-zero-length-bounds -D_GNU_SOURCE -fPIC -march=native -DALLOW_EXPERIMENTAL_API -DALLOW_INTERNAL_API -Wno-format-truncation -flax-vector-conversions -Wno-strict-aliasing -DRTE_LOG_DEFAULT_LOGTYPE=pmd.event.cnxk -MD -MQ drivers/libtmp_rte_event_cnxk.a.p/event_cnxk_tx_cn9k_tx_80_95_dual.c.o -MF drivers/libtmp_rte_event_cnxk.a.p/event_cnxk_tx_cn9k_tx_80_95_dual.c.o.d -o drivers/libtmp_rte_event_cnxk.a.p/event_cnxk_tx_cn9k_tx_80_95_dual.c.o -c ../drivers/event/cnxk/tx/cn9k/tx_80_95_dual.c
In file included from ../drivers/event/cnxk/tx/cn9k/tx_80_95_dual.c:5:
../drivers/event/cnxk/cn9k_worker.h:891:10: fatal error: opening dependency file drivers/libtmp_rte_event_cnxk.a.p/event_cnxk_tx_cn9k_tx_80_95_dual.c.o.d: No such file or directory
  891 |   struct cn9k_sso_hws_dual *ws = port;                           \
      |          ^~~~~~~~~~~~~~~~~
../drivers/event/cnxk/tx/cn9k/tx_80_95_dual.c:8:2: note: in expansion of macro ‘SSO_DUAL_TX’
../drivers/net/cnxk/cn9k_tx.h:2033:2: note: in expansion of macro ‘T’
 2033 |  T(sec_tso_noff_vlan_ol3ol4csum_l3l4csum, 6,                            \
      |  ^
../drivers/event/cnxk/tx/cn9k/tx_80_95_dual.c:10:1: note: in expansion of macro ‘NIX_TX_FASTPATH_MODES_80_95’
compilation terminated.
[2793/3383] Compiling C object drivers/libtmp_rte_event_cnxk.a.p/event_cnxk_tx_cn9k_tx_32_47_dual.c.o
FAILED: drivers/libtmp_rte_event_cnxk.a.p/event_cnxk_tx_cn9k_tx_32_47_dual.c.o 
gcc -Idrivers/libtmp_rte_event_cnxk.a.p -Idrivers -I../drivers -Idrivers/event/cnxk -I../drivers/event/cnxk -Ilib/eventdev -I../lib/eventdev -I. -I.. -Iconfig -I../config -Ilib/eal/include -I../lib/eal/include -Ilib/eal/linux/include -I../lib/eal/linux/include -Ilib/eal/x86/include -I../lib/eal/x86/include -Ilib/eal/common -I../lib/eal/common -Ilib/eal -I../lib/eal -Ilib/kvargs -I../lib/kvargs -Ilib/metrics -I../lib/metrics -Ilib/telemetry -I../lib/telemetry -Ilib/ring -I../lib/ring -Ilib/ethdev -I../lib/ethdev -Ilib/net -I../lib/net -Ilib/mbuf -I../lib/mbuf -Ilib/mempool -I../lib/mempool -Ilib/meter -I../lib/meter -Ilib/hash -I../lib/hash -Ilib/rcu -I../lib/rcu -Ilib/timer -I../lib/timer -Ilib/cryptodev -I../lib/cryptodev -Idrivers/bus/pci -I../drivers/bus/pci -I../drivers/bus/pci/linux -Ilib/pci -I../lib/pci -Idrivers/common/cnxk -I../drivers/common/cnxk -Ilib/security -I../lib/security -Idrivers/net/cnxk -I../drivers/net/cnxk -Idrivers/bus/vdev -I../drivers/bus/vdev -Idrivers/mempool/cnxk -I../drivers/mempool/cnxk -Idrivers/crypto/cnxk -I../drivers/crypto/cnxk -fdiagnostics-color=always -D_FILE_OFFSET_BITS=64 -Wall -Winvalid-pch -Wextra -Werror -O3 -include rte_config.h -Wcast-qual -Wdeprecated -Wformat -Wformat-nonliteral -Wformat-security -Wmissing-declarations -Wmissing-prototypes -Wnested-externs -Wold-style-definition -Wpointer-arith -Wsign-compare -Wstrict-prototypes -Wundef -Wwrite-strings -Wno-address-of-packed-member -Wno-packed-not-aligned -Wno-missing-field-initializers -Wno-zero-length-bounds -D_GNU_SOURCE -fPIC -march=native -DALLOW_EXPERIMENTAL_API -DALLOW_INTERNAL_API -Wno-format-truncation -flax-vector-conversions -Wno-strict-aliasing -DRTE_LOG_DEFAULT_LOGTYPE=pmd.event.cnxk -MD -MQ drivers/libtmp_rte_event_cnxk.a.p/event_cnxk_tx_cn9k_tx_32_47_dual.c.o -MF drivers/libtmp_rte_event_cnxk.a.p/event_cnxk_tx_cn9k_tx_32_47_dual.c.o.d -o drivers/libtmp_rte_event_cnxk.a.p/event_cnxk_tx_cn9k_tx_32_47_dual.c.o -c ../drivers/event/cnxk/tx/cn9k/tx_32_47_dual.c
In file included from ../drivers/event/cnxk/tx/cn9k/tx_32_47_dual.c:5:
../drivers/event/cnxk/cn9k_worker.h:891:10: fatal error: opening dependency file drivers/libtmp_rte_event_cnxk.a.p/event_cnxk_tx_cn9k_tx_32_47_dual.c.o.d: No such file or directory
  891 |   struct cn9k_sso_hws_dual *ws = port;                           \
      |          ^~~~~~~~~~~~~~~~~
../drivers/event/cnxk/tx/cn9k/tx_32_47_dual.c:8:2: note: in expansion of macro ‘SSO_DUAL_TX’
../drivers/net/cnxk/cn9k_tx.h:1963:2: note: in expansion of macro ‘T’
 1963 |  T(ts_noff_vlan_ol3ol4csum_l3l4csum, 8,                                 \
      |  ^
../drivers/event/cnxk/tx/cn9k/tx_32_47_dual.c:10:1: note: in expansion of macro ‘NIX_TX_FASTPATH_MODES_32_47’
compilation terminated.
[2794/3383] Compiling C object drivers/libtmp_rte_event_cnxk.a.p/event_cnxk_tx_cn9k_tx_16_31_dual_seg.c.o
FAILED: drivers/libtmp_rte_event_cnxk.a.p/event_cnxk_tx_cn9k_tx_16_31_dual_seg.c.o 
gcc -Idrivers/libtmp_rte_event_cnxk.a.p -Idrivers -I../drivers -Idrivers/event/cnxk -I../drivers/event/cnxk -Ilib/eventdev -I../lib/eventdev -I. -I.. -Iconfig -I../config -Ilib/eal/include -I../lib/eal/include -Ilib/eal/linux/include -I../lib/eal/linux/include -Ilib/eal/x86/include -I../lib/eal/x86/include -Ilib/eal/common -I../lib/eal/common -Ilib/eal -I../lib/eal -Ilib/kvargs -I../lib/kvargs -Ilib/metrics -I../lib/metrics -Ilib/telemetry -I../lib/telemetry -Ilib/ring -I../lib/ring -Ilib/ethdev -I../lib/ethdev -Ilib/net -I../lib/net -Ilib/mbuf -I../lib/mbuf -Ilib/mempool -I../lib/mempool -Ilib/meter -I../lib/meter -Ilib/hash -I../lib/hash -Ilib/rcu -I../lib/rcu -Ilib/timer -I../lib/timer -Ilib/cryptodev -I../lib/cryptodev -Idrivers/bus/pci -I../drivers/bus/pci -I../drivers/bus/pci/linux -Ilib/pci -I../lib/pci -Idrivers/common/cnxk -I../drivers/common/cnxk -Ilib/security -I../lib/security -Idrivers/net/cnxk -I../drivers/net/cnxk -Idrivers/bus/vdev -I../drivers/bus/vdev -Idrivers/mempool/cnxk -I../drivers/mempool/cnxk -Idrivers/crypto/cnxk -I../drivers/crypto/cnxk -fdiagnostics-color=always -D_FILE_OFFSET_BITS=64 -Wall -Winvalid-pch -Wextra -Werror -O3 -include rte_config.h -Wcast-qual -Wdeprecated -Wformat -Wformat-nonliteral -Wformat-security -Wmissing-declarations -Wmissing-prototypes -Wnested-externs -Wold-style-definition -Wpointer-arith -Wsign-compare -Wstrict-prototypes -Wundef -Wwrite-strings -Wno-address-of-packed-member -Wno-packed-not-aligned -Wno-missing-field-initializers -Wno-zero-length-bounds -D_GNU_SOURCE -fPIC -march=native -DALLOW_EXPERIMENTAL_API -DALLOW_INTERNAL_API -Wno-format-truncation -flax-vector-conversions -Wno-strict-aliasing -DRTE_LOG_DEFAULT_LOGTYPE=pmd.event.cnxk -MD -MQ drivers/libtmp_rte_event_cnxk.a.p/event_cnxk_tx_cn9k_tx_16_31_dual_seg.c.o -MF drivers/libtmp_rte_event_cnxk.a.p/event_cnxk_tx_cn9k_tx_16_31_dual_seg.c.o.d -o drivers/libtmp_rte_event_cnxk.a.p/event_cnxk_tx_cn9k_tx_16_31_dual_seg.c.o -c ../drivers/event/cnxk/tx/cn9k/tx_16_31_dual_seg.c
In file included from ../lib/eventdev/rte_eventdev.h:216,
                 from ../drivers/event/cnxk/cn9k_worker.h:8,
                 from ../drivers/event/cnxk/tx/cn9k/tx_16_31_dual_seg.c:5:
../lib/mempool/rte_mempool.h:49:10: fatal error: rte_mempool_trace_fp.h: No such file or directory
compilation terminated.
[2795/3383] Compiling C object drivers/libtmp_rte_event_cnxk.a.p/event_cnxk_tx_cn9k_tx_96_111_dual.c.o
FAILED: drivers/libtmp_rte_event_cnxk.a.p/event_cnxk_tx_cn9k_tx_96_111_dual.c.o 
gcc -Idrivers/libtmp_rte_event_cnxk.a.p -Idrivers -I../drivers -Idrivers/event/cnxk -I../drivers/event/cnxk -Ilib/eventdev -I../lib/eventdev -I. -I.. -Iconfig -I../config -Ilib/eal/include -I../lib/eal/include -Ilib/eal/linux/include -I../lib/eal/linux/include -Ilib/eal/x86/include -I../lib/eal/x86/include -Ilib/eal/common -I../lib/eal/common -Ilib/eal -I../lib/eal -Ilib/kvargs -I../lib/kvargs -Ilib/metrics -I../lib/metrics -Ilib/telemetry -I../lib/telemetry -Ilib/ring -I../lib/ring -Ilib/ethdev -I../lib/ethdev -Ilib/net -I../lib/net -Ilib/mbuf -I../lib/mbuf -Ilib/mempool -I../lib/mempool -Ilib/meter -I../lib/meter -Ilib/hash -I../lib/hash -Ilib/rcu -I../lib/rcu -Ilib/timer -I../lib/timer -Ilib/cryptodev -I../lib/cryptodev -Idrivers/bus/pci -I../drivers/bus/pci -I../drivers/bus/pci/linux -Ilib/pci -I../lib/pci -Idrivers/common/cnxk -I../drivers/common/cnxk -Ilib/security -I../lib/security -Idrivers/net/cnxk -I../drivers/net/cnxk -Idrivers/bus/vdev -I../drivers/bus/vdev -Idrivers/mempool/cnxk -I../drivers/mempool/cnxk -Idrivers/crypto/cnxk -I../drivers/crypto/cnxk -fdiagnostics-color=always -D_FILE_OFFSET_BITS=64 -Wall -Winvalid-pch -Wextra -Werror -O3 -include rte_config.h -Wcast-qual -Wdeprecated -Wformat -Wformat-nonliteral -Wformat-security -Wmissing-declarations -Wmissing-prototypes -Wnested-externs -Wold-style-definition -Wpointer-arith -Wsign-compare -Wstrict-prototypes -Wundef -Wwrite-strings -Wno-address-of-packed-member -Wno-packed-not-aligned -Wno-missing-field-initializers -Wno-zero-length-bounds -D_GNU_SOURCE -fPIC -march=native -DALLOW_EXPERIMENTAL_API -DALLOW_INTERNAL_API -Wno-format-truncation -flax-vector-conversions -Wno-strict-aliasing -DRTE_LOG_DEFAULT_LOGTYPE=pmd.event.cnxk -MD -MQ drivers/libtmp_rte_event_cnxk.a.p/event_cnxk_tx_cn9k_tx_96_111_dual.c.o -MF drivers/libtmp_rte_event_cnxk.a.p/event_cnxk_tx_cn9k_tx_96_111_dual.c.o.d -o drivers/libtmp_rte_event_cnxk.a.p/event_cnxk_tx_cn9k_tx_96_111_dual.c.o -c ../drivers/event/cnxk/tx/cn9k/tx_96_111_dual.c
In file included from ../drivers/event/cnxk/tx/cn9k/tx_96_111_dual.c:5:
../drivers/event/cnxk/cn9k_worker.h:891:10: fatal error: opening dependency file drivers/libtmp_rte_event_cnxk.a.p/event_cnxk_tx_cn9k_tx_96_111_dual.c.o.d: No such file or directory
  891 |   struct cn9k_sso_hws_dual *ws = port;                           \
      |          ^~~~~~~~~~~~~~~~~
../drivers/event/cnxk/tx/cn9k/tx_96_111_dual.c:8:2: note: in expansion of macro ‘SSO_DUAL_TX’
../drivers/net/cnxk/cn9k_tx.h:2057:2: note: in expansion of macro ‘T’
 2057 |  T(sec_ts_noff_vlan_ol3ol4csum_l3l4csum, 8,                             \
      |  ^
../drivers/event/cnxk/tx/cn9k/tx_96_111_dual.c:10:1: note: in expansion of macro ‘NIX_TX_FASTPATH_MODES_96_111’
compilation terminated.
[2796/3383] Compiling C object drivers/libtmp_rte_event_cnxk.a.p/event_cnxk_tx_cn9k_tx_80_95_seg.c.o
FAILED: drivers/libtmp_rte_event_cnxk.a.p/event_cnxk_tx_cn9k_tx_80_95_seg.c.o 
gcc -Idrivers/libtmp_rte_event_cnxk.a.p -Idrivers -I../drivers -Idrivers/event/cnxk -I../drivers/event/cnxk -Ilib/eventdev -I../lib/eventdev -I. -I.. -Iconfig -I../config -Ilib/eal/include -I../lib/eal/include -Ilib/eal/linux/include -I../lib/eal/linux/include -Ilib/eal/x86/include -I../lib/eal/x86/include -Ilib/eal/common -I../lib/eal/common -Ilib/eal -I../lib/eal -Ilib/kvargs -I../lib/kvargs -Ilib/metrics -I../lib/metrics -Ilib/telemetry -I../lib/telemetry -Ilib/ring -I../lib/ring -Ilib/ethdev -I../lib/ethdev -Ilib/net -I../lib/net -Ilib/mbuf -I../lib/mbuf -Ilib/mempool -I../lib/mempool -Ilib/meter -I../lib/meter -Ilib/hash -I../lib/hash -Ilib/rcu -I../lib/rcu -Ilib/timer -I../lib/timer -Ilib/cryptodev -I../lib/cryptodev -Idrivers/bus/pci -I../drivers/bus/pci -I../drivers/bus/pci/linux -Ilib/pci -I../lib/pci -Idrivers/common/cnxk -I../drivers/common/cnxk -Ilib/security -I../lib/security -Idrivers/net/cnxk -I../drivers/net/cnxk -Idrivers/bus/vdev -I../drivers/bus/vdev -Idrivers/mempool/cnxk -I../drivers/mempool/cnxk -Idrivers/crypto/cnxk -I../drivers/crypto/cnxk -fdiagnostics-color=always -D_FILE_OFFSET_BITS=64 -Wall -Winvalid-pch -Wextra -Werror -O3 -include rte_config.h -Wcast-qual -Wdeprecated -Wformat -Wformat-nonliteral -Wformat-security -Wmissing-declarations -Wmissing-prototypes -Wnested-externs -Wold-style-definition -Wpointer-arith -Wsign-compare -Wstrict-prototypes -Wundef -Wwrite-strings -Wno-address-of-packed-member -Wno-packed-not-aligned -Wno-missing-field-initializers -Wno-zero-length-bounds -D_GNU_SOURCE -fPIC -march=native -DALLOW_EXPERIMENTAL_API -DALLOW_INTERNAL_API -Wno-format-truncation -flax-vector-conversions -Wno-strict-aliasing -DRTE_LOG_DEFAULT_LOGTYPE=pmd.event.cnxk -MD -MQ drivers/libtmp_rte_event_cnxk.a.p/event_cnxk_tx_cn9k_tx_80_95_seg.c.o -MF drivers/libtmp_rte_event_cnxk.a.p/event_cnxk_tx_cn9k_tx_80_95_seg.c.o.d -o drivers/libtmp_rte_event_cnxk.a.p/event_cnxk_tx_cn9k_tx_80_95_seg.c.o -c ../drivers/event/cnxk/tx/cn9k/tx_80_95_seg.c
In file included from ../drivers/event/cnxk/tx/cn9k/tx_80_95_seg.c:5:
../drivers/event/cnxk/cn9k_worker.h:880:10: fatal error: opening dependency file drivers/libtmp_rte_event_cnxk.a.p/event_cnxk_tx_cn9k_tx_80_95_seg.c.o.d: No such file or directory
  880 |   struct cn9k_sso_hws *ws = port;                                \
      |          ^~~~~~~~~~~~
../drivers/event/cnxk/tx/cn9k/tx_80_95_seg.c:8:2: note: in expansion of macro ‘SSO_TX_SEG’
../drivers/net/cnxk/cn9k_tx.h:2033:2: note: in expansion of macro ‘T’
 2033 |  T(sec_tso_noff_vlan_ol3ol4csum_l3l4csum, 6,                            \
      |  ^
../drivers/event/cnxk/tx/cn9k/tx_80_95_seg.c:10:1: note: in expansion of macro ‘NIX_TX_FASTPATH_MODES_80_95’
compilation terminated.
[2797/3383] Compiling C object drivers/libtmp_rte_event_cnxk.a.p/event_cnxk_tx_cn9k_tx_64_79_dual.c.o
FAILED: drivers/libtmp_rte_event_cnxk.a.p/event_cnxk_tx_cn9k_tx_64_79_dual.c.o 
gcc -Idrivers/libtmp_rte_event_cnxk.a.p -Idrivers -I../drivers -Idrivers/event/cnxk -I../drivers/event/cnxk -Ilib/eventdev -I../lib/eventdev -I. -I.. -Iconfig -I../config -Ilib/eal/include -I../lib/eal/include -Ilib/eal/linux/include -I../lib/eal/linux/include -Ilib/eal/x86/include -I../lib/eal/x86/include -Ilib/eal/common -I../lib/eal/common -Ilib/eal -I../lib/eal -Ilib/kvargs -I../lib/kvargs -Ilib/metrics -I../lib/metrics -Ilib/telemetry -I../lib/telemetry -Ilib/ring -I../lib/ring -Ilib/ethdev -I../lib/ethdev -Ilib/net -I../lib/net -Ilib/mbuf -I../lib/mbuf -Ilib/mempool -I../lib/mempool -Ilib/meter -I../lib/meter -Ilib/hash -I../lib/hash -Ilib/rcu -I../lib/rcu -Ilib/timer -I../lib/timer -Ilib/cryptodev -I../lib/cryptodev -Idrivers/bus/pci -I../drivers/bus/pci -I../drivers/bus/pci/linux -Ilib/pci -I../lib/pci -Idrivers/common/cnxk -I../drivers/common/cnxk -Ilib/security -I../lib/security -Idrivers/net/cnxk -I../drivers/net/cnxk -Idrivers/bus/vdev -I../drivers/bus/vdev -Idrivers/mempool/cnxk -I../drivers/mempool/cnxk -Idrivers/crypto/cnxk -I../drivers/crypto/cnxk -fdiagnostics-color=always -D_FILE_OFFSET_BITS=64 -Wall -Winvalid-pch -Wextra -Werror -O3 -include rte_config.h -Wcast-qual -Wdeprecated -Wformat -Wformat-nonliteral -Wformat-security -Wmissing-declarations -Wmissing-prototypes -Wnested-externs -Wold-style-definition -Wpointer-arith -Wsign-compare -Wstrict-prototypes -Wundef -Wwrite-strings -Wno-address-of-packed-member -Wno-packed-not-aligned -Wno-missing-field-initializers -Wno-zero-length-bounds -D_GNU_SOURCE -fPIC -march=native -DALLOW_EXPERIMENTAL_API -DALLOW_INTERNAL_API -Wno-format-truncation -flax-vector-conversions -Wno-strict-aliasing -DRTE_LOG_DEFAULT_LOGTYPE=pmd.event.cnxk -MD -MQ drivers/libtmp_rte_event_cnxk.a.p/event_cnxk_tx_cn9k_tx_64_79_dual.c.o -MF drivers/libtmp_rte_event_cnxk.a.p/event_cnxk_tx_cn9k_tx_64_79_dual.c.o.d -o drivers/libtmp_rte_event_cnxk.a.p/event_cnxk_tx_cn9k_tx_64_79_dual.c.o -c ../drivers/event/cnxk/tx/cn9k/tx_64_79_dual.c
In file included from ../drivers/event/cnxk/tx/cn9k/tx_64_79_dual.c:5:
../drivers/event/cnxk/cn9k_worker.h:891:10: fatal error: opening dependency file drivers/libtmp_rte_event_cnxk.a.p/event_cnxk_tx_cn9k_tx_64_79_dual.c.o.d: No such file or directory
  891 |   struct cn9k_sso_hws_dual *ws = port;                           \
      |          ^~~~~~~~~~~~~~~~~
../drivers/event/cnxk/tx/cn9k/tx_64_79_dual.c:8:2: note: in expansion of macro ‘SSO_DUAL_TX’
../drivers/net/cnxk/cn9k_tx.h:2009:2: note: in expansion of macro ‘T’
 2009 |  T(sec_noff_vlan_ol3ol4csum_l3l4csum, 6,                                \
      |  ^
../drivers/event/cnxk/tx/cn9k/tx_64_79_dual.c:10:1: note: in expansion of macro ‘NIX_TX_FASTPATH_MODES_64_79’
compilation terminated.
[2798/3383] Compiling C object drivers/libtmp_rte_event_cnxk.a.p/event_cnxk_tx_cn9k_tx_112_127_dual.c.o
FAILED: drivers/libtmp_rte_event_cnxk.a.p/event_cnxk_tx_cn9k_tx_112_127_dual.c.o 
gcc -Idrivers/libtmp_rte_event_cnxk.a.p -Idrivers -I../drivers -Idrivers/event/cnxk -I../drivers/event/cnxk -Ilib/eventdev -I../lib/eventdev -I. -I.. -Iconfig -I../config -Ilib/eal/include -I../lib/eal/include -Ilib/eal/linux/include -I../lib/eal/linux/include -Ilib/eal/x86/include -I../lib/eal/x86/include -Ilib/eal/common -I../lib/eal/common -Ilib/eal -I../lib/eal -Ilib/kvargs -I../lib/kvargs -Ilib/metrics -I../lib/metrics -Ilib/telemetry -I../lib/telemetry -Ilib/ring -I../lib/ring -Ilib/ethdev -I../lib/ethdev -Ilib/net -I../lib/net -Ilib/mbuf -I../lib/mbuf -Ilib/mempool -I../lib/mempool -Ilib/meter -I../lib/meter -Ilib/hash -I../lib/hash -Ilib/rcu -I../lib/rcu -Ilib/timer -I../lib/timer -Ilib/cryptodev -I../lib/cryptodev -Idrivers/bus/pci -I../drivers/bus/pci -I../drivers/bus/pci/linux -Ilib/pci -I../lib/pci -Idrivers/common/cnxk -I../drivers/common/cnxk -Ilib/security -I../lib/security -Idrivers/net/cnxk -I../drivers/net/cnxk -Idrivers/bus/vdev -I../drivers/bus/vdev -Idrivers/mempool/cnxk -I../drivers/mempool/cnxk -Idrivers/crypto/cnxk -I../drivers/crypto/cnxk -fdiagnostics-color=always -D_FILE_OFFSET_BITS=64 -Wall -Winvalid-pch -Wextra -Werror -O3 -include rte_config.h -Wcast-qual -Wdeprecated -Wformat -Wformat-nonliteral -Wformat-security -Wmissing-declarations -Wmissing-prototypes -Wnested-externs -Wold-style-definition -Wpointer-arith -Wsign-compare -Wstrict-prototypes -Wundef -Wwrite-strings -Wno-address-of-packed-member -Wno-packed-not-aligned -Wno-missing-field-initializers -Wno-zero-length-bounds -D_GNU_SOURCE -fPIC -march=native -DALLOW_EXPERIMENTAL_API -DALLOW_INTERNAL_API -Wno-format-truncation -flax-vector-conversions -Wno-strict-aliasing -DRTE_LOG_DEFAULT_LOGTYPE=pmd.event.cnxk -MD -MQ drivers/libtmp_rte_event_cnxk.a.p/event_cnxk_tx_cn9k_tx_112_127_dual.c.o -MF drivers/libtmp_rte_event_cnxk.a.p/event_cnxk_tx_cn9k_tx_112_127_dual.c.o.d -o drivers/libtmp_rte_event_cnxk.a.p/event_cnxk_tx_cn9k_tx_112_127_dual.c.o -c ../drivers/event/cnxk/tx/cn9k/tx_112_127_dual.c
In file included from ../drivers/event/cnxk/tx/cn9k/tx_112_127_dual.c:5:
../drivers/event/cnxk/cn9k_worker.h:891:10: fatal error: opening dependency file drivers/libtmp_rte_event_cnxk.a.p/event_cnxk_tx_cn9k_tx_112_127_dual.c.o.d: No such file or directory
  891 |   struct cn9k_sso_hws_dual *ws = port;                           \
      |          ^~~~~~~~~~~~~~~~~
../drivers/event/cnxk/tx/cn9k/tx_112_127_dual.c:8:2: note: in expansion of macro ‘SSO_DUAL_TX’
../drivers/net/cnxk/cn9k_tx.h:2085:2: note: in expansion of macro ‘T’
 2085 |  T(sec_ts_tso_noff_vlan_ol3ol4csum_l3l4csum, 8,                         \
      |  ^
../drivers/event/cnxk/tx/cn9k/tx_112_127_dual.c:10:1: note: in expansion of macro ‘NIX_TX_FASTPATH_MODES_112_127’
compilation terminated.
[2799/3383] Compiling C object drivers/libtmp_rte_event_cnxk.a.p/event_cnxk_tx_cn9k_tx_96_111_seg.c.o
FAILED: drivers/libtmp_rte_event_cnxk.a.p/event_cnxk_tx_cn9k_tx_96_111_seg.c.o 
gcc -Idrivers/libtmp_rte_event_cnxk.a.p -Idrivers -I../drivers -Idrivers/event/cnxk -I../drivers/event/cnxk -Ilib/eventdev -I../lib/eventdev -I. -I.. -Iconfig -I../config -Ilib/eal/include -I../lib/eal/include -Ilib/eal/linux/include -I../lib/eal/linux/include -Ilib/eal/x86/include -I../lib/eal/x86/include -Ilib/eal/common -I../lib/eal/common -Ilib/eal -I../lib/eal -Ilib/kvargs -I../lib/kvargs -Ilib/metrics -I../lib/metrics -Ilib/telemetry -I../lib/telemetry -Ilib/ring -I../lib/ring -Ilib/ethdev -I../lib/ethdev -Ilib/net -I../lib/net -Ilib/mbuf -I../lib/mbuf -Ilib/mempool -I../lib/mempool -Ilib/meter -I../lib/meter -Ilib/hash -I../lib/hash -Ilib/rcu -I../lib/rcu -Ilib/timer -I../lib/timer -Ilib/cryptodev -I../lib/cryptodev -Idrivers/bus/pci -I../drivers/bus/pci -I../drivers/bus/pci/linux -Ilib/pci -I../lib/pci -Idrivers/common/cnxk -I../drivers/common/cnxk -Ilib/security -I../lib/security -Idrivers/net/cnxk -I../drivers/net/cnxk -Idrivers/bus/vdev -I../drivers/bus/vdev -Idrivers/mempool/cnxk -I../drivers/mempool/cnxk -Idrivers/crypto/cnxk -I../drivers/crypto/cnxk -fdiagnostics-color=always -D_FILE_OFFSET_BITS=64 -Wall -Winvalid-pch -Wextra -Werror -O3 -include rte_config.h -Wcast-qual -Wdeprecated -Wformat -Wformat-nonliteral -Wformat-security -Wmissing-declarations -Wmissing-prototypes -Wnested-externs -Wold-style-definition -Wpointer-arith -Wsign-compare -Wstrict-prototypes -Wundef -Wwrite-strings -Wno-address-of-packed-member -Wno-packed-not-aligned -Wno-missing-field-initializers -Wno-zero-length-bounds -D_GNU_SOURCE -fPIC -march=native -DALLOW_EXPERIMENTAL_API -DALLOW_INTERNAL_API -Wno-format-truncation -flax-vector-conversions -Wno-strict-aliasing -DRTE_LOG_DEFAULT_LOGTYPE=pmd.event.cnxk -MD -MQ drivers/libtmp_rte_event_cnxk.a.p/event_cnxk_tx_cn9k_tx_96_111_seg.c.o -MF drivers/libtmp_rte_event_cnxk.a.p/event_cnxk_tx_cn9k_tx_96_111_seg.c.o.d -o drivers/libtmp_rte_event_cnxk.a.p/event_cnxk_tx_cn9k_tx_96_111_seg.c.o -c ../drivers/event/cnxk/tx/cn9k/tx_96_111_seg.c
In file included from ../drivers/event/cnxk/tx/cn9k/tx_96_111_seg.c:5:
../drivers/event/cnxk/cn9k_worker.h:880:10: fatal error: opening dependency file drivers/libtmp_rte_event_cnxk.a.p/event_cnxk_tx_cn9k_tx_96_111_seg.c.o.d: No such file or directory
  880 |   struct cn9k_sso_hws *ws = port;                                \
      |          ^~~~~~~~~~~~
../drivers/event/cnxk/tx/cn9k/tx_96_111_seg.c:8:2: note: in expansion of macro ‘SSO_TX_SEG’
../drivers/net/cnxk/cn9k_tx.h:2057:2: note: in expansion of macro ‘T’
 2057 |  T(sec_ts_noff_vlan_ol3ol4csum_l3l4csum, 8,                             \
      |  ^
../drivers/event/cnxk/tx/cn9k/tx_96_111_seg.c:10:1: note: in expansion of macro ‘NIX_TX_FASTPATH_MODES_96_111’
compilation terminated.
[2800/3383] Compiling C object drivers/libtmp_rte_event_cnxk.a.p/event_cnxk_tx_cn9k_tx_112_127_seg.c.o
FAILED: drivers/libtmp_rte_event_cnxk.a.p/event_cnxk_tx_cn9k_tx_112_127_seg.c.o 
gcc -Idrivers/libtmp_rte_event_cnxk.a.p -Idrivers -I../drivers -Idrivers/event/cnxk -I../drivers/event/cnxk -Ilib/eventdev -I../lib/eventdev -I. -I.. -Iconfig -I../config -Ilib/eal/include -I../lib/eal/include -Ilib/eal/linux/include -I../lib/eal/linux/include -Ilib/eal/x86/include -I../lib/eal/x86/include -Ilib/eal/common -I../lib/eal/common -Ilib/eal -I../lib/eal -Ilib/kvargs -I../lib/kvargs -Ilib/metrics -I../lib/metrics -Ilib/telemetry -I../lib/telemetry -Ilib/ring -I../lib/ring -Ilib/ethdev -I../lib/ethdev -Ilib/net -I../lib/net -Ilib/mbuf -I../lib/mbuf -Ilib/mempool -I../lib/mempool -Ilib/meter -I../lib/meter -Ilib/hash -I../lib/hash -Ilib/rcu -I../lib/rcu -Ilib/timer -I../lib/timer -Ilib/cryptodev -I../lib/cryptodev -Idrivers/bus/pci -I../drivers/bus/pci -I../drivers/bus/pci/linux -Ilib/pci -I../lib/pci -Idrivers/common/cnxk -I../drivers/common/cnxk -Ilib/security -I../lib/security -Idrivers/net/cnxk -I../drivers/net/cnxk -Idrivers/bus/vdev -I../drivers/bus/vdev -Idrivers/mempool/cnxk -I../drivers/mempool/cnxk -Idrivers/crypto/cnxk -I../drivers/crypto/cnxk -fdiagnostics-color=always -D_FILE_OFFSET_BITS=64 -Wall -Winvalid-pch -Wextra -Werror -O3 -include rte_config.h -Wcast-qual -Wdeprecated -Wformat -Wformat-nonliteral -Wformat-security -Wmissing-declarations -Wmissing-prototypes -Wnested-externs -Wold-style-definition -Wpointer-arith -Wsign-compare -Wstrict-prototypes -Wundef -Wwrite-strings -Wno-address-of-packed-member -Wno-packed-not-aligned -Wno-missing-field-initializers -Wno-zero-length-bounds -D_GNU_SOURCE -fPIC -march=native -DALLOW_EXPERIMENTAL_API -DALLOW_INTERNAL_API -Wno-format-truncation -flax-vector-conversions -Wno-strict-aliasing -DRTE_LOG_DEFAULT_LOGTYPE=pmd.event.cnxk -MD -MQ drivers/libtmp_rte_event_cnxk.a.p/event_cnxk_tx_cn9k_tx_112_127_seg.c.o -MF drivers/libtmp_rte_event_cnxk.a.p/event_cnxk_tx_cn9k_tx_112_127_seg.c.o.d -o drivers/libtmp_rte_event_cnxk.a.p/event_cnxk_tx_cn9k_tx_112_127_seg.c.o -c ../drivers/event/cnxk/tx/cn9k/tx_112_127_seg.c
In file included from ../drivers/event/cnxk/tx/cn9k/tx_112_127_seg.c:5:
../drivers/event/cnxk/cn9k_worker.h:880:10: fatal error: opening dependency file drivers/libtmp_rte_event_cnxk.a.p/event_cnxk_tx_cn9k_tx_112_127_seg.c.o.d: No such file or directory
  880 |   struct cn9k_sso_hws *ws = port;                                \
      |          ^~~~~~~~~~~~
../drivers/event/cnxk/tx/cn9k/tx_112_127_seg.c:8:2: note: in expansion of macro ‘SSO_TX_SEG’
../drivers/net/cnxk/cn9k_tx.h:2085:2: note: in expansion of macro ‘T’
 2085 |  T(sec_ts_tso_noff_vlan_ol3ol4csum_l3l4csum, 8,                         \
      |  ^
../drivers/event/cnxk/tx/cn9k/tx_112_127_seg.c:10:1: note: in expansion of macro ‘NIX_TX_FASTPATH_MODES_112_127’
compilation terminated.
ninja: build stopped


DPDK STV team

^ permalink raw reply	[flat|nested] only message in thread

only message in thread, other threads:[~2022-05-13 22:25 UTC | newest]

Thread overview: (only message) (download: mbox.gz / follow: Atom feed)
-- links below jump to the message on this page --
2022-05-13 22:25 [dpdk-test-report] |FAILURE| pw(111134) sid(22929) job(PER_PATCH_BUILD2391)[v2, 6/6] examples/ipsec-secgw: cleanup worker state before exit sys_stv

automatic DPDK test reports

This inbox may be cloned and mirrored by anyone:

	git clone --mirror http://inbox.dpdk.org/test-report/0 test-report/git/0.git

	# If you have public-inbox 1.1+ installed, you may
	# initialize and index your mirror using the following commands:
	public-inbox-init -V2 test-report test-report/ http://inbox.dpdk.org/test-report \
		test-report@dpdk.org
	public-inbox-index test-report

Example config snippet for mirrors.
Newsgroup available over NNTP:
	nntp://inbox.dpdk.org/inbox.dpdk.test-report


AGPL code for this site: git clone https://public-inbox.org/public-inbox.git