automatic DPDK test reports
 help / color / mirror / Atom feed
From: sys_stv@intel.com
To: test-report@dpdk.org, thomas@monjalon.net
Cc: dpdk_sw_eng@intel.com, npg.sw.core.tools.prc@intel.com
Subject: [dpdk-test-report] |FAILURE| dpdk daily Intel builds
Date: 19 May 2022 21:47:28 -0700
Message-ID: <003cea$hr847b@orsmga008-auth.jf.intel.com> (raw)

[-- Attachment #1: Type: text/plain, Size: 31779 bytes --]


Test-Label: Intel-compilation
Test-Status: FAILURE
_Compilation issues_


commit 26d734b5d280b96f91f00f5e0c6c7eff99facef2
Author: David Marchand <david.marchand@redhat.com>
Date:   Thu Apr 14 13:27:56 2022 +0200

    devargs: fix leak on hotplug failure

DPDK git Repo: dpdk 


Meson Build Summary: 23 Builds Done, 21 Successful, 2 Failures, 0 Blocked

+--------------+------------+--------------+------------+------------+-----------+----------+------------+
| os           | gcc-static | clang-static | icc-static | gcc-shared | gcc-debug | document | gcc-16byte |
+--------------+------------+--------------+------------+------------+-----------+----------+------------+
| FC36-64      |            | pass         |            |            |           |          |            |
| FreeBSD13-64 | pass       | pass         |            | pass       | pass      |          |            |
| RHEL86-64    | pass       | pass         |            | pass       | pass      |          |            |
| SUSE15-64    | pass       | pass         |            |            |           |          |            |
| UB2004-32    | pass       |              |            |            |           |          |            |
| UB2004-64    | pass       | pass         |            |            |           | pass     |            |
| UB2204-32    | pass       |              |            |            |           |          |            |
| UB2204-64N   | pass       |              |            | pass       |           |          |            |
| UB2204-64    | pass       | fail         |            |            |           | fail     | pass       |
| CentOS79-64  | pass       |              |            |            |           |          |            |
+--------------+------------+--------------+------------+------------+-----------+----------+------------+

Comments: 
Because of DPDK bug (https://bugs.dpdk.org/show_bug.cgi?id=928),
All the dpdk-next-* branch add `Ddisable_drivers=event/cnxk` option when build with ICC complier. 
 
Test environment and configuration as below:


OS: FC36-64
	Kernel Version: 5.17.7-300.fc36.x86_64
	GCC Version: gcc (GCC) 12.1.1 20220507 (Red Hat 12.1.1-1)
	Clang Version: 14.0.0 (Fedora 14.0.0-1.fc36)
	x86_64-native-linuxapp-clang

OS: FreeBSD13-64
	Kernel Version: 13.0-RELEASE
	GCC Version: gcc (FreeBSD Ports Collection) 10.3.0
	Clang Version: 11.0.1 (git@github.com:llvm/llvm-project.git llvmorg-11.0.1-0-g43ff75f2c3fe)
	x86_64-native-bsdapp-gcc
	x86_64-native-bsdapp-clang
	x86_64-native-bsdapp-gcc+shared
	x86_64-native-bsdapp-gcc+debug

OS: RHEL86-64
	Kernel Version: 4.18.0-372.9.1.el8.x86_64
	GCC Version: gcc (GCC) 8.5.0 20210514 (Red Hat 8.5.0-13)
	Clang Version: 14.0.0 (Red Hat 14.0.0-1.module_el8.7.0+1142+5343df54)
	x86_64-native-linuxapp-gcc
	x86_64-native-linuxapp-clang
	x86_64-native-linuxapp-gcc+shared
	x86_64-native-linuxapp-gcc+debug

OS: SUSE15-64
	Kernel Version: 5.3.18-57-default
	GCC Version: gcc (SUSE Linux) 7.5.0
	Clang Version: 11.0.1
	x86_64-native-linuxapp-clang
	x86_64-native-linuxapp-gcc

OS: UB2004-32
	Kernel Version: 5.8.0-48-generic
	GCC Version: gcc (Ubuntu 10.3.0-1ubuntu1~20.04) 10.3.0
	Clang Version: 10.0.0-4ubuntu1
	i686-native-linuxapp-gcc

OS: UB2004-64
	Kernel Version: 5.8.0-48-generic
	GCC Version: gcc (Ubuntu 10.3.0-1ubuntu1~20.04) 10.3.0
	Clang Version: 10.0.0-4ubuntu1
	x86_64-native-linuxapp-clang
	x86_64-native-linuxapp-gcc
	x86_64-native-linuxapp-doc

OS: UB2204-32
	Kernel Version: 5.15.0-25-generic
	GCC Version: gcc (Ubuntu 11.2.0-19ubuntu1) 11.2.0
	Clang Version: NA
	i686-native-linuxapp-gcc

OS: UB2204-64N
	Kernel Version: 5.17.5-051705-generic
	GCC Version: gcc (Ubuntu 11.2.0-19ubuntu1) 11.2.0
	Clang Version: 14.0.0-1ubuntu1
	x86_64-native-linuxapp-gcc
	x86_64-native-linuxapp-gcc+shared

OS: UB2204-64
	Kernel Version: 5.15.0-25-generic
	GCC Version: gcc (Ubuntu 11.2.0-19ubuntu1) 11.2.0
	Clang Version: 14.0.0-1ubuntu1
	x86_64-native-linuxapp-gcc+16byte
	x86_64-native-linuxapp-gcc
	x86_64-native-linuxapp-clang
	x86_64-native-linuxapp-doc

OS: CentOS79-64
	Kernel Version: 3.10.0-1160.el7.x86_64
	GCC Version: gcc (GCC) 4.8.5 20150623 (Red Hat 4.8.5-44)
	Clang Version: 3.4.2 (tags/RELEASE_34/dot2-final)
	x86_64-native-linuxapp-gcc



*Build Failed #1:
OS: UB2204-64
Target: x86_64-native-linuxapp-clang
FAILED: drivers/libtmp_rte_common_qat.a.p/crypto_qat_qat_sym_session.c.o 
clang -Idrivers/libtmp_rte_common_qat.a.p -Idrivers -I../drivers -Idrivers/common/qat -I../drivers/common/qat -I../drivers/common/qat/qat_adf -I../drivers/crypto/qat -I../drivers/compress/qat -Idrivers/bus/pci -I../drivers/bus/pci -I../drivers/bus/pci/linux -I. -I.. -Iconfig -I../config -Ilib/eal/include -I../lib/eal/include -Ilib/eal/linux/include -I../lib/eal/linux/include -Ilib/eal/x86/include -I../lib/eal/x86/include -Ilib/eal/common -I../lib/eal/common -Ilib/eal -I../lib/eal -Ilib/kvargs -I../lib/kvargs -Ilib/metrics -I../lib/metrics -Ilib/telemetry -I../lib/telemetry -Ilib/pci -I../lib/pci -Ilib/cryptodev -I../lib/cryptodev -Ilib/mbuf -I../lib/mbuf -Ilib/mempool -I../lib/mempool -Ilib/ring -I../lib/ring -Ilib/rcu -I../lib/rcu -Ilib/net -I../lib/net -Ilib/compressdev -I../lib/compressdev -Ilib/security -I../lib/security -fcolor-diagnostics -D_FILE_OFFSET_BITS=64 -Wall -Winvalid-pch -Wextra -Werror -O3 -include rte_config.h -Wcast-qual -Wdeprecated -Wformat -Wformat-nonliteral -Wformat-security -Wmissing-declarations -Wmissing-prototypes -Wnested-externs -Wold-style-definition -Wpointer-arith -Wsign-compare -Wstrict-prototypes -Wundef -Wwrite-strings -Wno-address-of-packed-member -Wno-missing-field-initializers -D_GNU_SOURCE -fPIC -march=native -DALLOW_EXPERIMENTAL_API -DALLOW_INTERNAL_API -DBUILD_QAT_SYM -DBUILD_QAT_ASYM -DRTE_LOG_DEFAULT_LOGTYPE=pmd.common.qat -MD -MQ drivers/libtmp_rte_common_qat.a.p/crypto_qat_qat_sym_session.c.o -MF drivers/libtmp_rte_common_qat.a.p/crypto_qat_qat_sym_session.c.o.d -o drivers/libtmp_rte_common_qat.a.p/crypto_qat_qat_sym_session.c.o -c ../drivers/crypto/qat/qat_sym_session.c
../drivers/crypto/qat/qat_sym_session.c:1064:7: error: 'SHA1_Init' is deprecated [-Werror,-Wdeprecated-declarations]
        if (!SHA1_Init(&ctx))
             ^
/usr/include/openssl/sha.h:49:1: note: 'SHA1_Init' has been explicitly marked deprecated here
OSSL_DEPRECATEDIN_3_0 int SHA1_Init(SHA_CTX *c);
^
/usr/include/openssl/macros.h:182:49: note: expanded from macro 'OSSL_DEPRECATEDIN_3_0'
#   define OSSL_DEPRECATEDIN_3_0                OSSL_DEPRECATED(3.0)
                                                ^
/usr/include/openssl/macros.h:62:52: note: expanded from macro 'OSSL_DEPRECATED'
#     define OSSL_DEPRECATED(since) __attribute__((deprecated))
                                                   ^
../drivers/crypto/qat/qat_sym_session.c:1066:2: error: 'SHA1_Transform' is deprecated [-Werror,-Wdeprecated-declarations]
        SHA1_Transform(&ctx, data_in);
        ^
/usr/include/openssl/sha.h:52:1: note: 'SHA1_Transform' has been explicitly marked deprecated here
OSSL_DEPRECATEDIN_3_0 void SHA1_Transform(SHA_CTX *c, const unsigned char *data);
^
/usr/include/openssl/macros.h:182:49: note: expanded from macro 'OSSL_DEPRECATEDIN_3_0'
#   define OSSL_DEPRECATEDIN_3_0                OSSL_DEPRECATED(3.0)
                                                ^
/usr/include/openssl/macros.h:62:52: note: expanded from macro 'OSSL_DEPRECATED'
#     define OSSL_DEPRECATED(since) __attribute__((deprecated))
                                                   ^
../drivers/crypto/qat/qat_sym_session.c:1075:7: error: 'SHA224_Init' is deprecated [-Werror,-Wdeprecated-declarations]
        if (!SHA224_Init(&ctx))
             ^
/usr/include/openssl/sha.h:69:1: note: 'SHA224_Init' has been explicitly marked deprecated here
OSSL_DEPRECATEDIN_3_0 int SHA224_Init(SHA256_CTX *c);
^
/usr/include/openssl/macros.h:182:49: note: expanded from macro 'OSSL_DEPRECATEDIN_3_0'
#   define OSSL_DEPRECATEDIN_3_0                OSSL_DEPRECATED(3.0)
                                                ^
/usr/include/openssl/macros.h:62:52: note: expanded from macro 'OSSL_DEPRECATED'
#     define OSSL_DEPRECATED(since) __attribute__((deprecated))
                                                   ^
../drivers/crypto/qat/qat_sym_session.c:1077:2: error: 'SHA256_Transform' is deprecated [-Werror,-Wdeprecated-declarations]
        SHA256_Transform(&ctx, data_in);
        ^
/usr/include/openssl/sha.h:77:1: note: 'SHA256_Transform' has been explicitly marked deprecated here
OSSL_DEPRECATEDIN_3_0 void SHA256_Transform(SHA256_CTX *c,
^
/usr/include/openssl/macros.h:182:49: note: expanded from macro 'OSSL_DEPRECATEDIN_3_0'
#   define OSSL_DEPRECATEDIN_3_0                OSSL_DEPRECATED(3.0)
                                                ^
/usr/include/openssl/macros.h:62:52: note: expanded from macro 'OSSL_DEPRECATED'
#     define OSSL_DEPRECATED(since) __attribute__((deprecated))
                                                   ^
../drivers/crypto/qat/qat_sym_session.c:1086:7: error: 'SHA256_Init' is deprecated [-Werror,-Wdeprecated-declarations]
        if (!SHA256_Init(&ctx))
             ^
/usr/include/openssl/sha.h:73:1: note: 'SHA256_Init' has been explicitly marked deprecated here
OSSL_DEPRECATEDIN_3_0 int SHA256_Init(SHA256_CTX *c);
^
/usr/include/openssl/macros.h:182:49: note: expanded from macro 'OSSL_DEPRECATEDIN_3_0'
#   define OSSL_DEPRECATEDIN_3_0                OSSL_DEPRECATED(3.0)
                                                ^
/usr/include/openssl/macros.h:62:52: note: expanded from macro 'OSSL_DEPRECATED'
#     define OSSL_DEPRECATED(since) __attribute__((deprecated))
                                                   ^
../drivers/crypto/qat/qat_sym_session.c:1088:2: error: 'SHA256_Transform' is deprecated [-Werror,-Wdeprecated-declarations]
        SHA256_Transform(&ctx, data_in);
        ^
/usr/include/openssl/sha.h:77:1: note: 'SHA256_Transform' has been explicitly marked deprecated here
OSSL_DEPRECATEDIN_3_0 void SHA256_Transform(SHA256_CTX *c,
^
/usr/include/openssl/macros.h:182:49: note: expanded from macro 'OSSL_DEPRECATEDIN_3_0'
#   define OSSL_DEPRECATEDIN_3_0                OSSL_DEPRECATED(3.0)
                                                ^
/usr/include/openssl/macros.h:62:52: note: expanded from macro 'OSSL_DEPRECATED'
#     define OSSL_DEPRECATED(since) __attribute__((deprecated))
                                                   ^
../drivers/crypto/qat/qat_sym_session.c:1097:7: error: 'SHA384_Init' is deprecated [-Werror,-Wdeprecated-declarations]
        if (!SHA384_Init(&ctx))
             ^
/usr/include/openssl/sha.h:119:1: note: 'SHA384_Init' has been explicitly marked deprecated here
OSSL_DEPRECATEDIN_3_0 int SHA384_Init(SHA512_CTX *c);
^
/usr/include/openssl/macros.h:182:49: note: expanded from macro 'OSSL_DEPRECATEDIN_3_0'
#   define OSSL_DEPRECATEDIN_3_0                OSSL_DEPRECATED(3.0)
                                                ^
/usr/include/openssl/macros.h:62:52: note: expanded from macro 'OSSL_DEPRECATED'
#     define OSSL_DEPRECATED(since) __attribute__((deprecated))
                                                   ^
../drivers/crypto/qat/qat_sym_session.c:1099:2: error: 'SHA512_Transform' is deprecated [-Werror,-Wdeprecated-declarations]
        SHA512_Transform(&ctx, data_in);
        ^
/usr/include/openssl/sha.h:127:1: note: 'SHA512_Transform' has been explicitly marked deprecated here
OSSL_DEPRECATEDIN_3_0 void SHA512_Transform(SHA512_CTX *c,
^
/usr/include/openssl/macros.h:182:49: note: expanded from macro 'OSSL_DEPRECATEDIN_3_0'
#   define OSSL_DEPRECATEDIN_3_0                OSSL_DEPRECATED(3.0)
                                                ^
/usr/include/openssl/macros.h:62:52: note: expanded from macro 'OSSL_DEPRECATED'
#     define OSSL_DEPRECATED(since) __attribute__((deprecated))
                                                   ^
../drivers/crypto/qat/qat_sym_session.c:1108:7: error: 'SHA512_Init' is deprecated [-Werror,-Wdeprecated-declarations]
        if (!SHA512_Init(&ctx))
             ^
/usr/include/openssl/sha.h:123:1: note: 'SHA512_Init' has been explicitly marked deprecated here
OSSL_DEPRECATEDIN_3_0 int SHA512_Init(SHA512_CTX *c);
^
/usr/include/openssl/macros.h:182:49: note: expanded from macro 'OSSL_DEPRECATEDIN_3_0'
#   define OSSL_DEPRECATEDIN_3_0                OSSL_DEPRECATED(3.0)
                                                ^
/usr/include/openssl/macros.h:62:52: note: expanded from macro 'OSSL_DEPRECATED'
#     define OSSL_DEPRECATED(since) __attribute__((deprecated))
                                                   ^
../drivers/crypto/qat/qat_sym_session.c:1110:2: error: 'SHA512_Transform' is deprecated [-Werror,-Wdeprecated-declarations]
        SHA512_Transform(&ctx, data_in);
        ^
/usr/include/openssl/sha.h:127:1: note: 'SHA512_Transform' has been explicitly marked deprecated here
OSSL_DEPRECATEDIN_3_0 void SHA512_Transform(SHA512_CTX *c,
^
/usr/include/openssl/macros.h:182:49: note: expanded from macro 'OSSL_DEPRECATEDIN_3_0'
#   define OSSL_DEPRECATEDIN_3_0                OSSL_DEPRECATED(3.0)
                                                ^
/usr/include/openssl/macros.h:62:52: note: expanded from macro 'OSSL_DEPRECATED'
#     define OSSL_DEPRECATED(since) __attribute__((deprecated))
                                                   ^
../drivers/crypto/qat/qat_sym_session.c:1119:7: error: 'MD5_Init' is deprecated [-Werror,-Wdeprecated-declarations]
        if (!MD5_Init(&ctx))
             ^
/usr/include/openssl/md5.h:49:1: note: 'MD5_Init' has been explicitly marked deprecated here
OSSL_DEPRECATEDIN_3_0 int MD5_Init(MD5_CTX *c);
^
/usr/include/openssl/macros.h:182:49: note: expanded from macro 'OSSL_DEPRECATEDIN_3_0'
#   define OSSL_DEPRECATEDIN_3_0                OSSL_DEPRECATED(3.0)
                                                ^
/usr/include/openssl/macros.h:62:52: note: expanded from macro 'OSSL_DEPRECATED'
#     define OSSL_DEPRECATED(since) __attribute__((deprecated))
                                                   ^
../drivers/crypto/qat/qat_sym_session.c:1121:2: error: 'MD5_Transform' is deprecated [-Werror,-Wdeprecated-declarations]
        MD5_Transform(&ctx, data_in);
        ^
/usr/include/openssl/md5.h:54:1: note: 'MD5_Transform' has been explicitly marked deprecated here
OSSL_DEPRECATEDIN_3_0 void MD5_Transform(MD5_CTX *c, const unsigned char *b);
^
/usr/include/openssl/macros.h:182:49: note: expanded from macro 'OSSL_DEPRECATEDIN_3_0'
#   define OSSL_DEPRECATEDIN_3_0                OSSL_DEPRECATED(3.0)
                                                ^
/usr/include/openssl/macros.h:62:52: note: expanded from macro 'OSSL_DEPRECATED'
#     define OSSL_DEPRECATED(since) __attribute__((deprecated))
                                                   ^
../drivers/crypto/qat/qat_sym_session.c:1250:8: error: 'AES_set_encrypt_key' is deprecated [-Werror,-Wdeprecated-declarations]
                        if (AES_set_encrypt_key(auth_key, auth_keylen << 3,
                            ^
/usr/include/openssl/aes.h:50:1: note: 'AES_set_encrypt_key' has been explicitly marked deprecated here
OSSL_DEPRECATEDIN_3_0
^
/usr/include/openssl/macros.h:182:49: note: expanded from macro 'OSSL_DEPRECATEDIN_3_0'
#   define OSSL_DEPRECATEDIN_3_0                OSSL_DEPRECATED(3.0)
                                                ^
/usr/include/openssl/macros.h:62:52: note: expanded from macro 'OSSL_DEPRECATED'
#     define OSSL_DEPRECATED(since) __attribute__((deprecated))
                                                   ^
../drivers/crypto/qat/qat_sym_session.c:1256:4: error: 'AES_encrypt' is deprecated [-Werror,-Wdeprecated-declarations]
                        AES_encrypt(in, k0, &enc_key);
                        ^
/usr/include/openssl/aes.h:56:1: note: 'AES_encrypt' has been explicitly marked deprecated here
OSSL_DEPRECATEDIN_3_0
^
/usr/include/openssl/macros.h:182:49: note: expanded from macro 'OSSL_DEPRECATEDIN_3_0'
#   define OSSL_DEPRECATEDIN_3_0                OSSL_DEPRECATED(3.0)
                                                ^
/usr/include/openssl/macros.h:62:52: note: expanded from macro 'OSSL_DEPRECATED'
#     define OSSL_DEPRECATED(since) __attribute__((deprecated))
                                                   ^
../drivers/crypto/qat/qat_sym_session.c:1294:9: error: 'AES_set_encrypt_key' is deprecated [-Werror,-Wdeprecated-declarations]
                                if (AES_set_encrypt_key(auth_key,
                                    ^
/usr/include/openssl/aes.h:50:1: note: 'AES_set_encrypt_key' has been explicitly marked deprecated here
OSSL_DEPRECATEDIN_3_0
^
/usr/include/openssl/macros.h:182:49: note: expanded from macro 'OSSL_DEPRECATEDIN_3_0'
#   define OSSL_DEPRECATEDIN_3_0                OSSL_DEPRECATED(3.0)
                                                ^
/usr/include/openssl/macros.h:62:52: note: expanded from macro 'OSSL_DEPRECATED'
#     define OSSL_DEPRECATED(since) __attribute__((deprecated))
                                                   ^
../drivers/crypto/qat/qat_sym_session.c:1304:5: error: 'AES_encrypt' is deprecated [-Werror,-Wdeprecated-declarations]
                                AES_encrypt(in, out, &enc_key);
                                ^
/usr/include/openssl/aes.h:56:1: note: 'AES_encrypt' has been explicitly marked deprecated here
OSSL_DEPRECATEDIN_3_0
^
/usr/include/openssl/macros.h:182:49: note: expanded from macro 'OSSL_DEPRECATEDIN_3_0'
#   define OSSL_DEPRECATEDIN_3_0                OSSL_DEPRECATED(3.0)
                                                ^
/usr/include/openssl/macros.h:62:52: note: expanded from macro 'OSSL_DEPRECATED'
#     define OSSL_DEPRECATED(since) __attribute__((deprecated))
                                                   ^
../drivers/crypto/qat/qat_sym_session.c:1330:7: error: 'AES_set_encrypt_key' is deprecated [-Werror,-Wdeprecated-declarations]
                if (AES_set_encrypt_key(auth_key, auth_keylen << 3,
                    ^
/usr/include/openssl/aes.h:50:1: note: 'AES_set_encrypt_key' has been explicitly marked deprecated here
OSSL_DEPRECATEDIN_3_0
^
/usr/include/openssl/macros.h:182:49: note: expanded from macro 'OSSL_DEPRECATEDIN_3_0'
#   define OSSL_DEPRECATEDIN_3_0                OSSL_DEPRECATED(3.0)
                                                ^
/usr/include/openssl/macros.h:62:52: note: expanded from macro 'OSSL_DEPRECATED'
#     define OSSL_DEPRECATED(since) __attribute__((deprecated))
                                                   ^
../drivers/crypto/qat/qat_sym_session.c:1334:3: error: 'AES_encrypt' is deprecated [-Werror,-Wdeprecated-declarations]
                AES_encrypt(in, out, &enc_key);
                ^
/usr/include/openssl/aes.h:56:1: note: 'AES_encrypt' has been explicitly marked deprecated here
OSSL_DEPRECATEDIN_3_0
^
/usr/include/openssl/macros.h:182:49: note: expanded from macro 'OSSL_DEPRECATEDIN_3_0'
#   define OSSL_DEPRECATEDIN_3_0                OSSL_DEPRECATED(3.0)
                                                ^
/usr/include/openssl/macros.h:62:52: note: expanded from macro 'OSSL_DEPRECATED'
#     define OSSL_DEPRECATED(since) __attribute__((deprecated))
                                                   ^
18 errors generated.
[846/3615] Compiling C object drivers/libtmp_rte_common_qat.a.p/crypto_qat_dev_qat_crypto_pmd_gen2.c.o
[847/3615] Compiling C object drivers/common/sfc_efx/base/libsfc_base.a.p/efx_hash.c.o
[848/3615] Compiling C object drivers/libtmp_rte_common_qat.a.p/crypto_qat_dev_qat_asym_pmd_gen1.c.o
[849/3615] Compiling C object drivers/common/sfc_efx/base/libsfc_base.a.p/efx_evb.c.o
[850/3615] Compiling C object drivers/libtmp_rte_common_qat.a.p/crypto_qat_dev_qat_crypto_pmd_gen4.c.o
[851/3615] Compiling C object drivers/libtmp_rte_common_qat.a.p/crypto_qat_dev_qat_crypto_pmd_gen3.c.o
[852/3615] Compiling C object drivers/libtmp_rte_common_qat.a.p/crypto_qat_dev_qat_sym_pmd_gen1.c.o
[853/3615] Compiling C object drivers/libtmp_rte_common_qat.a.p/crypto_qat_qat_asym.c.o
[854/3615] Generating drivers/rte_common_cnxk.sym_chk with a custom command (wrapped by meson to capture output)
ninja: build stopped




*Build Failed #2:
OS: UB2204-64
Target: x86_64-native-linuxapp-doc
FAILED: drivers/libtmp_rte_common_qat.a.p/crypto_qat_qat_sym_session.c.o 
gcc -Idrivers/libtmp_rte_common_qat.a.p -Idrivers -I../drivers -Idrivers/common/qat -I../drivers/common/qat -I../drivers/common/qat/qat_adf -I../drivers/crypto/qat -I../drivers/compress/qat -Idrivers/bus/pci -I../drivers/bus/pci -I../drivers/bus/pci/linux -I. -I.. -Iconfig -I../config -Ilib/eal/include -I../lib/eal/include -Ilib/eal/linux/include -I../lib/eal/linux/include -Ilib/eal/x86/include -I../lib/eal/x86/include -Ilib/eal/common -I../lib/eal/common -Ilib/eal -I../lib/eal -Ilib/kvargs -I../lib/kvargs -Ilib/metrics -I../lib/metrics -Ilib/telemetry -I../lib/telemetry -Ilib/pci -I../lib/pci -Ilib/cryptodev -I../lib/cryptodev -Ilib/mbuf -I../lib/mbuf -Ilib/mempool -I../lib/mempool -Ilib/ring -I../lib/ring -Ilib/rcu -I../lib/rcu -Ilib/net -I../lib/net -Ilib/compressdev -I../lib/compressdev -Ilib/security -I../lib/security -fdiagnostics-color=always -D_FILE_OFFSET_BITS=64 -Wall -Winvalid-pch -Wextra -Werror -O3 -include rte_config.h -Wcast-qual -Wdeprecated -Wformat -Wformat-nonliteral -Wformat-security -Wmissing-declarations -Wmissing-prototypes -Wnested-externs -Wold-style-definition -Wpointer-arith -Wsign-compare -Wstrict-prototypes -Wundef -Wwrite-strings -Wno-address-of-packed-member -Wno-packed-not-aligned -Wno-missing-field-initializers -Wno-zero-length-bounds -D_GNU_SOURCE -fPIC -march=native -DALLOW_EXPERIMENTAL_API -DALLOW_INTERNAL_API -Wno-format-truncation -DBUILD_QAT_SYM -DBUILD_QAT_ASYM -DRTE_LOG_DEFAULT_LOGTYPE=pmd.common.qat -MD -MQ drivers/libtmp_rte_common_qat.a.p/crypto_qat_qat_sym_session.c.o -MF drivers/libtmp_rte_common_qat.a.p/crypto_qat_qat_sym_session.c.o.d -o drivers/libtmp_rte_common_qat.a.p/crypto_qat_qat_sym_session.c.o -c ../drivers/crypto/qat/qat_sym_session.c
../drivers/crypto/qat/qat_sym_session.c: In function ‘partial_hash_sha1’:
../drivers/crypto/qat/qat_sym_session.c:1064:9: error: ‘SHA1_Init’ is deprecated: Since OpenSSL 3.0 [-Werror=deprecated-declarations]
 1064 |         if (!SHA1_Init(&ctx))
      |         ^~
In file included from ../drivers/crypto/qat/qat_sym_session.c:5:
/usr/include/openssl/sha.h:49:27: note: declared here
   49 | OSSL_DEPRECATEDIN_3_0 int SHA1_Init(SHA_CTX *c);
      |                           ^~~~~~~~~
../drivers/crypto/qat/qat_sym_session.c:1066:9: error: ‘SHA1_Transform’ is deprecated: Since OpenSSL 3.0 [-Werror=deprecated-declarations]
 1066 |         SHA1_Transform(&ctx, data_in);
      |         ^~~~~~~~~~~~~~
In file included from ../drivers/crypto/qat/qat_sym_session.c:5:
/usr/include/openssl/sha.h:52:28: note: declared here
   52 | OSSL_DEPRECATEDIN_3_0 void SHA1_Transform(SHA_CTX *c, const unsigned char *data);
      |                            ^~~~~~~~~~~~~~
../drivers/crypto/qat/qat_sym_session.c: In function ‘partial_hash_sha224’:
../drivers/crypto/qat/qat_sym_session.c:1075:9: error: ‘SHA224_Init’ is deprecated: Since OpenSSL 3.0 [-Werror=deprecated-declarations]
 1075 |         if (!SHA224_Init(&ctx))
      |         ^~
In file included from ../drivers/crypto/qat/qat_sym_session.c:5:
/usr/include/openssl/sha.h:69:27: note: declared here
   69 | OSSL_DEPRECATEDIN_3_0 int SHA224_Init(SHA256_CTX *c);
      |                           ^~~~~~~~~~~
../drivers/crypto/qat/qat_sym_session.c:1077:9: error: ‘SHA256_Transform’ is deprecated: Since OpenSSL 3.0 [-Werror=deprecated-declarations]
 1077 |         SHA256_Transform(&ctx, data_in);
      |         ^~~~~~~~~~~~~~~~
In file included from ../drivers/crypto/qat/qat_sym_session.c:5:
/usr/include/openssl/sha.h:77:28: note: declared here
   77 | OSSL_DEPRECATEDIN_3_0 void SHA256_Transform(SHA256_CTX *c,
      |                            ^~~~~~~~~~~~~~~~
../drivers/crypto/qat/qat_sym_session.c: In function ‘partial_hash_sha256’:
../drivers/crypto/qat/qat_sym_session.c:1086:9: error: ‘SHA256_Init’ is deprecated: Since OpenSSL 3.0 [-Werror=deprecated-declarations]
 1086 |         if (!SHA256_Init(&ctx))
      |         ^~
In file included from ../drivers/crypto/qat/qat_sym_session.c:5:
/usr/include/openssl/sha.h:73:27: note: declared here
   73 | OSSL_DEPRECATEDIN_3_0 int SHA256_Init(SHA256_CTX *c);
      |                           ^~~~~~~~~~~
../drivers/crypto/qat/qat_sym_session.c:1088:9: error: ‘SHA256_Transform’ is deprecated: Since OpenSSL 3.0 [-Werror=deprecated-declarations]
 1088 |         SHA256_Transform(&ctx, data_in);
      |         ^~~~~~~~~~~~~~~~
In file included from ../drivers/crypto/qat/qat_sym_session.c:5:
/usr/include/openssl/sha.h:77:28: note: declared here
   77 | OSSL_DEPRECATEDIN_3_0 void SHA256_Transform(SHA256_CTX *c,
      |                            ^~~~~~~~~~~~~~~~
../drivers/crypto/qat/qat_sym_session.c: In function ‘partial_hash_sha384’:
../drivers/crypto/qat/qat_sym_session.c:1097:9: error: ‘SHA384_Init’ is deprecated: Since OpenSSL 3.0 [-Werror=deprecated-declarations]
 1097 |         if (!SHA384_Init(&ctx))
      |         ^~
In file included from ../drivers/crypto/qat/qat_sym_session.c:5:
/usr/include/openssl/sha.h:119:27: note: declared here
  119 | OSSL_DEPRECATEDIN_3_0 int SHA384_Init(SHA512_CTX *c);
      |                           ^~~~~~~~~~~
../drivers/crypto/qat/qat_sym_session.c:1099:9: error: ‘SHA512_Transform’ is deprecated: Since OpenSSL 3.0 [-Werror=deprecated-declarations]
 1099 |         SHA512_Transform(&ctx, data_in);
      |         ^~~~~~~~~~~~~~~~
In file included from ../drivers/crypto/qat/qat_sym_session.c:5:
/usr/include/openssl/sha.h:127:28: note: declared here
  127 | OSSL_DEPRECATEDIN_3_0 void SHA512_Transform(SHA512_CTX *c,
      |                            ^~~~~~~~~~~~~~~~
../drivers/crypto/qat/qat_sym_session.c: In function ‘partial_hash_sha512’:
../drivers/crypto/qat/qat_sym_session.c:1108:9: error: ‘SHA512_Init’ is deprecated: Since OpenSSL 3.0 [-Werror=deprecated-declarations]
 1108 |         if (!SHA512_Init(&ctx))
      |         ^~
In file included from ../drivers/crypto/qat/qat_sym_session.c:5:
/usr/include/openssl/sha.h:123:27: note: declared here
  123 | OSSL_DEPRECATEDIN_3_0 int SHA512_Init(SHA512_CTX *c);
      |                           ^~~~~~~~~~~
../drivers/crypto/qat/qat_sym_session.c:1110:9: error: ‘SHA512_Transform’ is deprecated: Since OpenSSL 3.0 [-Werror=deprecated-declarations]
 1110 |         SHA512_Transform(&ctx, data_in);
      |         ^~~~~~~~~~~~~~~~
In file included from ../drivers/crypto/qat/qat_sym_session.c:5:
/usr/include/openssl/sha.h:127:28: note: declared here
  127 | OSSL_DEPRECATEDIN_3_0 void SHA512_Transform(SHA512_CTX *c,
      |                            ^~~~~~~~~~~~~~~~
../drivers/crypto/qat/qat_sym_session.c: In function ‘partial_hash_md5’:
../drivers/crypto/qat/qat_sym_session.c:1119:9: error: ‘MD5_Init’ is deprecated: Since OpenSSL 3.0 [-Werror=deprecated-declarations]
 1119 |         if (!MD5_Init(&ctx))
      |         ^~
In file included from ../drivers/crypto/qat/qat_sym_session.c:7:
/usr/include/openssl/md5.h:49:27: note: declared here
   49 | OSSL_DEPRECATEDIN_3_0 int MD5_Init(MD5_CTX *c);
      |                           ^~~~~~~~
../drivers/crypto/qat/qat_sym_session.c:1121:9: error: ‘MD5_Transform’ is deprecated: Since OpenSSL 3.0 [-Werror=deprecated-declarations]
 1121 |         MD5_Transform(&ctx, data_in);
      |         ^~~~~~~~~~~~~
In file included from ../drivers/crypto/qat/qat_sym_session.c:7:
/usr/include/openssl/md5.h:54:28: note: declared here
   54 | OSSL_DEPRECATEDIN_3_0 void MD5_Transform(MD5_CTX *c, const unsigned char *b);
      |                            ^~~~~~~~~~~~~
../drivers/crypto/qat/qat_sym_session.c: In function ‘qat_sym_do_precomputes’:
../drivers/crypto/qat/qat_sym_session.c:1250:25: error: ‘AES_set_encrypt_key’ is deprecated: Since OpenSSL 3.0 [-Werror=deprecated-declarations]
 1250 |                         if (AES_set_encrypt_key(auth_key, auth_keylen << 3,
      |                         ^~
In file included from ../drivers/crypto/qat/qat_sym_session.c:6:
/usr/include/openssl/aes.h:51:5: note: declared here
   51 | int AES_set_encrypt_key(const unsigned char *userKey, const int bits,
      |     ^~~~~~~~~~~~~~~~~~~
../drivers/crypto/qat/qat_sym_session.c:1256:25: error: ‘AES_encrypt’ is deprecated: Since OpenSSL 3.0 [-Werror=deprecated-declarations]
 1256 |                         AES_encrypt(in, k0, &enc_key);
      |                         ^~~~~~~~~~~
In file included from ../drivers/crypto/qat/qat_sym_session.c:6:
/usr/include/openssl/aes.h:57:6: note: declared here
   57 | void AES_encrypt(const unsigned char *in, unsigned char *out,
      |      ^~~~~~~~~~~
../drivers/crypto/qat/qat_sym_session.c:1294:33: error: ‘AES_set_encrypt_key’ is deprecated: Since OpenSSL 3.0 [-Werror=deprecated-declarations]
 1294 |                                 if (AES_set_encrypt_key(auth_key,
      |                                 ^~
In file included from ../drivers/crypto/qat/qat_sym_session.c:6:
/usr/include/openssl/aes.h:51:5: note: declared here
   51 | int AES_set_encrypt_key(const unsigned char *userKey, const int bits,
      |     ^~~~~~~~~~~~~~~~~~~
../drivers/crypto/qat/qat_sym_session.c:1304:33: error: ‘AES_encrypt’ is deprecated: Since OpenSSL 3.0 [-Werror=deprecated-declarations]
 1304 |                                 AES_encrypt(in, out, &enc_key);
      |                                 ^~~~~~~~~~~
In file included from ../drivers/crypto/qat/qat_sym_session.c:6:
/usr/include/openssl/aes.h:57:6: note: declared here
   57 | void AES_encrypt(const unsigned char *in, unsigned char *out,
      |      ^~~~~~~~~~~
../drivers/crypto/qat/qat_sym_session.c:1330:17: error: ‘AES_set_encrypt_key’ is deprecated: Since OpenSSL 3.0 [-Werror=deprecated-declarations]
 1330 |                 if (AES_set_encrypt_key(auth_key, auth_keylen << 3,
      |                 ^~
In file included from ../drivers/crypto/qat/qat_sym_session.c:6:
/usr/include/openssl/aes.h:51:5: note: declared here
   51 | int AES_set_encrypt_key(const unsigned char *userKey, const int bits,
      |     ^~~~~~~~~~~~~~~~~~~
../drivers/crypto/qat/qat_sym_session.c:1334:17: error: ‘AES_encrypt’ is deprecated: Since OpenSSL 3.0 [-Werror=deprecated-declarations]
 1334 |                 AES_encrypt(in, out, &enc_key);
      |                 ^~~~~~~~~~~
In file included from ../drivers/crypto/qat/qat_sym_session.c:6:
/usr/include/openssl/aes.h:57:6: note: declared here
   57 | void AES_encrypt(const unsigned char *in, unsigned char *out,
      |      ^~~~~~~~~~~
cc1: all warnings being treated as errors
[849/3461] Compiling C object drivers/common/sfc_efx/base/libsfc_base.a.p/efx_evb.c.o
[850/3461] Compiling C object drivers/common/sfc_efx/base/libsfc_base.a.p/efx_filter.c.o
[851/3461] Compiling C object drivers/common/sfc_efx/base/libsfc_base.a.p/efx_ev.c.o
[852/3461] Compiling C object drivers/libtmp_rte_common_qat.a.p/crypto_qat_dev_qat_crypto_pmd_gen4.c.o
[853/3461] Compiling C object drivers/libtmp_rte_common_qat.a.p/crypto_qat_dev_qat_crypto_pmd_gen3.c.o
[854/3461] Compiling C object drivers/libtmp_rte_common_qat.a.p/crypto_qat_dev_qat_sym_pmd_gen1.c.o
[855/3461] Generating lib/pipeline.sym_chk with a custom command (wrapped by meson to capture output)
[856/3461] Compiling C object drivers/libtmp_rte_common_qat.a.p/crypto_qat_qat_asym.c.o
[857/3461] Generating drivers/rte_common_cnxk.sym_chk with a custom command (wrapped by meson to capture output)
ninja: build stopped


DPDK STV team

             reply	other threads:[~2022-05-20  4:47 UTC|newest]

Thread overview: 41+ messages / expand[flat|nested]  mbox.gz  Atom feed  top
2022-05-20  4:47 sys_stv [this message]
  -- strict thread matches above, loose matches on Subject: below --
2022-06-22 21:09 sys_stv
2022-06-09  9:08 sys_stv
2022-06-06  7:26 sys_stv
2022-06-06  2:06 sys_stv
2022-06-01 21:06 sys_stv
2022-06-01  1:57 sys_stv
2022-05-31 21:06 sys_stv
2022-05-30  8:26 sys_stv
2022-05-26  8:57 sys_stv
2022-05-20  5:13 sys_stv
2022-05-18 21:07 sys_stv
2022-05-18 10:08 sys_stv
2022-05-17 21:07 sys_stv
2022-05-17  9:36 sys_stv
2022-05-17  9:15 sys_stv
2022-05-17  8:58 sys_stv
2022-05-16 21:06 sys_stv
2022-05-07  7:26 sys_stv
2022-05-06 21:06 sys_stv
2022-05-06  9:49 sys_stv
2022-05-06  9:32 sys_stv
2022-03-08 21:07 sys_stv
2022-03-08 17:16 sys_stv
2022-01-21  7:59 sys_stv
2022-01-21  7:55 sys_stv
2021-12-18 21:50 sys_stv
2021-10-22 22:14 sys_stv
2021-10-14  3:03 sys_stv
2021-08-15 22:10 sys_stv
2021-06-29 15:39 sys_stv
2021-05-27 22:08 sys_stv
2021-05-07  1:05 sys_stv
2021-03-22 22:07 sys_stv
2021-01-28 22:07 sys_stv
2021-01-27 22:07 sys_stv
2021-01-26 22:08 sys_stv
2021-01-26  6:13 sys_stv
2020-11-05 22:08 sys_stv
2020-11-03 22:07 sys_stv
2020-10-20  5:41 sys_stv

Reply instructions:

You may reply publicly to this message via plain-text email
using any one of the following methods:

* Save the following mbox file, import it into your mail client,
  and reply-to-all from there: mbox

  Avoid top-posting and favor interleaved quoting:
  https://en.wikipedia.org/wiki/Posting_style#Interleaved_style

* Reply using the --to, --cc, and --in-reply-to
  switches of git-send-email(1):

  git send-email \
    --in-reply-to='003cea$hr847b@orsmga008-auth.jf.intel.com' \
    --to=sys_stv@intel.com \
    --cc=dpdk_sw_eng@intel.com \
    --cc=npg.sw.core.tools.prc@intel.com \
    --cc=test-report@dpdk.org \
    --cc=thomas@monjalon.net \
    /path/to/YOUR_REPLY

  https://kernel.org/pub/software/scm/git/docs/git-send-email.html

* If your mail client supports setting the In-Reply-To header
  via mailto: links, try the mailto: link

automatic DPDK test reports

This inbox may be cloned and mirrored by anyone:

	git clone --mirror http://inbox.dpdk.org/test-report/0 test-report/git/0.git

	# If you have public-inbox 1.1+ installed, you may
	# initialize and index your mirror using the following commands:
	public-inbox-init -V2 test-report test-report/ http://inbox.dpdk.org/test-report \
		test-report@dpdk.org
	public-inbox-index test-report

Example config snippet for mirrors.
Newsgroup available over NNTP:
	nntp://inbox.dpdk.org/inbox.dpdk.test-report


AGPL code for this site: git clone https://public-inbox.org/public-inbox.git