* compilation|FAILURE| pw(156308) sid(36056) job(PER_PATCH_BUILD16544)[V6, 17/17] drivers/net: add hinic3 PMD build and doc files
@ 2025-08-30 13:25 sys_stv
0 siblings, 0 replies; only message in thread
From: sys_stv @ 2025-08-30 13:25 UTC (permalink / raw)
To: test-report, wff_light
[-- Attachment #1: Type: text/plain, Size: 16519 bytes --]
Test-Label: Intel-compilation
Test-Status: FAILURE
http://dpdk.org/patch/156308
_Compilation issues_
Submitter: Feifei Wang <wff_light@vip.163.com>
Date: 2025-08-30 12:43:21
Reply_mail: <20250830124332.5351-18-wff_light@vip.163.com>
DPDK git baseline: Repo:dpdk-next-net, CommitID: 4a04a346e7f3aa68b7a272d05c86fec2e7db8e89
Meson Build Summary: 23 Builds Done, 19 Successful, 4 Failures, 0 Blocked
+-------------------+------------+--------------+------------+------------+-----------+----------+------------+
| os | gcc-static | clang-static | icc-static | gcc-shared | gcc-debug | document | gcc-16byte |
+-------------------+------------+--------------+------------+------------+-----------+----------+------------+
| OpenAnolis8.10-64 | pass | | | | | | |
| FreeBSD14-64 | pass | pass | | pass | pass | | |
| RHEL96-64 | pass | fail | | pass | pass | | |
| SUSE15-64 | pass | fail | | | | | |
| AzureLinux3.0-64 | pass | | | | | | |
| UB2404-32 | pass | | | | | | |
| RHEL10-64 | pass | | | | | | |
| UB2404-64 | pass | fail | | | | pass | pass |
| RHEL96-64RT | pass | | | | | | |
| UB2504-64 | pass | | | | | | |
| FC42-64 | pass | fail | | | | | |
| UB2404-64RT | pass | | | | | | |
+-------------------+------------+--------------+------------+------------+-----------+----------+------------+
Comments:
Because of DPDK bug (https://bugs.dpdk.org/show_bug.cgi?id=928),
All the dpdk-next-* branch add `Ddisable_drivers=event/cnxk` option when build with ICC complier.
Test environment and configuration as below:
OS: OpenAnolis8.10-64
Kernel Version: 5.10.134-18.an8.x86_64
GCC Version: gcc (GCC) 8.5.0 20210514 (Anolis 8.5.0-24.0.1)
Clang Version: 18.1.8 (Red Hat 18.1.8-1.0.1.module+an8.9.0+11287+9d0292d3)
x86_64-native-linuxapp-gcc
OS: FreeBSD14-64
Kernel Version: 14.2-RELEASE
GCC Version: gcc (FreeBSD Ports Collection) 13.3.0
Clang Version: 18.1.6 (https://github.com/llvm/llvm-project.git llvmorg-18.1.6-0-g1118c2e05e67)
x86_64-native-bsdapp-gcc
x86_64-native-bsdapp-clang
x86_64-native-bsdapp-gcc+shared
x86_64-native-bsdapp-gcc+debug
OS: RHEL96-64
Kernel Version: 5.14.0-570.12.1.el9_6.x86_64
GCC Version: gcc (GCC) 11.5.0 20240719 (Red Hat 11.5.0-5)
Clang Version: 19.1.7 (Red Hat, Inc. 19.1.7-2.el9)
x86_64-native-linuxapp-gcc
x86_64-native-linuxapp-clang
x86_64-native-linuxapp-gcc+shared
x86_64-native-linuxapp-gcc+debug
OS: SUSE15-64
Kernel Version: 6.4.0-150700.51-default
GCC Version: gcc (SUSE Linux) 14.2.0
Clang Version: 17.0.6
x86_64-native-linuxapp-clang
x86_64-native-linuxapp-gcc
OS: AzureLinux3.0-64
Kernel Version: 6.6.47.1-1.azl3
GCC Version: gcc (GCC) 13.2.0
Clang Version: 18.1.2
x86_64-native-linuxapp-gcc
OS: UB2404-32
Kernel Version: 6.8.0-41-generic
GCC Version: gcc (Ubuntu 13.3.0-6ubuntu2~24.04) 13.3.0
Clang Version: NA
i686-native-linuxapp-gcc
OS: RHEL10-64
Kernel Version: 6.12.0-55.9.1.el10_0.x86_64
GCC Version: gcc (GCC) 14.2.1 20250110 (Red Hat 14.2.1-7)
Clang Version: 19.1.7 (Red Hat, Inc. 19.1.7-2.el10)
x86_64-native-linuxapp-gcc
OS: UB2404-64
Kernel Version: 6.8.0-41-generic
GCC Version: gcc (Ubuntu 13.3.0-6ubuntu2~24.04) 13.3.0
Clang Version: NA
x86_64-native-linuxapp-gcc+16byte
x86_64-native-linuxapp-gcc
x86_64-native-linuxapp-clang
x86_64-native-linuxapp-doc
OS: RHEL96-64RT
Kernel Version: 5.14.0-570.12.1.el9_6.x86_64
GCC Version: gcc (GCC) 11.5.0 20240719 (Red Hat 11.5.0-5)
Clang Version: 19.1.7 (Red Hat, Inc. 19.1.7-2.el9)
x86_64-native-linuxapp-gcc
OS: UB2504-64
Kernel Version: 6.14.0-15-generic
GCC Version: gcc (Ubuntu 14.2.0-19ubuntu2) 14.2.0
Clang Version: NA
x86_64-native-linuxapp-gcc
OS: FC42-64
Kernel Version: 6.14.0-63.fc42.x86_64
GCC Version: gcc (GCC) 15.0.1 20250329 (Red Hat 15.0.1-0)
Clang Version: 20.1.3 (Fedora 20.1.3-1.fc42)
x86_64-native-linuxapp-gcc
x86_64-native-linuxapp-clang
OS: UB2404-64RT
Kernel Version: 6.8.0-rt8
GCC Version: gcc (Ubuntu 13.3.0-6ubuntu2~24.04) 13.3.0
Clang Version: NA
x86_64-native-linuxapp-gcc
*Build Failed #1:
OS: RHEL96-64
Target: x86_64-native-linuxapp-clang
FAILED: drivers/libtmp_rte_net_hinic3.a.p/net_hinic3_hinic3_rx.c.o
clang -Idrivers/libtmp_rte_net_hinic3.a.p -Idrivers -I../drivers -Idrivers/net/hinic3 -I../drivers/net/hinic3 -Idrivers/net/hinic3/base -I../drivers/net/hinic3/base -Ilib/ethdev -I../lib/ethdev -Ilib/eal/common -I../lib/eal/common -I. -I.. -Iconfig -I../config -Ilib/eal/include -I../lib/eal/include -Ilib/eal/linux/include -I../lib/eal/linux/include -Ilib/eal/x86/include -I../lib/eal/x86/include -I../kernel/linux -Ilib/eal -I../lib/eal -Ilib/kvargs -I../lib/kvargs -Ilib/log -I../lib/log -Ilib/metrics -I../lib/metrics -Ilib/telemetry -I../lib/telemetry -Ilib/net -I../lib/net -Ilib/mbuf -I../lib/mbuf -Ilib/mempool -I../lib/mempool -Ilib/ring -I../lib/ring -Ilib/meter -I../lib/meter -Idrivers/bus/pci -I../drivers/bus/pci -I../drivers/bus/pci/linux -Ilib/pci -I../lib/pci -Idrivers/bus/vdev -I../drivers/bus/vdev -Ilib/hash -I../lib/hash -Ilib/rcu -I../lib/rcu -fdiagnostics-color=always -D_FILE_OFFSET_BITS=64 -Wall -Winvalid-pch -Wextra -Werror -std=c11 -O3 -include rte_config.h -Wvla -Wcast-qual -Wdeprecated -Wformat -Wformat-nonliteral -Wformat-security -Wmissing-declarations -Wmissing-prototypes -Wnested-externs -Wold-style-definition -Wpointer-arith -Wsign-compare -Wstrict-prototypes -Wundef -Wwrite-strings -Wno-missing-field-initializers -D_GNU_SOURCE -fPIC -march=native -mrtm -DALLOW_EXPERIMENTAL_API -DALLOW_INTERNAL_API -Wno-format-truncation -Wno-address-of-packed-member -DHW_CONVERT_ENDIAN -DRTE_LOG_DEFAULT_LOGTYPE=pmd.net.hinic3 -DRTE_ANNOTATE_LOCKS -Wthread-safety -MD -MQ drivers/libtmp_rte_net_hinic3.a.p/net_hinic3_hinic3_rx.c.o -MF drivers/libtmp_rte_net_hinic3.a.p/net_hinic3_hinic3_rx.c.o.d -o drivers/libtmp_rte_net_hinic3.a.p/net_hinic3_hinic3_rx.c.o -c ../drivers/net/hinic3/hinic3_rx.c
../drivers/net/hinic3/hinic3_rx.c:75:1: error: unused function 'hinic3_update_rq_hw_pi' [-Werror,-Wunused-function]
75 | hinic3_update_rq_hw_pi(struct hinic3_rxq *rxq, uint16_t pi)
| ^~~~~~~~~~~~~~~~~~~~~~
1 error generated.
[1640/3544] Compiling C object drivers/libtmp_rte_net_hinic3.a.p/net_hinic3_hinic3_fdir.c.o
[1641/3544] Compiling C object drivers/libtmp_rte_net_hinic3.a.p/net_hinic3_hinic3_ethdev.c.o
[1642/3544] Compiling C object drivers/libtmp_rte_net_hinic3.a.p/net_hinic3_hinic3_flow.c.o
[1643/3544] Compiling C object drivers/libtmp_rte_net_hns3.a.p/net_hns3_hns3_cmd.c.o
[1644/3544] Compiling C object drivers/libtmp_rte_net_hns3.a.p/net_hns3_hns3_intr.c.o
[1645/3544] Compiling C object drivers/libtmp_rte_net_hinic3.a.p/net_hinic3_hinic3_tx.c.o
[1646/3544] Compiling C object drivers/libtmp_rte_net_hns3.a.p/net_hns3_hns3_dcb.c.o
[1647/3544] Compiling C object drivers/libtmp_rte_net_hns3.a.p/net_hns3_hns3_ethdev_vf.c.o
[1648/3544] Compiling C object drivers/libtmp_rte_net_hns3.a.p/net_hns3_hns3_ethdev.c.o
ninja: build stopped
*Build Failed #2:
OS: SUSE15-64
Target: x86_64-native-linuxapp-clang
FAILED: drivers/libtmp_rte_net_hinic3.a.p/net_hinic3_hinic3_rx.c.o
clang -Idrivers/libtmp_rte_net_hinic3.a.p -Idrivers -I../drivers -Idrivers/net/hinic3 -I../drivers/net/hinic3 -Idrivers/net/hinic3/base -I../drivers/net/hinic3/base -Ilib/ethdev -I../lib/ethdev -Ilib/eal/common -I../lib/eal/common -I. -I.. -Iconfig -I../config -Ilib/eal/include -I../lib/eal/include -Ilib/eal/linux/include -I../lib/eal/linux/include -Ilib/eal/x86/include -I../lib/eal/x86/include -I../kernel/linux -Ilib/eal -I../lib/eal -Ilib/kvargs -I../lib/kvargs -Ilib/log -I../lib/log -Ilib/metrics -I../lib/metrics -Ilib/telemetry -I../lib/telemetry -Ilib/net -I../lib/net -Ilib/mbuf -I../lib/mbuf -Ilib/mempool -I../lib/mempool -Ilib/ring -I../lib/ring -Ilib/meter -I../lib/meter -Idrivers/bus/pci -I../drivers/bus/pci -I../drivers/bus/pci/linux -Ilib/pci -I../lib/pci -Idrivers/bus/vdev -I../drivers/bus/vdev -Ilib/hash -I../lib/hash -Ilib/rcu -I../lib/rcu -fcolor-diagnostics -D_FILE_OFFSET_BITS=64 -Wall -Winvalid-pch -Wextra -Werror -std=c11 -O3 -include rte_config.h -Wvla -Wcast-qual -Wdeprecated -Wformat -Wformat-nonliteral -Wformat-security -Wmissing-declarations -Wmissing-prototypes -Wnested-externs -Wold-style-definition -Wpointer-arith -Wsign-compare -Wstrict-prototypes -Wundef -Wwrite-strings -Wno-missing-field-initializers -D_GNU_SOURCE -fPIC -march=native -mrtm -DALLOW_EXPERIMENTAL_API -DALLOW_INTERNAL_API -Wno-address-of-packed-member -DHW_CONVERT_ENDIAN -DRTE_LOG_DEFAULT_LOGTYPE=pmd.net.hinic3 -DRTE_ANNOTATE_LOCKS -Wthread-safety -MD -MQ drivers/libtmp_rte_net_hinic3.a.p/net_hinic3_hinic3_rx.c.o -MF drivers/libtmp_rte_net_hinic3.a.p/net_hinic3_hinic3_rx.c.o.d -o drivers/libtmp_rte_net_hinic3.a.p/net_hinic3_hinic3_rx.c.o -c ../drivers/net/hinic3/hinic3_rx.c
../drivers/net/hinic3/hinic3_rx.c:75:1: error: unused function 'hinic3_update_rq_hw_pi' [-Werror,-Wunused-function]
75 | hinic3_update_rq_hw_pi(struct hinic3_rxq *rxq, uint16_t pi)
| ^~~~~~~~~~~~~~~~~~~~~~
1 error generated.
[1648/3650] Linking target drivers/librte_net_hinic.so.26.0
[1649/3650] Compiling C object drivers/libtmp_rte_net_hinic3.a.p/net_hinic3_hinic3_flow.c.o
[1650/3650] Compiling C object drivers/libtmp_rte_net_hinic3.a.p/net_hinic3_hinic3_ethdev.c.o
[1651/3650] Compiling C object drivers/libtmp_rte_net_hinic3.a.p/net_hinic3_hinic3_fdir.c.o
[1652/3650] Compiling C object drivers/libtmp_rte_net_hinic3.a.p/net_hinic3_hinic3_tx.c.o
[1653/3650] Compiling C object drivers/libtmp_rte_net_hns3.a.p/net_hns3_hns3_cmd.c.o
[1654/3650] Compiling C object drivers/libtmp_rte_net_hns3.a.p/net_hns3_hns3_dcb.c.o
[1655/3650] Compiling C object drivers/libtmp_rte_net_hns3.a.p/net_hns3_hns3_intr.c.o
[1656/3650] Compiling C object drivers/libtmp_rte_net_hns3.a.p/net_hns3_hns3_ethdev.c.o
ninja: build stopped
*Build Failed #3:
OS: UB2404-64
Target: x86_64-native-linuxapp-clang
FAILED: drivers/libtmp_rte_net_hinic3.a.p/net_hinic3_hinic3_rx.c.o
clang -Idrivers/libtmp_rte_net_hinic3.a.p -Idrivers -I../drivers -Idrivers/net/hinic3 -I../drivers/net/hinic3 -Idrivers/net/hinic3/base -I../drivers/net/hinic3/base -Ilib/ethdev -I../lib/ethdev -Ilib/eal/common -I../lib/eal/common -I. -I.. -Iconfig -I../config -Ilib/eal/include -I../lib/eal/include -Ilib/eal/linux/include -I../lib/eal/linux/include -Ilib/eal/x86/include -I../lib/eal/x86/include -I../kernel/linux -Ilib/eal -I../lib/eal -Ilib/kvargs -I../lib/kvargs -Ilib/log -I../lib/log -Ilib/metrics -I../lib/metrics -Ilib/telemetry -I../lib/telemetry -Ilib/net -I../lib/net -Ilib/mbuf -I../lib/mbuf -Ilib/mempool -I../lib/mempool -Ilib/ring -I../lib/ring -Ilib/meter -I../lib/meter -Idrivers/bus/pci -I../drivers/bus/pci -I../drivers/bus/pci/linux -Ilib/pci -I../lib/pci -Idrivers/bus/vdev -I../drivers/bus/vdev -Ilib/hash -I../lib/hash -Ilib/rcu -I../lib/rcu -fcolor-diagnostics -D_FILE_OFFSET_BITS=64 -Wall -Winvalid-pch -Wextra -Werror -std=c11 -O3 -include rte_config.h -Wvla -Wcast-qual -Wdeprecated -Wformat -Wformat-nonliteral -Wformat-security -Wmissing-declarations -Wmissing-prototypes -Wnested-externs -Wold-style-definition -Wpointer-arith -Wsign-compare -Wstrict-prototypes -Wundef -Wwrite-strings -Wno-missing-field-initializers -D_GNU_SOURCE -fPIC -march=native -mrtm -DALLOW_EXPERIMENTAL_API -DALLOW_INTERNAL_API -Wno-format-truncation -Wno-address-of-packed-member -DHW_CONVERT_ENDIAN -DRTE_LOG_DEFAULT_LOGTYPE=pmd.net.hinic3 -DRTE_ANNOTATE_LOCKS -Wthread-safety -MD -MQ drivers/libtmp_rte_net_hinic3.a.p/net_hinic3_hinic3_rx.c.o -MF drivers/libtmp_rte_net_hinic3.a.p/net_hinic3_hinic3_rx.c.o.d -o drivers/libtmp_rte_net_hinic3.a.p/net_hinic3_hinic3_rx.c.o -c ../drivers/net/hinic3/hinic3_rx.c
../drivers/net/hinic3/hinic3_rx.c:75:1: error: unused function 'hinic3_update_rq_hw_pi' [-Werror,-Wunused-function]
75 | hinic3_update_rq_hw_pi(struct hinic3_rxq *rxq, uint16_t pi)
| ^~~~~~~~~~~~~~~~~~~~~~
1 error generated.
[1667/3820] Compiling C object drivers/libtmp_rte_net_hinic3.a.p/net_hinic3_hinic3_flow.c.o
[1668/3820] Compiling C object drivers/libtmp_rte_net_hns3.a.p/net_hns3_hns3_cmd.c.o
[1669/3820] Compiling C object drivers/libtmp_rte_net_hinic3.a.p/net_hinic3_hinic3_ethdev.c.o
[1670/3820] Compiling C object drivers/libtmp_rte_net_hinic3.a.p/net_hinic3_hinic3_fdir.c.o
[1671/3820] Compiling C object drivers/libtmp_rte_net_hinic3.a.p/net_hinic3_hinic3_tx.c.o
[1672/3820] Compiling C object drivers/libtmp_rte_net_hns3.a.p/net_hns3_hns3_dcb.c.o
[1673/3820] Compiling C object drivers/libtmp_rte_net_hns3.a.p/net_hns3_hns3_intr.c.o
[1674/3820] Compiling C object drivers/libtmp_rte_net_hns3.a.p/net_hns3_hns3_ethdev_vf.c.o
[1675/3820] Compiling C object drivers/libtmp_rte_net_hns3.a.p/net_hns3_hns3_ethdev.c.o
ninja: build stopped
*Build Failed #4:
OS: FC42-64
Target: x86_64-native-linuxapp-clang
FAILED: drivers/libtmp_rte_net_hinic3.a.p/net_hinic3_hinic3_rx.c.o
clang -Idrivers/libtmp_rte_net_hinic3.a.p -Idrivers -I../drivers -Idrivers/net/hinic3 -I../drivers/net/hinic3 -Idrivers/net/hinic3/base -I../drivers/net/hinic3/base -Ilib/ethdev -I../lib/ethdev -Ilib/eal/common -I../lib/eal/common -I. -I.. -Iconfig -I../config -Ilib/eal/include -I../lib/eal/include -Ilib/eal/linux/include -I../lib/eal/linux/include -Ilib/eal/x86/include -I../lib/eal/x86/include -I../kernel/linux -Ilib/eal -I../lib/eal -Ilib/kvargs -I../lib/kvargs -Ilib/log -I../lib/log -Ilib/metrics -I../lib/metrics -Ilib/telemetry -I../lib/telemetry -Ilib/net -I../lib/net -Ilib/mbuf -I../lib/mbuf -Ilib/mempool -I../lib/mempool -Ilib/ring -I../lib/ring -Ilib/meter -I../lib/meter -Idrivers/bus/pci -I../drivers/bus/pci -I../drivers/bus/pci/linux -Ilib/pci -I../lib/pci -Idrivers/bus/vdev -I../drivers/bus/vdev -Ilib/hash -I../lib/hash -Ilib/rcu -I../lib/rcu -fdiagnostics-color=always -D_FILE_OFFSET_BITS=64 -Wall -Winvalid-pch -Wextra -Werror -std=c11 -O3 -include rte_config.h -Wvla -Wcast-qual -Wdeprecated -Wformat -Wformat-nonliteral -Wformat-security -Wmissing-declarations -Wmissing-prototypes -Wnested-externs -Wold-style-definition -Wpointer-arith -Wsign-compare -Wstrict-prototypes -Wundef -Wwrite-strings -Wno-missing-field-initializers -D_GNU_SOURCE -fPIC -march=native -mrtm -DALLOW_EXPERIMENTAL_API -DALLOW_INTERNAL_API -Wno-format-truncation -Wno-address-of-packed-member -DHW_CONVERT_ENDIAN -DRTE_LOG_DEFAULT_LOGTYPE=pmd.net.hinic3 -DRTE_ANNOTATE_LOCKS -Wthread-safety -MD -MQ drivers/libtmp_rte_net_hinic3.a.p/net_hinic3_hinic3_rx.c.o -MF drivers/libtmp_rte_net_hinic3.a.p/net_hinic3_hinic3_rx.c.o.d -o drivers/libtmp_rte_net_hinic3.a.p/net_hinic3_hinic3_rx.c.o -c ../drivers/net/hinic3/hinic3_rx.c
../drivers/net/hinic3/hinic3_rx.c:75:1: error: unused function 'hinic3_update_rq_hw_pi' [-Werror,-Wunused-function]
75 | hinic3_update_rq_hw_pi(struct hinic3_rxq *rxq, uint16_t pi)
| ^~~~~~~~~~~~~~~~~~~~~~
1 error generated.
[1666/3820] Compiling C object drivers/libtmp_rte_net_hinic3.a.p/net_hinic3_hinic3_fdir.c.o
[1667/3820] Compiling C object drivers/libtmp_rte_net_hinic3.a.p/net_hinic3_hinic3_flow.c.o
[1668/3820] Compiling C object drivers/libtmp_rte_net_hinic3.a.p/net_hinic3_hinic3_ethdev.c.o
[1669/3820] Compiling C object drivers/libtmp_rte_net_hns3.a.p/net_hns3_hns3_cmd.c.o
[1670/3820] Compiling C object drivers/libtmp_rte_net_hinic3.a.p/net_hinic3_hinic3_tx.c.o
[1671/3820] Compiling C object drivers/libtmp_rte_net_hns3.a.p/net_hns3_hns3_intr.c.o
[1672/3820] Compiling C object drivers/libtmp_rte_net_hns3.a.p/net_hns3_hns3_dcb.c.o
[1673/3820] Compiling C object drivers/libtmp_rte_net_hns3.a.p/net_hns3_hns3_ethdev_vf.c.o
[1674/3820] Compiling C object drivers/libtmp_rte_net_hns3.a.p/net_hns3_hns3_ethdev.c.o
ninja: build stopped
DPDK STV team
^ permalink raw reply [flat|nested] only message in thread
only message in thread, other threads:[~2025-08-30 13:25 UTC | newest]
Thread overview: (only message) (download: mbox.gz / follow: Atom feed)
-- links below jump to the message on this page --
2025-08-30 13:25 compilation|FAILURE| pw(156308) sid(36056) job(PER_PATCH_BUILD16544)[V6, 17/17] drivers/net: add hinic3 PMD build and doc files sys_stv
This is a public inbox, see mirroring instructions
for how to clone and mirror all data and code used for this inbox;
as well as URLs for NNTP newsgroup(s).