automatic DPDK test reports
 help / color / mirror / Atom feed
* [dpdk-test-report] |FAILURE| pw66576-66586 [PATCH] [01/11] net/octeontx2: setup link config based on BP level
@ 2020-03-12 11:44 dpdklab
  0 siblings, 0 replies; only message in thread
From: dpdklab @ 2020-03-12 11:44 UTC (permalink / raw)
  To: test-report; +Cc: dpdk-test-reports

[-- Attachment #1: Type: text/plain, Size: 6322 bytes --]

Test-Label: Performance-Testing
Test-Status: FAILURE
http://dpdk.org/patch/66576

_build patch failure_

Submitter: Nithin Dabilpuram <ndabilpuram@marvell.com>
Date: Thursday, March 12 2020 11:18:57 
Applied on: CommitID:f3382a80da43a97b5cf86ed6db6d8dec292109c9
Apply patch set 66576-66586 failed:

Configuration done using x86_64-native-linuxapp-gcc
== Build lib
== Build lib/librte_kvargs
== Build lib/librte_eal
/home-local/jenkins-local/jenkins-agent/workspace/Apply-Custom-Patch-Set/dpdk/mk/toolchain/gcc/rte.toolchain-compat.mk:30: AVX512 support disabled because of binutils 2.30. See Bug 97
== Build lib/librte_eal/common
== Build lib/librte_eal/linux
== Build lib/librte_eal/linux/eal
== Build lib/librte_pci
== Build lib/librte_ring
== Build lib/librte_stack
== Build lib/librte_mempool
== Build lib/librte_mbuf
== Build lib/librte_timer
== Build lib/librte_cfgfile
== Build lib/librte_net
== Build lib/librte_cmdline
== Build lib/librte_meter
== Build lib/librte_ethdev
== Build lib/librte_bbdev
== Build lib/librte_cryptodev
== Build lib/librte_security
== Build lib/librte_compressdev
== Build lib/librte_hash
== Build lib/librte_eventdev
== Build lib/librte_rawdev
== Build lib/librte_vhost
== Build lib/librte_efd
== Build lib/librte_rib
== Build lib/librte_fib
== Build lib/librte_lpm
== Build lib/librte_acl
== Build lib/librte_member
== Build lib/librte_ip_frag
== Build lib/librte_gro
== Build lib/librte_jobstats
== Build lib/librte_metrics
== Build lib/librte_bitratestats
== Build lib/librte_latencystats
== Build lib/librte_power
== Build lib/librte_sched
== Build lib/librte_kni
== Build lib/librte_port
== Build lib/librte_table
== Build lib/librte_flow_classify
== Build lib/librte_distributor
== Build lib/librte_pipeline
== Build lib/librte_reorder
== Build lib/librte_pdump
== Build lib/librte_gso
== Build lib/librte_bpf
== Build lib/librte_ipsec
== Build lib/librte_rcu
== Build buildtools
== Build buildtools/pmdinfogen
== Build kernel
== Build kernel/linux
== Build drivers
== Build drivers/common
== Build drivers/common/cpt
== Build drivers/common/octeontx
== Build drivers/common/octeontx2
== Build drivers/common/dpaax
== Build drivers/common/iavf
== Build drivers/bus
== Build drivers/bus/dpaa
== Build drivers/bus/fslmc
== Build drivers/bus/ifpga
== Build drivers/bus/pci
== Build drivers/bus/vdev
== Build drivers/bus/vmbus
== Build drivers/mempool
== Build drivers/mempool/bucket
== Build drivers/mempool/dpaa
== Build drivers/mempool/dpaa2
== Build drivers/mempool/ring
== Build drivers/mempool/stack
== Build drivers/mempool/octeontx
== Build drivers/mempool/octeontx2
== Build drivers/net
== Build drivers/net/af_packet
== Build drivers/net/ark
== Build drivers/net/atlantic
== Build drivers/net/avp
== Build drivers/net/axgbe
== Build drivers/net/bonding
== Build drivers/net/cxgbe
== Build drivers/net/dpaa
== Build drivers/net/dpaa2
== Build drivers/net/e1000
== Build drivers/net/ena
== Build drivers/net/enetc
== Build drivers/net/enic
== Build drivers/net/failsafe
== Build drivers/net/fm10k
== Build drivers/net/hinic
== Build drivers/net/hns3
== Build drivers/net/i40e
== Build drivers/net/iavf
== Build drivers/net/ice
== Build drivers/net/ionic
== Build drivers/net/ixgbe
== Build drivers/net/liquidio
== Build drivers/net/memif
== Build drivers/net/netvsc
== Build drivers/net/nfp
== Build drivers/net/bnxt
== Build drivers/net/null
== Build drivers/net/octeontx
== Build drivers/net/octeontx2
  CC otx2_tm.o
/home-local/jenkins-local/jenkins-agent/workspace/Apply-Custom-Patch-Set/dpdk/drivers/net/octeontx2/otx2_tm.c: In function ‘populate_tm_reg’:
/home-local/jenkins-local/jenkins-agent/workspace/Apply-Custom-Patch-Set/dpdk/drivers/net/octeontx2/otx2_tm.c:627:24: error: ‘struct nix_txschq_config’ has no member named ‘regval_mask’; did you mean ‘regval’?
  otx2_mbox_memcpy(req->regval_mask, regval_mask, sizeof(uint64_t) * k);
                        ^~~~~~~~~~~
                        regval
/home-local/jenkins-local/jenkins-agent/workspace/Apply-Custom-Patch-Set/dpdk/drivers/net/octeontx2/otx2_tm.c: In function ‘nix_smq_xoff’:
/home-local/jenkins-local/jenkins-agent/workspace/Apply-Custom-Patch-Set/dpdk/drivers/net/octeontx2/otx2_tm.c:876:7: error: ‘struct nix_txschq_config’ has no member named ‘regval_mask’; did you mean ‘regval’?
  req->regval_mask[0] = enable ?
       ^~~~~~~~~~~
       regval
/home-local/jenkins-local/jenkins-agent/workspace/Apply-Custom-Patch-Set/dpdk/drivers/net/octeontx2/otx2_tm.c: In function ‘read_tm_reg’:
/home-local/jenkins-local/jenkins-agent/workspace/Apply-Custom-Patch-Set/dpdk/drivers/net/octeontx2/otx2_tm.c:1680:7: error: ‘volatile struct nix_txschq_config’ has no member named ‘read’; did you mean ‘reg’?
  req->read = 1;
       ^~~~
       reg
/home-local/jenkins-local/jenkins-agent/workspace/Apply-Custom-Patch-Set/dpdk/drivers/net/octeontx2/otx2_tm.c: At top level:
cc1: error: unrecognized command line option ‘-Wno-address-of-packed-member’ [-Werror]
cc1: all warnings being treated as errors
/home-local/jenkins-local/jenkins-agent/workspace/Apply-Custom-Patch-Set/dpdk/mk/internal/rte.compile-pre.mk:114: recipe for target 'otx2_tm.o' failed
make[6]: *** [otx2_tm.o] Error 1
/home-local/jenkins-local/jenkins-agent/workspace/Apply-Custom-Patch-Set/dpdk/mk/rte.subdir.mk:35: recipe for target 'octeontx2' failed
make[5]: *** [octeontx2] Error 2
/home-local/jenkins-local/jenkins-agent/workspace/Apply-Custom-Patch-Set/dpdk/mk/rte.subdir.mk:35: recipe for target 'net' failed
make[4]: *** [net] Error 2
/home-local/jenkins-local/jenkins-agent/workspace/Apply-Custom-Patch-Set/dpdk/mk/rte.sdkbuild.mk:46: recipe for target 'drivers' failed
make[3]: *** [drivers] Error 2
/home-local/jenkins-local/jenkins-agent/workspace/Apply-Custom-Patch-Set/dpdk/mk/rte.sdkroot.mk:98: recipe for target 'all' failed
make[2]: *** [all] Error 2
/home-local/jenkins-local/jenkins-agent/workspace/Apply-Custom-Patch-Set/dpdk/mk/rte.sdkinstall.mk:60: recipe for target 'pre_install' failed
make[1]: *** [pre_install] Error 2
/home-local/jenkins-local/jenkins-agent/workspace/Apply-Custom-Patch-Set/dpdk/mk/rte.sdkroot.mk:77: recipe for target 'install' failed
make: *** [install] Error 2

https://lab.dpdk.org/results/dashboard/patchsets/9957/

UNH-IOL DPDK Community Lab

^ permalink raw reply	[flat|nested] only message in thread

only message in thread, other threads:[~2020-03-12 11:44 UTC | newest]

Thread overview: (only message) (download: mbox.gz / follow: Atom feed)
-- links below jump to the message on this page --
2020-03-12 11:44 [dpdk-test-report] |FAILURE| pw66576-66586 [PATCH] [01/11] net/octeontx2: setup link config based on BP level dpdklab

automatic DPDK test reports

This inbox may be cloned and mirrored by anyone:

	git clone --mirror http://inbox.dpdk.org/test-report/0 test-report/git/0.git

	# If you have public-inbox 1.1+ installed, you may
	# initialize and index your mirror using the following commands:
	public-inbox-init -V2 test-report test-report/ http://inbox.dpdk.org/test-report \
		test-report@dpdk.org
	public-inbox-index test-report

Example config snippet for mirrors.
Newsgroup available over NNTP:
	nntp://inbox.dpdk.org/inbox.dpdk.test-report


AGPL code for this site: git clone https://public-inbox.org/public-inbox.git