automatic DPDK test reports
 help / color / mirror / Atom feed
* [dpdk-test-report] |FAILURE| pw66643-66649 [PATCH] [v1, 1/7] net/virtio: add Rx free threshold setting
@ 2020-03-13 10:29 dpdklab
  0 siblings, 0 replies; only message in thread
From: dpdklab @ 2020-03-13 10:29 UTC (permalink / raw)
  To: test-report; +Cc: dpdk-test-reports

[-- Attachment #1: Type: text/plain, Size: 17569 bytes --]

Test-Label: Performance-Testing
Test-Status: FAILURE
http://dpdk.org/patch/66643

_build patch failure_

Submitter: Marvin Liu <yong.liu@intel.com>
Date: Friday, March 13 2020 17:42:24 
Applied on: CommitID:545cd4f422ecc60e0470d0576deb29291f0ff9b9
Apply patch set 66643-66649 failed:

Configuration done using x86_64-native-linuxapp-gcc
== Build lib
== Build lib/librte_kvargs
== Build lib/librte_eal
/home-local/jenkins-local/jenkins-agent/workspace/Apply-Custom-Patch-Set/dpdk/mk/toolchain/gcc/rte.toolchain-compat.mk:30: AVX512 support disabled because of binutils 2.30. See Bug 97
== Build lib/librte_eal/common
== Build lib/librte_eal/linux
== Build lib/librte_eal/linux/eal
== Build lib/librte_pci
== Build lib/librte_ring
== Build lib/librte_stack
== Build lib/librte_mempool
== Build lib/librte_mbuf
== Build lib/librte_timer
== Build lib/librte_cfgfile
== Build lib/librte_net
== Build lib/librte_cmdline
== Build lib/librte_meter
== Build lib/librte_ethdev
== Build lib/librte_bbdev
== Build lib/librte_cryptodev
== Build lib/librte_security
== Build lib/librte_compressdev
== Build lib/librte_hash
== Build lib/librte_eventdev
== Build lib/librte_rawdev
== Build lib/librte_vhost
== Build lib/librte_efd
== Build lib/librte_rib
== Build lib/librte_fib
== Build lib/librte_lpm
== Build lib/librte_acl
== Build lib/librte_member
== Build lib/librte_ip_frag
== Build lib/librte_gro
== Build lib/librte_jobstats
== Build lib/librte_metrics
== Build lib/librte_bitratestats
== Build lib/librte_latencystats
== Build lib/librte_power
== Build lib/librte_sched
== Build lib/librte_kni
== Build lib/librte_port
== Build lib/librte_table
== Build lib/librte_flow_classify
== Build lib/librte_distributor
== Build lib/librte_pipeline
== Build lib/librte_reorder
== Build lib/librte_pdump
== Build lib/librte_gso
== Build lib/librte_bpf
== Build lib/librte_ipsec
== Build lib/librte_rcu
== Build buildtools
== Build buildtools/pmdinfogen
== Build kernel
== Build kernel/linux
== Build drivers
== Build drivers/common
== Build drivers/common/cpt
== Build drivers/common/octeontx
== Build drivers/common/octeontx2
== Build drivers/common/dpaax
== Build drivers/common/iavf
== Build drivers/bus
== Build drivers/bus/dpaa
== Build drivers/bus/fslmc
== Build drivers/bus/ifpga
== Build drivers/bus/pci
== Build drivers/bus/vdev
== Build drivers/bus/vmbus
== Build drivers/mempool
== Build drivers/mempool/bucket
== Build drivers/mempool/dpaa
== Build drivers/mempool/dpaa2
== Build drivers/mempool/ring
== Build drivers/mempool/stack
== Build drivers/mempool/octeontx
== Build drivers/mempool/octeontx2
== Build drivers/net
== Build drivers/net/af_packet
== Build drivers/net/ark
== Build drivers/net/atlantic
== Build drivers/net/avp
== Build drivers/net/axgbe
== Build drivers/net/bonding
== Build drivers/net/cxgbe
== Build drivers/net/dpaa
== Build drivers/net/dpaa2
== Build drivers/net/e1000
== Build drivers/net/ena
== Build drivers/net/enetc
== Build drivers/net/enic
== Build drivers/net/failsafe
== Build drivers/net/fm10k
== Build drivers/net/hinic
== Build drivers/net/hns3
== Build drivers/net/i40e
== Build drivers/net/iavf
== Build drivers/net/ice
== Build drivers/net/ionic
== Build drivers/net/ixgbe
== Build drivers/net/liquidio
== Build drivers/net/memif
== Build drivers/net/netvsc
== Build drivers/net/nfp
== Build drivers/net/bnxt
== Build drivers/net/null
== Build drivers/net/octeontx
== Build drivers/net/octeontx2
== Build drivers/net/qede
== Build drivers/net/ring
== Build drivers/net/sfc
== Build drivers/net/tap
== Build drivers/net/thunderx
== Build drivers/net/vdev_netvsc
== Build drivers/net/virtio
  CC virtio_rxtx_packed_avx.o
/home-local/jenkins-local/jenkins-agent/workspace/Apply-Custom-Patch-Set/dpdk/drivers/net/virtio/virtio_rxtx_packed_avx.c: In function ‘virtqueue_enqueue_batch_packed_vec’:
/home-local/jenkins-local/jenkins-agent/workspace/Apply-Custom-Patch-Set/dpdk/drivers/net/virtio/virtio_rxtx_packed_avx.c:152:10: error: AVX512F vector return without AVX512F enabled changes the ABI [-Werror=psabi]
  __m512i new_descs = _mm512_set_epi64(
          ^~~~~~~~~
In file included from /usr/lib/gcc/x86_64-linux-gnu/7/include/immintrin.h:59:0,
                 from /usr/lib/gcc/x86_64-linux-gnu/7/include/x86intrin.h:48,
                 from /home-local/jenkins-local/jenkins-agent/workspace/Apply-Custom-Patch-Set/dpdk/x86_64-native-linuxapp-gcc/include/rte_vect.h:30,
                 from /home-local/jenkins-local/jenkins-agent/workspace/Apply-Custom-Patch-Set/dpdk/x86_64-native-linuxapp-gcc/include/rte_memcpy.h:17,
                 from /home-local/jenkins-local/jenkins-agent/workspace/Apply-Custom-Patch-Set/dpdk/x86_64-native-linuxapp-gcc/include/rte_mempool.h:51,
                 from /home-local/jenkins-local/jenkins-agent/workspace/Apply-Custom-Patch-Set/dpdk/x86_64-native-linuxapp-gcc/include/rte_mbuf.h:38,
                 from /home-local/jenkins-local/jenkins-agent/workspace/Apply-Custom-Patch-Set/dpdk/x86_64-native-linuxapp-gcc/include/rte_ip.h:24,
                 from /home-local/jenkins-local/jenkins-agent/workspace/Apply-Custom-Patch-Set/dpdk/x86_64-native-linuxapp-gcc/include/rte_net.h:12,
                 from /home-local/jenkins-local/jenkins-agent/workspace/Apply-Custom-Patch-Set/dpdk/drivers/net/virtio/virtio_rxtx_packed_avx.c:11:
/usr/lib/gcc/x86_64-linux-gnu/7/include/avx512vlbwintrin.h:3642:1: error: inlining failed in call to always_inline ‘_mm256_cmpneq_epu16_mask’: target specific option mismatch
 _mm256_cmpneq_epu16_mask (__m256i __X, __m256i __Y)
 ^~~~~~~~~~~~~~~~~~~~~~~~
/home-local/jenkins-local/jenkins-agent/workspace/Apply-Custom-Patch-Set/dpdk/drivers/net/virtio/virtio_rxtx_packed_avx.c:132:11: note: called from here
  uint16_t cmp = _mm256_cmpneq_epu16_mask(mbufs, mbuf_ref);
           ^~~
In file included from /usr/lib/gcc/x86_64-linux-gnu/7/include/immintrin.h:59:0,
                 from /usr/lib/gcc/x86_64-linux-gnu/7/include/x86intrin.h:48,
                 from /home-local/jenkins-local/jenkins-agent/workspace/Apply-Custom-Patch-Set/dpdk/x86_64-native-linuxapp-gcc/include/rte_vect.h:30,
                 from /home-local/jenkins-local/jenkins-agent/workspace/Apply-Custom-Patch-Set/dpdk/x86_64-native-linuxapp-gcc/include/rte_memcpy.h:17,
                 from /home-local/jenkins-local/jenkins-agent/workspace/Apply-Custom-Patch-Set/dpdk/x86_64-native-linuxapp-gcc/include/rte_mempool.h:51,
                 from /home-local/jenkins-local/jenkins-agent/workspace/Apply-Custom-Patch-Set/dpdk/x86_64-native-linuxapp-gcc/include/rte_mbuf.h:38,
                 from /home-local/jenkins-local/jenkins-agent/workspace/Apply-Custom-Patch-Set/dpdk/x86_64-native-linuxapp-gcc/include/rte_ip.h:24,
                 from /home-local/jenkins-local/jenkins-agent/workspace/Apply-Custom-Patch-Set/dpdk/x86_64-native-linuxapp-gcc/include/rte_net.h:12,
                 from /home-local/jenkins-local/jenkins-agent/workspace/Apply-Custom-Patch-Set/dpdk/drivers/net/virtio/virtio_rxtx_packed_avx.c:11:
/usr/lib/gcc/x86_64-linux-gnu/7/include/avx512vlbwintrin.h:3642:1: error: inlining failed in call to always_inline ‘_mm256_cmpneq_epu16_mask’: target specific option mismatch
 _mm256_cmpneq_epu16_mask (__m256i __X, __m256i __Y)
 ^~~~~~~~~~~~~~~~~~~~~~~~
/home-local/jenkins-local/jenkins-agent/workspace/Apply-Custom-Patch-Set/dpdk/drivers/net/virtio/virtio_rxtx_packed_avx.c:132:11: note: called from here
  uint16_t cmp = _mm256_cmpneq_epu16_mask(mbufs, mbuf_ref);
           ^~~
In file included from /usr/lib/gcc/x86_64-linux-gnu/7/include/immintrin.h:45:0,
                 from /usr/lib/gcc/x86_64-linux-gnu/7/include/x86intrin.h:48,
                 from /home-local/jenkins-local/jenkins-agent/workspace/Apply-Custom-Patch-Set/dpdk/x86_64-native-linuxapp-gcc/include/rte_vect.h:30,
                 from /home-local/jenkins-local/jenkins-agent/workspace/Apply-Custom-Patch-Set/dpdk/x86_64-native-linuxapp-gcc/include/rte_memcpy.h:17,
                 from /home-local/jenkins-local/jenkins-agent/workspace/Apply-Custom-Patch-Set/dpdk/x86_64-native-linuxapp-gcc/include/rte_mempool.h:51,
                 from /home-local/jenkins-local/jenkins-agent/workspace/Apply-Custom-Patch-Set/dpdk/x86_64-native-linuxapp-gcc/include/rte_mbuf.h:38,
                 from /home-local/jenkins-local/jenkins-agent/workspace/Apply-Custom-Patch-Set/dpdk/x86_64-native-linuxapp-gcc/include/rte_ip.h:24,
                 from /home-local/jenkins-local/jenkins-agent/workspace/Apply-Custom-Patch-Set/dpdk/x86_64-native-linuxapp-gcc/include/rte_net.h:12,
                 from /home-local/jenkins-local/jenkins-agent/workspace/Apply-Custom-Patch-Set/dpdk/drivers/net/virtio/virtio_rxtx_packed_avx.c:11:
/usr/lib/gcc/x86_64-linux-gnu/7/include/avx512fintrin.h:79:1: error: inlining failed in call to always_inline ‘_mm512_set_epi64’: target specific option mismatch
 _mm512_set_epi64 (long long __A, long long __B, long long __C,
 ^~~~~~~~~~~~~~~~
/home-local/jenkins-local/jenkins-agent/workspace/Apply-Custom-Patch-Set/dpdk/drivers/net/virtio/virtio_rxtx_packed_avx.c:152:10: note: called from here
  __m512i new_descs = _mm512_set_epi64(
          ^~~~~~~~~
In file included from /usr/lib/gcc/x86_64-linux-gnu/7/include/immintrin.h:45:0,
                 from /usr/lib/gcc/x86_64-linux-gnu/7/include/x86intrin.h:48,
                 from /home-local/jenkins-local/jenkins-agent/workspace/Apply-Custom-Patch-Set/dpdk/x86_64-native-linuxapp-gcc/include/rte_vect.h:30,
                 from /home-local/jenkins-local/jenkins-agent/workspace/Apply-Custom-Patch-Set/dpdk/x86_64-native-linuxapp-gcc/include/rte_memcpy.h:17,
                 from /home-local/jenkins-local/jenkins-agent/workspace/Apply-Custom-Patch-Set/dpdk/x86_64-native-linuxapp-gcc/include/rte_mempool.h:51,
                 from /home-local/jenkins-local/jenkins-agent/workspace/Apply-Custom-Patch-Set/dpdk/x86_64-native-linuxapp-gcc/include/rte_mbuf.h:38,
                 from /home-local/jenkins-local/jenkins-agent/workspace/Apply-Custom-Patch-Set/dpdk/x86_64-native-linuxapp-gcc/include/rte_ip.h:24,
                 from /home-local/jenkins-local/jenkins-agent/workspace/Apply-Custom-Patch-Set/dpdk/x86_64-native-linuxapp-gcc/include/rte_net.h:12,
                 from /home-local/jenkins-local/jenkins-agent/workspace/Apply-Custom-Patch-Set/dpdk/drivers/net/virtio/virtio_rxtx_packed_avx.c:11:
/usr/lib/gcc/x86_64-linux-gnu/7/include/avx512fintrin.h:5831:1: error: inlining failed in call to always_inline ‘_mm512_storeu_si512’: target specific option mismatch
 _mm512_storeu_si512 (void *__P, __m512i __A)
 ^~~~~~~~~~~~~~~~~~~
/home-local/jenkins-local/jenkins-agent/workspace/Apply-Custom-Patch-Set/dpdk/drivers/net/virtio/virtio_rxtx_packed_avx.c:172:2: note: called from here
  _mm512_storeu_si512((void *)&vq->vq_packed.ring.desc[idx], new_descs);
  ^~~~~~~~~~~~~~~~~~~~~~~~~~~~~~~~~~~~~~~~~~~~~~~~~~~~~~~~~~~~~~~~~~~~~
In file included from /usr/lib/gcc/x86_64-linux-gnu/7/include/immintrin.h:59:0,
                 from /usr/lib/gcc/x86_64-linux-gnu/7/include/x86intrin.h:48,
                 from /home-local/jenkins-local/jenkins-agent/workspace/Apply-Custom-Patch-Set/dpdk/x86_64-native-linuxapp-gcc/include/rte_vect.h:30,
                 from /home-local/jenkins-local/jenkins-agent/workspace/Apply-Custom-Patch-Set/dpdk/x86_64-native-linuxapp-gcc/include/rte_memcpy.h:17,
                 from /home-local/jenkins-local/jenkins-agent/workspace/Apply-Custom-Patch-Set/dpdk/x86_64-native-linuxapp-gcc/include/rte_mempool.h:51,
                 from /home-local/jenkins-local/jenkins-agent/workspace/Apply-Custom-Patch-Set/dpdk/x86_64-native-linuxapp-gcc/include/rte_mbuf.h:38,
                 from /home-local/jenkins-local/jenkins-agent/workspace/Apply-Custom-Patch-Set/dpdk/x86_64-native-linuxapp-gcc/include/rte_ip.h:24,
                 from /home-local/jenkins-local/jenkins-agent/workspace/Apply-Custom-Patch-Set/dpdk/x86_64-native-linuxapp-gcc/include/rte_net.h:12,
                 from /home-local/jenkins-local/jenkins-agent/workspace/Apply-Custom-Patch-Set/dpdk/drivers/net/virtio/virtio_rxtx_packed_avx.c:11:
/usr/lib/gcc/x86_64-linux-gnu/7/include/avx512vlbwintrin.h:3642:1: error: inlining failed in call to always_inline ‘_mm256_cmpneq_epu16_mask’: target specific option mismatch
 _mm256_cmpneq_epu16_mask (__m256i __X, __m256i __Y)
 ^~~~~~~~~~~~~~~~~~~~~~~~
/home-local/jenkins-local/jenkins-agent/workspace/Apply-Custom-Patch-Set/dpdk/drivers/net/virtio/virtio_rxtx_packed_avx.c:132:11: note: called from here
  uint16_t cmp = _mm256_cmpneq_epu16_mask(mbufs, mbuf_ref);
           ^~~
In file included from /usr/lib/gcc/x86_64-linux-gnu/7/include/immintrin.h:45:0,
                 from /usr/lib/gcc/x86_64-linux-gnu/7/include/x86intrin.h:48,
                 from /home-local/jenkins-local/jenkins-agent/workspace/Apply-Custom-Patch-Set/dpdk/x86_64-native-linuxapp-gcc/include/rte_vect.h:30,
                 from /home-local/jenkins-local/jenkins-agent/workspace/Apply-Custom-Patch-Set/dpdk/x86_64-native-linuxapp-gcc/include/rte_memcpy.h:17,
                 from /home-local/jenkins-local/jenkins-agent/workspace/Apply-Custom-Patch-Set/dpdk/x86_64-native-linuxapp-gcc/include/rte_mempool.h:51,
                 from /home-local/jenkins-local/jenkins-agent/workspace/Apply-Custom-Patch-Set/dpdk/x86_64-native-linuxapp-gcc/include/rte_mbuf.h:38,
                 from /home-local/jenkins-local/jenkins-agent/workspace/Apply-Custom-Patch-Set/dpdk/x86_64-native-linuxapp-gcc/include/rte_ip.h:24,
                 from /home-local/jenkins-local/jenkins-agent/workspace/Apply-Custom-Patch-Set/dpdk/x86_64-native-linuxapp-gcc/include/rte_net.h:12,
                 from /home-local/jenkins-local/jenkins-agent/workspace/Apply-Custom-Patch-Set/dpdk/drivers/net/virtio/virtio_rxtx_packed_avx.c:11:
/usr/lib/gcc/x86_64-linux-gnu/7/include/avx512fintrin.h:79:1: error: inlining failed in call to always_inline ‘_mm512_set_epi64’: target specific option mismatch
 _mm512_set_epi64 (long long __A, long long __B, long long __C,
 ^~~~~~~~~~~~~~~~
/home-local/jenkins-local/jenkins-agent/workspace/Apply-Custom-Patch-Set/dpdk/drivers/net/virtio/virtio_rxtx_packed_avx.c:152:10: note: called from here
  __m512i new_descs = _mm512_set_epi64(
          ^~~~~~~~~
In file included from /usr/lib/gcc/x86_64-linux-gnu/7/include/immintrin.h:45:0,
                 from /usr/lib/gcc/x86_64-linux-gnu/7/include/x86intrin.h:48,
                 from /home-local/jenkins-local/jenkins-agent/workspace/Apply-Custom-Patch-Set/dpdk/x86_64-native-linuxapp-gcc/include/rte_vect.h:30,
                 from /home-local/jenkins-local/jenkins-agent/workspace/Apply-Custom-Patch-Set/dpdk/x86_64-native-linuxapp-gcc/include/rte_memcpy.h:17,
                 from /home-local/jenkins-local/jenkins-agent/workspace/Apply-Custom-Patch-Set/dpdk/x86_64-native-linuxapp-gcc/include/rte_mempool.h:51,
                 from /home-local/jenkins-local/jenkins-agent/workspace/Apply-Custom-Patch-Set/dpdk/x86_64-native-linuxapp-gcc/include/rte_mbuf.h:38,
                 from /home-local/jenkins-local/jenkins-agent/workspace/Apply-Custom-Patch-Set/dpdk/x86_64-native-linuxapp-gcc/include/rte_ip.h:24,
                 from /home-local/jenkins-local/jenkins-agent/workspace/Apply-Custom-Patch-Set/dpdk/x86_64-native-linuxapp-gcc/include/rte_net.h:12,
                 from /home-local/jenkins-local/jenkins-agent/workspace/Apply-Custom-Patch-Set/dpdk/drivers/net/virtio/virtio_rxtx_packed_avx.c:11:
/usr/lib/gcc/x86_64-linux-gnu/7/include/avx512fintrin.h:5831:1: error: inlining failed in call to always_inline ‘_mm512_storeu_si512’: target specific option mismatch
 _mm512_storeu_si512 (void *__P, __m512i __A)
 ^~~~~~~~~~~~~~~~~~~
/home-local/jenkins-local/jenkins-agent/workspace/Apply-Custom-Patch-Set/dpdk/drivers/net/virtio/virtio_rxtx_packed_avx.c:172:2: note: called from here
  _mm512_storeu_si512((void *)&vq->vq_packed.ring.desc[idx], new_descs);
  ^~~~~~~~~~~~~~~~~~~~~~~~~~~~~~~~~~~~~~~~~~~~~~~~~~~~~~~~~~~~~~~~~~~~~
/home-local/jenkins-local/jenkins-agent/workspace/Apply-Custom-Patch-Set/dpdk/drivers/net/virtio/virtio_rxtx_packed_avx.c: At top level:
cc1: error: unrecognized command line option ‘-Wno-address-of-packed-member’ [-Werror]
cc1: all warnings being treated as errors
/home-local/jenkins-local/jenkins-agent/workspace/Apply-Custom-Patch-Set/dpdk/mk/internal/rte.compile-pre.mk:114: recipe for target 'virtio_rxtx_packed_avx.o' failed
make[6]: *** [virtio_rxtx_packed_avx.o] Error 1
/home-local/jenkins-local/jenkins-agent/workspace/Apply-Custom-Patch-Set/dpdk/mk/rte.subdir.mk:35: recipe for target 'virtio' failed
make[5]: *** [virtio] Error 2
/home-local/jenkins-local/jenkins-agent/workspace/Apply-Custom-Patch-Set/dpdk/mk/rte.subdir.mk:35: recipe for target 'net' failed
make[4]: *** [net] Error 2
/home-local/jenkins-local/jenkins-agent/workspace/Apply-Custom-Patch-Set/dpdk/mk/rte.sdkbuild.mk:46: recipe for target 'drivers' failed
make[3]: *** [drivers] Error 2
/home-local/jenkins-local/jenkins-agent/workspace/Apply-Custom-Patch-Set/dpdk/mk/rte.sdkroot.mk:98: recipe for target 'all' failed
make[2]: *** [all] Error 2
/home-local/jenkins-local/jenkins-agent/workspace/Apply-Custom-Patch-Set/dpdk/mk/rte.sdkinstall.mk:60: recipe for target 'pre_install' failed
make[1]: *** [pre_install] Error 2
/home-local/jenkins-local/jenkins-agent/workspace/Apply-Custom-Patch-Set/dpdk/mk/rte.sdkroot.mk:77: recipe for target 'install' failed
make: *** [install] Error 2

https://lab.dpdk.org/results/dashboard/patchsets/9967/

UNH-IOL DPDK Community Lab

^ permalink raw reply	[flat|nested] only message in thread

only message in thread, other threads:[~2020-03-13 10:29 UTC | newest]

Thread overview: (only message) (download: mbox.gz / follow: Atom feed)
-- links below jump to the message on this page --
2020-03-13 10:29 [dpdk-test-report] |FAILURE| pw66643-66649 [PATCH] [v1, 1/7] net/virtio: add Rx free threshold setting dpdklab

automatic DPDK test reports

This inbox may be cloned and mirrored by anyone:

	git clone --mirror http://inbox.dpdk.org/test-report/0 test-report/git/0.git

	# If you have public-inbox 1.1+ installed, you may
	# initialize and index your mirror using the following commands:
	public-inbox-init -V2 test-report test-report/ http://inbox.dpdk.org/test-report \
		test-report@dpdk.org
	public-inbox-index test-report

Example config snippet for mirrors.
Newsgroup available over NNTP:
	nntp://inbox.dpdk.org/inbox.dpdk.test-report


AGPL code for this site: git clone https://public-inbox.org/public-inbox.git