automatic DPDK test reports
 help / color / Atom feed
* [dpdk-test-report] |FAILURE| pw72452 [PATCH] [v2] eal: fix memory leak when removing event_cb
@ 2020-06-30 12:27 dpdklab
  0 siblings, 0 replies; 2+ messages in thread
From: dpdklab @ 2020-06-30 12:27 UTC (permalink / raw)
  To: test-report; +Cc: dpdk-test-reports

[-- Attachment #1: Type: text/plain, Size: 1340 bytes --]

Test-Label: Performance-Testing
Test-Status: FAILURE
http://dpdk.org/patch/72452

_build patch failure_

Submitter: wangyunjian <wangyunjian@huawei.com>
Date: Tuesday, June 30 2020 11:56:41 
Applied on: CommitID:014a7ec6c418eaf24a13be8ade8229638ddc6eed
Apply patch set 72452 failed:


=========================== WARNING ============================
It is recommended to build DPDK using 'meson' and 'ninja'
See https://doc.dpdk.org/guides/linux_gsg/build_dpdk.html
Building DPDK with 'make' will be deprecated in a future release
================================================================

This deprecation warning can be passed by adding MAKE_PAUSE=n
to 'make' command line or as an exported environment variable.
Press enter to continue...
/home-local/jenkins-local/jenkins-agent/workspace/Apply-Custom-Patch-Set/dpdk/mk/rte.sdkroot.mk:65: recipe for target 'warning' failed
make[2]: *** [warning] Error 1
/home-local/jenkins-local/jenkins-agent/workspace/Apply-Custom-Patch-Set/dpdk/mk/rte.sdkinstall.mk:60: recipe for target 'pre_install' failed
make[1]: *** [pre_install] Error 2
/home-local/jenkins-local/jenkins-agent/workspace/Apply-Custom-Patch-Set/dpdk/mk/rte.sdkroot.mk:92: recipe for target 'install' failed
make: *** [install] Error 2

https://lab.dpdk.org/results/dashboard/patchsets/11739/

UNH-IOL DPDK Community Lab

^ permalink raw reply	[flat|nested] 2+ messages in thread

* [dpdk-test-report] |FAILURE| pw72452 [PATCH] [v2] eal: fix memory leak when removing event_cb
@ 2020-06-30 15:19 dpdklab
  0 siblings, 0 replies; 2+ messages in thread
From: dpdklab @ 2020-06-30 15:19 UTC (permalink / raw)
  To: Ajit Khaparde, Test Report; +Cc: dpdk-test-reports

[-- Attachment #1: Type: text/plain, Size: 985 bytes --]

Test-Label: iol-broadcom-Performance
Test-Status: FAILURE
http://dpdk.org/patch/72452

_Performance Testing issues_

Submitter: wangyunjian <wangyunjian@huawei.com>
Date: Tuesday, June 30 2020 11:56:41 
DPDK git baseline: Repo:dpdk
  Branch: master
  CommitID:014a7ec6c418eaf24a13be8ade8229638ddc6eed

72452 --> performance testing fail

Test environment and result as below:

Ubuntu 18.04
Kernel: 4.15.0-65-generic
Compiler: gcc gcc (Ubuntu 7.4.0-1ubuntu1~18.04.1) 7.4.0
NIC: Broadcom Inc. brcm_57414 25000 Mbps
Target: x86_64-native-linuxapp-gcc
Fail/Total: 0/0

Detail performance results: 
There were no deltas reported. There may have been an issue with the test harness. If logs are available, download them from the ci website for more information.

To view detailed results, visit:
https://lab.dpdk.org/results/dashboard/patchsets/11739/

UNH-IOL DPDK Community Lab

To manage your email subscriptions, visit: 
https://lab.dpdk.org/results/dashboard/preferences/subscriptions/

^ permalink raw reply	[flat|nested] 2+ messages in thread

end of thread, back to index

Thread overview: 2+ messages (download: mbox.gz / follow: Atom feed)
-- links below jump to the message on this page --
2020-06-30 12:27 [dpdk-test-report] |FAILURE| pw72452 [PATCH] [v2] eal: fix memory leak when removing event_cb dpdklab
2020-06-30 15:19 dpdklab

automatic DPDK test reports

Archives are clonable:
	git clone --mirror http://inbox.dpdk.org/test-report/0 test-report/git/0.git

	# If you have public-inbox 1.1+ installed, you may
	# initialize and index your mirror using the following commands:
	public-inbox-init -V2 test-report test-report/ http://inbox.dpdk.org/test-report \
		test-report@dpdk.org
	public-inbox-index test-report


Newsgroup available over NNTP:
	nntp://inbox.dpdk.org/inbox.dpdk.test-report


AGPL code for this site: git clone https://public-inbox.org/ public-inbox