automatic DPDK test reports
 help / color / Atom feed
* [dpdk-test-report] |FAILURE| pw77863 [PATCH] [v4] net/virtio: fix wrong variable assignment in helper macro
@ 2020-09-16  6:31 dpdklab
  0 siblings, 0 replies; only message in thread
From: dpdklab @ 2020-09-16  6:31 UTC (permalink / raw)
  To: test-report; +Cc: dpdk-test-reports

[-- Attachment #1: Type: text/plain, Size: 25915 bytes --]

Test-Label: Performance-Testing
Test-Status: FAILURE
http://dpdk.org/patch/77863

_build patch failure_

Submitter: Vipul Ashri <vipul.ashri@oracle.com>
Date: Wednesday, September 16 2020 05:57:24 
Applied on: CommitID:89f6a4be217f22f7592b616d5d69c775530dce88
Apply patch set 77863 failed:

[1/748] Linking static target drivers/libtmp_rte_pmd_softnic.a.
[2/748] Linking static target drivers/libtmp_rte_pmd_tap.a.
[3/748] Linking static target drivers/net/thunderx/base/libnicvf_base.a.
[4/748] Linking static target drivers/libtmp_rte_pmd_vdev_netvsc.a.
[5/748] Linking static target drivers/libtmp_rte_pmd_vhost.a.
[6/748] Linking static target drivers/libtmp_rte_pmd_mlx5.a.
[7/748] Linking static target drivers/librte_pmd_octeontx2.a.
[8/748] Linking static target drivers/libtmp_rte_pmd_thunderx.a.
[9/748] Generating rte_pmd_vhost.pmd.c with a custom command.
[10/748] Generating rte_pmd_vdev_netvsc.pmd.c with a custom command.
[11/748] Compiling C object 'drivers/a715181@@rte_pmd_vhost@sta/meson-generated_.._rte_pmd_vhost.pmd.c.o'.
[12/748] Generating rte_pmd_tap.pmd.c with a custom command.
[13/748] Compiling C object 'drivers/a715181@@rte_pmd_vdev_netvsc@sha/meson-generated_.._rte_pmd_vdev_netvsc.pmd.c.o'.
[14/748] Generating rte_pmd_thunderx.pmd.c with a custom command.
[15/748] Compiling C object 'drivers/a715181@@rte_pmd_tap@sta/meson-generated_.._rte_pmd_tap.pmd.c.o'.
[16/748] Compiling C object 'drivers/a715181@@rte_pmd_vdev_netvsc@sta/meson-generated_.._rte_pmd_vdev_netvsc.pmd.c.o'.
[17/748] Compiling C object 'drivers/a715181@@rte_pmd_thunderx@sta/meson-generated_.._rte_pmd_thunderx.pmd.c.o'.
[18/748] Compiling C object 'drivers/a715181@@rte_pmd_tap@sha/meson-generated_.._rte_pmd_tap.pmd.c.o'.
[19/748] Linking static target drivers/librte_pmd_tap.a.
[20/748] Compiling C object 'drivers/a715181@@rte_pmd_thunderx@sha/meson-generated_.._rte_pmd_thunderx.pmd.c.o'.
[21/748] Linking static target drivers/librte_pmd_thunderx.a.
[22/748] Linking static target drivers/librte_pmd_vdev_netvsc.a.
[23/748] Linking static target drivers/librte_pmd_vhost.a.
[24/748] Generating rte_pmd_softnic.pmd.c with a custom command.
[25/748] Compiling C object 'drivers/a715181@@rte_pmd_softnic@sta/meson-generated_.._rte_pmd_softnic.pmd.c.o'.
[26/748] Generating rte_pmd_mlx5.pmd.c with a custom command.
[27/748] Linking static target drivers/librte_pmd_softnic.a.
[28/748] Compiling C object 'drivers/net/virtio/20670f1@@virtio_avx512_lib@sta/virtio_rxtx_packed_avx.c.o'.
FAILED: drivers/net/virtio/20670f1@@virtio_avx512_lib@sta/virtio_rxtx_packed_avx.c.o 
cc -Idrivers/net/virtio/20670f1@@virtio_avx512_lib@sta -Idrivers/net/virtio -I../drivers/net/virtio -Ilib/librte_ethdev -I../lib/librte_ethdev -I. -I../ -Iconfig -I../config -Ilib/librte_eal/include -I../lib/librte_eal/include -Ilib/librte_eal/linux/include -I../lib/librte_eal/linux/include -Ilib/librte_eal/x86/include -I../lib/librte_eal/x86/include -Ilib/librte_eal/common -I../lib/librte_eal/common -Ilib/librte_eal -I../lib/librte_eal -Ilib/librte_kvargs -I../lib/librte_kvargs -Ilib/librte_telemetry/../librte_metrics -I../lib/librte_telemetry/../librte_metrics -Ilib/librte_telemetry -I../lib/librte_telemetry -Ilib/librte_net -I../lib/librte_net -Ilib/librte_mbuf -I../lib/librte_mbuf -Ilib/librte_mempool -I../lib/librte_mempool -Ilib/librte_ring -I../lib/librte_ring -Ilib/librte_meter -I../lib/librte_meter -Idrivers/bus/pci -I../drivers/bus/pci -I../drivers/bus/pci/linux -Ilib/librte_pci -I../lib/librte_pci -fdiagnostics-color=always -pipe -D_FILE_OFFSET_BITS=64 -Wall -Winvalid-pch -O3 -include rte_config.h -Wextra -Wcast-qual -Wdeprecated -Wformat-nonliteral -Wformat-security -Wmissing-declarations -Wmissing-prototypes -Wnested-externs -Wold-style-definition -Wpointer-arith -Wsign-compare -Wstrict-prototypes -Wundef -Wwrite-strings -Wno-missing-field-initializers -D_GNU_SOURCE -fPIC -march=native -DALLOW_EXPERIMENTAL_API -DALLOW_INTERNAL_API -Wno-format-truncation -DCC_AVX512_SUPPORT -mavx512f -mavx512bw -mavx512vl -MD -MQ 'drivers/net/virtio/20670f1@@virtio_avx512_lib@sta/virtio_rxtx_packed_avx.c.o' -MF 'drivers/net/virtio/20670f1@@virtio_avx512_lib@sta/virtio_rxtx_packed_avx.c.o.d' -o 'drivers/net/virtio/20670f1@@virtio_avx512_lib@sta/virtio_rxtx_packed_avx.c.o' -c ../drivers/net/virtio/virtio_rxtx_packed_avx.c
In file included from ../drivers/net/virtio/virtio_rxtx_packed_avx.c:16:0:
../drivers/net/virtio/virtqueue.h:615:1: error: expected identifier or ‘(’ before ‘}’ token
 } while (0)
 ^
../drivers/net/virtio/virtqueue.h:615:3: error: expected identifier or ‘(’ before ‘while’
 } while (0)
   ^~~~~
[29/748] Compiling C object 'drivers/a715181@@tmp_rte_pmd_virtio@sta/net_virtio_virtio_rxtx_simple.c.o'.
FAILED: drivers/a715181@@tmp_rte_pmd_virtio@sta/net_virtio_virtio_rxtx_simple.c.o 
cc -Idrivers/a715181@@tmp_rte_pmd_virtio@sta -Idrivers -I../drivers -Idrivers/net/virtio -I../drivers/net/virtio -Ilib/librte_ethdev -I../lib/librte_ethdev -I. -I../ -Iconfig -I../config -Ilib/librte_eal/include -I../lib/librte_eal/include -Ilib/librte_eal/linux/include -I../lib/librte_eal/linux/include -Ilib/librte_eal/x86/include -I../lib/librte_eal/x86/include -Ilib/librte_eal/common -I../lib/librte_eal/common -Ilib/librte_eal -I../lib/librte_eal -Ilib/librte_kvargs -I../lib/librte_kvargs -Ilib/librte_telemetry/../librte_metrics -I../lib/librte_telemetry/../librte_metrics -Ilib/librte_telemetry -I../lib/librte_telemetry -Ilib/librte_net -I../lib/librte_net -Ilib/librte_mbuf -I../lib/librte_mbuf -Ilib/librte_mempool -I../lib/librte_mempool -Ilib/librte_ring -I../lib/librte_ring -Ilib/librte_meter -I../lib/librte_meter -Idrivers/bus/pci -I../drivers/bus/pci -I../drivers/bus/pci/linux -Ilib/librte_pci -I../lib/librte_pci -Idrivers/bus/vdev -I../drivers/bus/vdev -fdiagnostics-color=always -pipe -D_FILE_OFFSET_BITS=64 -Wall -Winvalid-pch -O3 -include rte_config.h -Wextra -Wcast-qual -Wdeprecated -Wformat-nonliteral -Wformat-security -Wmissing-declarations -Wmissing-prototypes -Wnested-externs -Wold-style-definition -Wpointer-arith -Wsign-compare -Wstrict-prototypes -Wundef -Wwrite-strings -Wno-missing-field-initializers -D_GNU_SOURCE -fPIC -march=native -DALLOW_EXPERIMENTAL_API -DALLOW_INTERNAL_API -Wno-format-truncation -DCC_AVX512_SUPPORT -MD -MQ 'drivers/a715181@@tmp_rte_pmd_virtio@sta/net_virtio_virtio_rxtx_simple.c.o' -MF 'drivers/a715181@@tmp_rte_pmd_virtio@sta/net_virtio_virtio_rxtx_simple.c.o.d' -o 'drivers/a715181@@tmp_rte_pmd_virtio@sta/net_virtio_virtio_rxtx_simple.c.o' -c ../drivers/net/virtio/virtio_rxtx_simple.c
In file included from ../drivers/net/virtio/virtio_rxtx_simple.h:12:0,
                 from ../drivers/net/virtio/virtio_rxtx_simple.c:24:
../drivers/net/virtio/virtqueue.h:615:1: error: expected identifier or ‘(’ before ‘}’ token
 } while (0)
 ^
../drivers/net/virtio/virtqueue.h:615:3: error: expected identifier or ‘(’ before ‘while’
 } while (0)
   ^~~~~
[30/748] Compiling C object 'drivers/a715181@@rte_pmd_mlx5@sta/meson-generated_.._rte_pmd_mlx5.pmd.c.o'.
[31/748] Compiling C object 'drivers/a715181@@tmp_rte_pmd_virtio@sta/net_virtio_virtio_pci.c.o'.
FAILED: drivers/a715181@@tmp_rte_pmd_virtio@sta/net_virtio_virtio_pci.c.o 
cc -Idrivers/a715181@@tmp_rte_pmd_virtio@sta -Idrivers -I../drivers -Idrivers/net/virtio -I../drivers/net/virtio -Ilib/librte_ethdev -I../lib/librte_ethdev -I. -I../ -Iconfig -I../config -Ilib/librte_eal/include -I../lib/librte_eal/include -Ilib/librte_eal/linux/include -I../lib/librte_eal/linux/include -Ilib/librte_eal/x86/include -I../lib/librte_eal/x86/include -Ilib/librte_eal/common -I../lib/librte_eal/common -Ilib/librte_eal -I../lib/librte_eal -Ilib/librte_kvargs -I../lib/librte_kvargs -Ilib/librte_telemetry/../librte_metrics -I../lib/librte_telemetry/../librte_metrics -Ilib/librte_telemetry -I../lib/librte_telemetry -Ilib/librte_net -I../lib/librte_net -Ilib/librte_mbuf -I../lib/librte_mbuf -Ilib/librte_mempool -I../lib/librte_mempool -Ilib/librte_ring -I../lib/librte_ring -Ilib/librte_meter -I../lib/librte_meter -Idrivers/bus/pci -I../drivers/bus/pci -I../drivers/bus/pci/linux -Ilib/librte_pci -I../lib/librte_pci -Idrivers/bus/vdev -I../drivers/bus/vdev -fdiagnostics-color=always -pipe -D_FILE_OFFSET_BITS=64 -Wall -Winvalid-pch -O3 -include rte_config.h -Wextra -Wcast-qual -Wdeprecated -Wformat-nonliteral -Wformat-security -Wmissing-declarations -Wmissing-prototypes -Wnested-externs -Wold-style-definition -Wpointer-arith -Wsign-compare -Wstrict-prototypes -Wundef -Wwrite-strings -Wno-missing-field-initializers -D_GNU_SOURCE -fPIC -march=native -DALLOW_EXPERIMENTAL_API -DALLOW_INTERNAL_API -Wno-format-truncation -DCC_AVX512_SUPPORT -MD -MQ 'drivers/a715181@@tmp_rte_pmd_virtio@sta/net_virtio_virtio_pci.c.o' -MF 'drivers/a715181@@tmp_rte_pmd_virtio@sta/net_virtio_virtio_pci.c.o.d' -o 'drivers/a715181@@tmp_rte_pmd_virtio@sta/net_virtio_virtio_pci.c.o' -c ../drivers/net/virtio/virtio_pci.c
In file included from ../drivers/net/virtio/virtio_pci.c:16:0:
../drivers/net/virtio/virtqueue.h:615:1: error: expected identifier or ‘(’ before ‘}’ token
 } while (0)
 ^
../drivers/net/virtio/virtqueue.h:615:3: error: expected identifier or ‘(’ before ‘while’
 } while (0)
   ^~~~~
[32/748] Compiling C object 'drivers/a715181@@tmp_rte_pmd_virtio@sta/net_virtio_virtio_rxtx.c.o'.
FAILED: drivers/a715181@@tmp_rte_pmd_virtio@sta/net_virtio_virtio_rxtx.c.o 
cc -Idrivers/a715181@@tmp_rte_pmd_virtio@sta -Idrivers -I../drivers -Idrivers/net/virtio -I../drivers/net/virtio -Ilib/librte_ethdev -I../lib/librte_ethdev -I. -I../ -Iconfig -I../config -Ilib/librte_eal/include -I../lib/librte_eal/include -Ilib/librte_eal/linux/include -I../lib/librte_eal/linux/include -Ilib/librte_eal/x86/include -I../lib/librte_eal/x86/include -Ilib/librte_eal/common -I../lib/librte_eal/common -Ilib/librte_eal -I../lib/librte_eal -Ilib/librte_kvargs -I../lib/librte_kvargs -Ilib/librte_telemetry/../librte_metrics -I../lib/librte_telemetry/../librte_metrics -Ilib/librte_telemetry -I../lib/librte_telemetry -Ilib/librte_net -I../lib/librte_net -Ilib/librte_mbuf -I../lib/librte_mbuf -Ilib/librte_mempool -I../lib/librte_mempool -Ilib/librte_ring -I../lib/librte_ring -Ilib/librte_meter -I../lib/librte_meter -Idrivers/bus/pci -I../drivers/bus/pci -I../drivers/bus/pci/linux -Ilib/librte_pci -I../lib/librte_pci -Idrivers/bus/vdev -I../drivers/bus/vdev -fdiagnostics-color=always -pipe -D_FILE_OFFSET_BITS=64 -Wall -Winvalid-pch -O3 -include rte_config.h -Wextra -Wcast-qual -Wdeprecated -Wformat-nonliteral -Wformat-security -Wmissing-declarations -Wmissing-prototypes -Wnested-externs -Wold-style-definition -Wpointer-arith -Wsign-compare -Wstrict-prototypes -Wundef -Wwrite-strings -Wno-missing-field-initializers -D_GNU_SOURCE -fPIC -march=native -DALLOW_EXPERIMENTAL_API -DALLOW_INTERNAL_API -Wno-format-truncation -DCC_AVX512_SUPPORT -MD -MQ 'drivers/a715181@@tmp_rte_pmd_virtio@sta/net_virtio_virtio_rxtx.c.o' -MF 'drivers/a715181@@tmp_rte_pmd_virtio@sta/net_virtio_virtio_rxtx.c.o.d' -o 'drivers/a715181@@tmp_rte_pmd_virtio@sta/net_virtio_virtio_rxtx.c.o' -c ../drivers/net/virtio/virtio_rxtx.c
In file included from ../drivers/net/virtio/virtio_rxtx.c:31:0:
../drivers/net/virtio/virtqueue.h:615:1: error: expected identifier or ‘(’ before ‘}’ token
 } while (0)
 ^
../drivers/net/virtio/virtqueue.h:615:3: error: expected identifier or ‘(’ before ‘while’
 } while (0)
   ^~~~~
[33/748] Compiling C object 'drivers/a715181@@tmp_rte_pmd_virtio@sta/net_virtio_virtio_rxtx_simple_sse.c.o'.
FAILED: drivers/a715181@@tmp_rte_pmd_virtio@sta/net_virtio_virtio_rxtx_simple_sse.c.o 
cc -Idrivers/a715181@@tmp_rte_pmd_virtio@sta -Idrivers -I../drivers -Idrivers/net/virtio -I../drivers/net/virtio -Ilib/librte_ethdev -I../lib/librte_ethdev -I. -I../ -Iconfig -I../config -Ilib/librte_eal/include -I../lib/librte_eal/include -Ilib/librte_eal/linux/include -I../lib/librte_eal/linux/include -Ilib/librte_eal/x86/include -I../lib/librte_eal/x86/include -Ilib/librte_eal/common -I../lib/librte_eal/common -Ilib/librte_eal -I../lib/librte_eal -Ilib/librte_kvargs -I../lib/librte_kvargs -Ilib/librte_telemetry/../librte_metrics -I../lib/librte_telemetry/../librte_metrics -Ilib/librte_telemetry -I../lib/librte_telemetry -Ilib/librte_net -I../lib/librte_net -Ilib/librte_mbuf -I../lib/librte_mbuf -Ilib/librte_mempool -I../lib/librte_mempool -Ilib/librte_ring -I../lib/librte_ring -Ilib/librte_meter -I../lib/librte_meter -Idrivers/bus/pci -I../drivers/bus/pci -I../drivers/bus/pci/linux -Ilib/librte_pci -I../lib/librte_pci -Idrivers/bus/vdev -I../drivers/bus/vdev -fdiagnostics-color=always -pipe -D_FILE_OFFSET_BITS=64 -Wall -Winvalid-pch -O3 -include rte_config.h -Wextra -Wcast-qual -Wdeprecated -Wformat-nonliteral -Wformat-security -Wmissing-declarations -Wmissing-prototypes -Wnested-externs -Wold-style-definition -Wpointer-arith -Wsign-compare -Wstrict-prototypes -Wundef -Wwrite-strings -Wno-missing-field-initializers -D_GNU_SOURCE -fPIC -march=native -DALLOW_EXPERIMENTAL_API -DALLOW_INTERNAL_API -Wno-format-truncation -DCC_AVX512_SUPPORT -MD -MQ 'drivers/a715181@@tmp_rte_pmd_virtio@sta/net_virtio_virtio_rxtx_simple_sse.c.o' -MF 'drivers/a715181@@tmp_rte_pmd_virtio@sta/net_virtio_virtio_rxtx_simple_sse.c.o.d' -o 'drivers/a715181@@tmp_rte_pmd_virtio@sta/net_virtio_virtio_rxtx_simple_sse.c.o' -c ../drivers/net/virtio/virtio_rxtx_simple_sse.c
In file included from ../drivers/net/virtio/virtio_rxtx_simple.h:12:0,
                 from ../drivers/net/virtio/virtio_rxtx_simple_sse.c:26:
../drivers/net/virtio/virtqueue.h:615:1: error: expected identifier or ‘(’ before ‘}’ token
 } while (0)
 ^
../drivers/net/virtio/virtqueue.h:615:3: error: expected identifier or ‘(’ before ‘while’
 } while (0)
   ^~~~~
[34/748] Compiling C object 'drivers/a715181@@tmp_rte_pmd_virtio@sta/net_virtio_virtio_ethdev.c.o'.
FAILED: drivers/a715181@@tmp_rte_pmd_virtio@sta/net_virtio_virtio_ethdev.c.o 
cc -Idrivers/a715181@@tmp_rte_pmd_virtio@sta -Idrivers -I../drivers -Idrivers/net/virtio -I../drivers/net/virtio -Ilib/librte_ethdev -I../lib/librte_ethdev -I. -I../ -Iconfig -I../config -Ilib/librte_eal/include -I../lib/librte_eal/include -Ilib/librte_eal/linux/include -I../lib/librte_eal/linux/include -Ilib/librte_eal/x86/include -I../lib/librte_eal/x86/include -Ilib/librte_eal/common -I../lib/librte_eal/common -Ilib/librte_eal -I../lib/librte_eal -Ilib/librte_kvargs -I../lib/librte_kvargs -Ilib/librte_telemetry/../librte_metrics -I../lib/librte_telemetry/../librte_metrics -Ilib/librte_telemetry -I../lib/librte_telemetry -Ilib/librte_net -I../lib/librte_net -Ilib/librte_mbuf -I../lib/librte_mbuf -Ilib/librte_mempool -I../lib/librte_mempool -Ilib/librte_ring -I../lib/librte_ring -Ilib/librte_meter -I../lib/librte_meter -Idrivers/bus/pci -I../drivers/bus/pci -I../drivers/bus/pci/linux -Ilib/librte_pci -I../lib/librte_pci -Idrivers/bus/vdev -I../drivers/bus/vdev -fdiagnostics-color=always -pipe -D_FILE_OFFSET_BITS=64 -Wall -Winvalid-pch -O3 -include rte_config.h -Wextra -Wcast-qual -Wdeprecated -Wformat-nonliteral -Wformat-security -Wmissing-declarations -Wmissing-prototypes -Wnested-externs -Wold-style-definition -Wpointer-arith -Wsign-compare -Wstrict-prototypes -Wundef -Wwrite-strings -Wno-missing-field-initializers -D_GNU_SOURCE -fPIC -march=native -DALLOW_EXPERIMENTAL_API -DALLOW_INTERNAL_API -Wno-format-truncation -DCC_AVX512_SUPPORT -MD -MQ 'drivers/a715181@@tmp_rte_pmd_virtio@sta/net_virtio_virtio_ethdev.c.o' -MF 'drivers/a715181@@tmp_rte_pmd_virtio@sta/net_virtio_virtio_ethdev.c.o.d' -o 'drivers/a715181@@tmp_rte_pmd_virtio@sta/net_virtio_virtio_ethdev.c.o' -c ../drivers/net/virtio/virtio_ethdev.c
In file included from ../drivers/net/virtio/virtio_ethdev.c:36:0:
../drivers/net/virtio/virtqueue.h:615:1: error: expected identifier or ‘(’ before ‘}’ token
 } while (0)
 ^
../drivers/net/virtio/virtqueue.h:615:3: error: expected identifier or ‘(’ before ‘while’
 } while (0)
   ^~~~~
[35/748] Compiling C object 'drivers/a715181@@tmp_rte_pmd_virtio@sta/net_virtio_virtio_user_ethdev.c.o'.
FAILED: drivers/a715181@@tmp_rte_pmd_virtio@sta/net_virtio_virtio_user_ethdev.c.o 
cc -Idrivers/a715181@@tmp_rte_pmd_virtio@sta -Idrivers -I../drivers -Idrivers/net/virtio -I../drivers/net/virtio -Ilib/librte_ethdev -I../lib/librte_ethdev -I. -I../ -Iconfig -I../config -Ilib/librte_eal/include -I../lib/librte_eal/include -Ilib/librte_eal/linux/include -I../lib/librte_eal/linux/include -Ilib/librte_eal/x86/include -I../lib/librte_eal/x86/include -Ilib/librte_eal/common -I../lib/librte_eal/common -Ilib/librte_eal -I../lib/librte_eal -Ilib/librte_kvargs -I../lib/librte_kvargs -Ilib/librte_telemetry/../librte_metrics -I../lib/librte_telemetry/../librte_metrics -Ilib/librte_telemetry -I../lib/librte_telemetry -Ilib/librte_net -I../lib/librte_net -Ilib/librte_mbuf -I../lib/librte_mbuf -Ilib/librte_mempool -I../lib/librte_mempool -Ilib/librte_ring -I../lib/librte_ring -Ilib/librte_meter -I../lib/librte_meter -Idrivers/bus/pci -I../drivers/bus/pci -I../drivers/bus/pci/linux -Ilib/librte_pci -I../lib/librte_pci -Idrivers/bus/vdev -I../drivers/bus/vdev -fdiagnostics-color=always -pipe -D_FILE_OFFSET_BITS=64 -Wall -Winvalid-pch -O3 -include rte_config.h -Wextra -Wcast-qual -Wdeprecated -Wformat-nonliteral -Wformat-security -Wmissing-declarations -Wmissing-prototypes -Wnested-externs -Wold-style-definition -Wpointer-arith -Wsign-compare -Wstrict-prototypes -Wundef -Wwrite-strings -Wno-missing-field-initializers -D_GNU_SOURCE -fPIC -march=native -DALLOW_EXPERIMENTAL_API -DALLOW_INTERNAL_API -Wno-format-truncation -DCC_AVX512_SUPPORT -MD -MQ 'drivers/a715181@@tmp_rte_pmd_virtio@sta/net_virtio_virtio_user_ethdev.c.o' -MF 'drivers/a715181@@tmp_rte_pmd_virtio@sta/net_virtio_virtio_user_ethdev.c.o.d' -o 'drivers/a715181@@tmp_rte_pmd_virtio@sta/net_virtio_virtio_user_ethdev.c.o' -c ../drivers/net/virtio/virtio_user_ethdev.c
In file included from ../drivers/net/virtio/virtio_user_ethdev.c:21:0:
../drivers/net/virtio/virtqueue.h:615:1: error: expected identifier or ‘(’ before ‘}’ token
 } while (0)
 ^
../drivers/net/virtio/virtqueue.h:615:3: error: expected identifier or ‘(’ before ‘while’
 } while (0)
   ^~~~~
[36/748] Compiling C object 'drivers/a715181@@rte_pmd_mlx5@sha/meson-generated_.._rte_pmd_mlx5.pmd.c.o'.
[37/748] Compiling C object 'drivers/a715181@@tmp_rte_pmd_virtio@sta/net_virtio_virtio_user_vhost_kernel.c.o'.
FAILED: drivers/a715181@@tmp_rte_pmd_virtio@sta/net_virtio_virtio_user_vhost_kernel.c.o 
cc -Idrivers/a715181@@tmp_rte_pmd_virtio@sta -Idrivers -I../drivers -Idrivers/net/virtio -I../drivers/net/virtio -Ilib/librte_ethdev -I../lib/librte_ethdev -I. -I../ -Iconfig -I../config -Ilib/librte_eal/include -I../lib/librte_eal/include -Ilib/librte_eal/linux/include -I../lib/librte_eal/linux/include -Ilib/librte_eal/x86/include -I../lib/librte_eal/x86/include -Ilib/librte_eal/common -I../lib/librte_eal/common -Ilib/librte_eal -I../lib/librte_eal -Ilib/librte_kvargs -I../lib/librte_kvargs -Ilib/librte_telemetry/../librte_metrics -I../lib/librte_telemetry/../librte_metrics -Ilib/librte_telemetry -I../lib/librte_telemetry -Ilib/librte_net -I../lib/librte_net -Ilib/librte_mbuf -I../lib/librte_mbuf -Ilib/librte_mempool -I../lib/librte_mempool -Ilib/librte_ring -I../lib/librte_ring -Ilib/librte_meter -I../lib/librte_meter -Idrivers/bus/pci -I../drivers/bus/pci -I../drivers/bus/pci/linux -Ilib/librte_pci -I../lib/librte_pci -Idrivers/bus/vdev -I../drivers/bus/vdev -fdiagnostics-color=always -pipe -D_FILE_OFFSET_BITS=64 -Wall -Winvalid-pch -O3 -include rte_config.h -Wextra -Wcast-qual -Wdeprecated -Wformat-nonliteral -Wformat-security -Wmissing-declarations -Wmissing-prototypes -Wnested-externs -Wold-style-definition -Wpointer-arith -Wsign-compare -Wstrict-prototypes -Wundef -Wwrite-strings -Wno-missing-field-initializers -D_GNU_SOURCE -fPIC -march=native -DALLOW_EXPERIMENTAL_API -DALLOW_INTERNAL_API -Wno-format-truncation -DCC_AVX512_SUPPORT -MD -MQ 'drivers/a715181@@tmp_rte_pmd_virtio@sta/net_virtio_virtio_user_vhost_kernel.c.o' -MF 'drivers/a715181@@tmp_rte_pmd_virtio@sta/net_virtio_virtio_user_vhost_kernel.c.o.d' -o 'drivers/a715181@@tmp_rte_pmd_virtio@sta/net_virtio_virtio_user_vhost_kernel.c.o' -c ../drivers/net/virtio/virtio_user/vhost_kernel.c
In file included from ../drivers/net/virtio/virtio_user/vhost.h:14:0,
                 from ../drivers/net/virtio/virtio_user/vhost_kernel.c:12:
../drivers/net/virtio/virtio_user/../virtqueue.h:615:1: error: expected identifier or ‘(’ before ‘}’ token
 } while (0)
 ^
../drivers/net/virtio/virtio_user/../virtqueue.h:615:3: error: expected identifier or ‘(’ before ‘while’
 } while (0)
   ^~~~~
[38/748] Compiling C object 'drivers/a715181@@tmp_rte_pmd_virtio@sta/net_virtio_virtio_user_vhost_user.c.o'.
FAILED: drivers/a715181@@tmp_rte_pmd_virtio@sta/net_virtio_virtio_user_vhost_user.c.o 
cc -Idrivers/a715181@@tmp_rte_pmd_virtio@sta -Idrivers -I../drivers -Idrivers/net/virtio -I../drivers/net/virtio -Ilib/librte_ethdev -I../lib/librte_ethdev -I. -I../ -Iconfig -I../config -Ilib/librte_eal/include -I../lib/librte_eal/include -Ilib/librte_eal/linux/include -I../lib/librte_eal/linux/include -Ilib/librte_eal/x86/include -I../lib/librte_eal/x86/include -Ilib/librte_eal/common -I../lib/librte_eal/common -Ilib/librte_eal -I../lib/librte_eal -Ilib/librte_kvargs -I../lib/librte_kvargs -Ilib/librte_telemetry/../librte_metrics -I../lib/librte_telemetry/../librte_metrics -Ilib/librte_telemetry -I../lib/librte_telemetry -Ilib/librte_net -I../lib/librte_net -Ilib/librte_mbuf -I../lib/librte_mbuf -Ilib/librte_mempool -I../lib/librte_mempool -Ilib/librte_ring -I../lib/librte_ring -Ilib/librte_meter -I../lib/librte_meter -Idrivers/bus/pci -I../drivers/bus/pci -I../drivers/bus/pci/linux -Ilib/librte_pci -I../lib/librte_pci -Idrivers/bus/vdev -I../drivers/bus/vdev -fdiagnostics-color=always -pipe -D_FILE_OFFSET_BITS=64 -Wall -Winvalid-pch -O3 -include rte_config.h -Wextra -Wcast-qual -Wdeprecated -Wformat-nonliteral -Wformat-security -Wmissing-declarations -Wmissing-prototypes -Wnested-externs -Wold-style-definition -Wpointer-arith -Wsign-compare -Wstrict-prototypes -Wundef -Wwrite-strings -Wno-missing-field-initializers -D_GNU_SOURCE -fPIC -march=native -DALLOW_EXPERIMENTAL_API -DALLOW_INTERNAL_API -Wno-format-truncation -DCC_AVX512_SUPPORT -MD -MQ 'drivers/a715181@@tmp_rte_pmd_virtio@sta/net_virtio_virtio_user_vhost_user.c.o' -MF 'drivers/a715181@@tmp_rte_pmd_virtio@sta/net_virtio_virtio_user_vhost_user.c.o.d' -o 'drivers/a715181@@tmp_rte_pmd_virtio@sta/net_virtio_virtio_user_vhost_user.c.o' -c ../drivers/net/virtio/virtio_user/vhost_user.c
In file included from ../drivers/net/virtio/virtio_user/vhost.h:14:0,
                 from ../drivers/net/virtio/virtio_user/vhost_user.c:17:
../drivers/net/virtio/virtio_user/../virtqueue.h:615:1: error: expected identifier or ‘(’ before ‘}’ token
 } while (0)
 ^
../drivers/net/virtio/virtio_user/../virtqueue.h:615:3: error: expected identifier or ‘(’ before ‘while’
 } while (0)
   ^~~~~
[39/748] Compiling C object 'drivers/a715181@@tmp_rte_pmd_virtio@sta/net_virtio_virtqueue.c.o'.
FAILED: drivers/a715181@@tmp_rte_pmd_virtio@sta/net_virtio_virtqueue.c.o 
cc -Idrivers/a715181@@tmp_rte_pmd_virtio@sta -Idrivers -I../drivers -Idrivers/net/virtio -I../drivers/net/virtio -Ilib/librte_ethdev -I../lib/librte_ethdev -I. -I../ -Iconfig -I../config -Ilib/librte_eal/include -I../lib/librte_eal/include -Ilib/librte_eal/linux/include -I../lib/librte_eal/linux/include -Ilib/librte_eal/x86/include -I../lib/librte_eal/x86/include -Ilib/librte_eal/common -I../lib/librte_eal/common -Ilib/librte_eal -I../lib/librte_eal -Ilib/librte_kvargs -I../lib/librte_kvargs -Ilib/librte_telemetry/../librte_metrics -I../lib/librte_telemetry/../librte_metrics -Ilib/librte_telemetry -I../lib/librte_telemetry -Ilib/librte_net -I../lib/librte_net -Ilib/librte_mbuf -I../lib/librte_mbuf -Ilib/librte_mempool -I../lib/librte_mempool -Ilib/librte_ring -I../lib/librte_ring -Ilib/librte_meter -I../lib/librte_meter -Idrivers/bus/pci -I../drivers/bus/pci -I../drivers/bus/pci/linux -Ilib/librte_pci -I../lib/librte_pci -Idrivers/bus/vdev -I../drivers/bus/vdev -fdiagnostics-color=always -pipe -D_FILE_OFFSET_BITS=64 -Wall -Winvalid-pch -O3 -include rte_config.h -Wextra -Wcast-qual -Wdeprecated -Wformat-nonliteral -Wformat-security -Wmissing-declarations -Wmissing-prototypes -Wnested-externs -Wold-style-definition -Wpointer-arith -Wsign-compare -Wstrict-prototypes -Wundef -Wwrite-strings -Wno-missing-field-initializers -D_GNU_SOURCE -fPIC -march=native -DALLOW_EXPERIMENTAL_API -DALLOW_INTERNAL_API -Wno-format-truncation -DCC_AVX512_SUPPORT -MD -MQ 'drivers/a715181@@tmp_rte_pmd_virtio@sta/net_virtio_virtqueue.c.o' -MF 'drivers/a715181@@tmp_rte_pmd_virtio@sta/net_virtio_virtqueue.c.o.d' -o 'drivers/a715181@@tmp_rte_pmd_virtio@sta/net_virtio_virtqueue.c.o' -c ../drivers/net/virtio/virtqueue.c
In file included from ../drivers/net/virtio/virtqueue.c:8:0:
../drivers/net/virtio/virtqueue.h:615:1: error: expected identifier or ‘(’ before ‘}’ token
 } while (0)
 ^
../drivers/net/virtio/virtqueue.h:615:3: error: expected identifier or ‘(’ before ‘while’
 } while (0)
   ^~~~~
[40/748] Generating rte_pmd_sfc.sym_chk with a meson_exe.py custom command.
[41/748] Generating rte_pmd_octeontx2.sym_chk with a meson_exe.py custom command.
[42/748] Generating rte_pmd_thunderx.sym_chk with a meson_exe.py custom command.
[43/748] Generating rte_pmd_tap.sym_chk with a meson_exe.py custom command.
[44/748] Generating rte_pmd_vdev_netvsc.sym_chk with a meson_exe.py custom command.
[45/748] Generating rte_pmd_vhost.sym_chk with a meson_exe.py custom command.
ninja: build stopped: subcommand failed.

https://lab.dpdk.org/results/dashboard/patchsets/13103/

UNH-IOL DPDK Community Lab

^ permalink raw reply	[flat|nested] only message in thread

only message in thread, back to index

Thread overview: (only message) (download: mbox.gz / follow: Atom feed)
-- links below jump to the message on this page --
2020-09-16  6:31 [dpdk-test-report] |FAILURE| pw77863 [PATCH] [v4] net/virtio: fix wrong variable assignment in helper macro dpdklab

automatic DPDK test reports

Archives are clonable:
	git clone --mirror http://inbox.dpdk.org/test-report/0 test-report/git/0.git

	# If you have public-inbox 1.1+ installed, you may
	# initialize and index your mirror using the following commands:
	public-inbox-init -V2 test-report test-report/ http://inbox.dpdk.org/test-report \
		test-report@dpdk.org
	public-inbox-index test-report


Newsgroup available over NNTP:
	nntp://inbox.dpdk.org/inbox.dpdk.test-report


AGPL code for this site: git clone https://public-inbox.org/ public-inbox