automatic DPDK test reports
 help / color / Atom feed
* [dpdk-test-report] |FAILURE| pw81223-81243 [PATCH] [v5, 22/22] doc: Add new DLB eventdev driver to relnotes
@ 2020-10-17 19:39 dpdklab
  0 siblings, 0 replies; only message in thread
From: dpdklab @ 2020-10-17 19:39 UTC (permalink / raw)
  To: test-report; +Cc: dpdk-test-reports

[-- Attachment #1: Type: text/plain, Size: 7463 bytes --]

Test-Label: Performance-Testing
Test-Status: FAILURE
http://dpdk.org/patch/81223

_build patch failure_

Submitter: Timothy McDaniel <timothy.mcdaniel@intel.com>
Date: Saturday, October 17 2020 19:04:16 
Applied on: CommitID:0a5a3ba495ce9e4622befb31193bcbd6ef8a0fb0
Apply patch set 81223-81243 failed:

[1/322] Linking static target drivers/libtmp_rte_pmd_dsw_event.a.
[2/322] Linking static target drivers/libtmp_rte_pmd_sw_event.a.
[3/322] Linking static target drivers/libtmp_rte_pmd_mlx5.a.
[4/322] Linking static target drivers/libtmp_rte_pmd_octeontx_event.a.
[5/322] Linking static target drivers/libtmp_rte_pmd_octeontx2_event.a.
[6/322] Generating rte_pmd_dsw_event.pmd.c with a custom command.
[7/322] Generating rte_pmd_bbdev_null_def with a custom command.
[8/322] Generating rte_pmd_dlb_event_def with a custom command.
[9/322] Generating rte_pmd_bbdev_turbo_sw_mingw with a custom command.
[10/322] Generating rte_pmd_bbdev_null_mingw with a custom command.
[11/322] Linking target drivers/librte_pmd_octeontx_crypto.so.21.0.
[12/322] Generating rte_pmd_bbdev_turbo_sw_def with a custom command.
[13/322] Generating rte_pmd_bbdev_fpga_lte_fec_def with a custom command.
[14/322] Linking target drivers/librte_pmd_opdl_event.so.21.0.
[15/322] Compiling C object 'drivers/a715181@@rte_pmd_dsw_event@sta/meson-generated_.._rte_pmd_dsw_event.pmd.c.o'.
[16/322] Compiling C object 'drivers/a715181@@rte_pmd_dsw_event@sha/meson-generated_.._rte_pmd_dsw_event.pmd.c.o'.
[17/322] Generating rte_pmd_sw_event.pmd.c with a custom command.
[18/322] Linking static target drivers/librte_pmd_dsw_event.a.
[19/322] Generating rte_pmd_octeontx_event.pmd.c with a custom command.
[20/322] Generating rte_pmd_bbdev_fpga_lte_fec_mingw with a custom command.
[21/322] Generating rte_pmd_bbdev_fpga_5gnr_fec_def with a custom command.
[22/322] Compiling C object 'drivers/a715181@@rte_pmd_sw_event@sta/meson-generated_.._rte_pmd_sw_event.pmd.c.o'.
[23/322] Generating rte_pmd_bbdev_fpga_5gnr_fec_mingw with a custom command.
[24/322] Compiling C object 'drivers/a715181@@rte_pmd_sw_event@sha/meson-generated_.._rte_pmd_sw_event.pmd.c.o'.
[25/322] Compiling C object 'drivers/a715181@@rte_pmd_octeontx_event@sta/meson-generated_.._rte_pmd_octeontx_event.pmd.c.o'.
[26/322] Generating rte_pmd_octeontx2_event.pmd.c with a custom command.
[27/322] Compiling C object 'drivers/a715181@@rte_pmd_octeontx_event@sha/meson-generated_.._rte_pmd_octeontx_event.pmd.c.o'.
[28/322] Linking static target drivers/librte_pmd_sw_event.a.
[29/322] Linking static target drivers/librte_pmd_octeontx_event.a.
[30/322] Compiling C object 'drivers/a715181@@rte_pmd_octeontx2_event@sta/meson-generated_.._rte_pmd_octeontx2_event.pmd.c.o'.
[31/322] Compiling C object 'app/a172ced@@dpdk-test-cmdline@exe/test-cmdline_commands.c.o'.
[32/322] Compiling C object 'drivers/a715181@@rte_pmd_octeontx2_event@sha/meson-generated_.._rte_pmd_octeontx2_event.pmd.c.o'.
[33/322] Linking static target drivers/librte_pmd_octeontx2_event.a.
[34/322] Compiling C object 'app/a172ced@@dpdk-test-cmdline@exe/test-cmdline_cmdline_test.c.o'.
[35/322] Generating rte_pmd_mlx5.pmd.c with a custom command.
[36/322] Compiling C object 'drivers/a715181@@tmp_rte_pmd_dlb_event@sta/event_dlb_dlb.c.o'.
FAILED: drivers/a715181@@tmp_rte_pmd_dlb_event@sta/event_dlb_dlb.c.o 
cc -Idrivers/a715181@@tmp_rte_pmd_dlb_event@sta -Idrivers -I../drivers -Idrivers/event/dlb -I../drivers/event/dlb -Ilib/librte_eventdev -I../lib/librte_eventdev -I. -I../ -Iconfig -I../config -Ilib/librte_eal/include -I../lib/librte_eal/include -Ilib/librte_eal/linux/include -I../lib/librte_eal/linux/include -Ilib/librte_eal/x86/include -I../lib/librte_eal/x86/include -Ilib/librte_eal/common -I../lib/librte_eal/common -Ilib/librte_eal -I../lib/librte_eal -Ilib/librte_kvargs -I../lib/librte_kvargs -Ilib/librte_telemetry/../librte_metrics -I../lib/librte_telemetry/../librte_metrics -Ilib/librte_telemetry -I../lib/librte_telemetry -Ilib/librte_ring -I../lib/librte_ring -Ilib/librte_ethdev -I../lib/librte_ethdev -Ilib/librte_net -I../lib/librte_net -Ilib/librte_mbuf -I../lib/librte_mbuf -Ilib/librte_mempool -I../lib/librte_mempool -Ilib/librte_meter -I../lib/librte_meter -Ilib/librte_hash -I../lib/librte_hash -Ilib/librte_timer -I../lib/librte_timer -Ilib/librte_cryptodev -I../lib/librte_cryptodev -Ilib/librte_pci -I../lib/librte_pci -Idrivers/bus/pci -I../drivers/bus/pci -I../drivers/bus/pci/linux -fdiagnostics-color=always -pipe -D_FILE_OFFSET_BITS=64 -Wall -Winvalid-pch -O3 -include rte_config.h -Wextra -Wcast-qual -Wdeprecated -Wformat-nonliteral -Wformat-security -Wmissing-declarations -Wmissing-prototypes -Wnested-externs -Wold-style-definition -Wpointer-arith -Wsign-compare -Wstrict-prototypes -Wundef -Wwrite-strings -Wno-missing-field-initializers -D_GNU_SOURCE -fPIC -march=native -DALLOW_EXPERIMENTAL_API -DALLOW_INTERNAL_API -Wno-format-truncation -MD -MQ 'drivers/a715181@@tmp_rte_pmd_dlb_event@sta/event_dlb_dlb.c.o' -MF 'drivers/a715181@@tmp_rte_pmd_dlb_event@sta/event_dlb_dlb.c.o.d' -o 'drivers/a715181@@tmp_rte_pmd_dlb_event@sta/event_dlb_dlb.c.o' -c ../drivers/event/dlb/dlb.c
../drivers/event/dlb/dlb.c: In function ‘dlb_eventdev_configure’:
../drivers/event/dlb/dlb.c:656:31: error: ‘RTE_CPUFLAG_WAITPKG’ undeclared (first use in this function); did you mean ‘RTE_CPUFLAG_1GB_PG’?
  if (rte_cpu_get_flag_enabled(RTE_CPUFLAG_WAITPKG)) {
                               ^~~~~~~~~~~~~~~~~~~
                               RTE_CPUFLAG_1GB_PG
../drivers/event/dlb/dlb.c:656:31: note: each undeclared identifier is reported only once for each function it appears in
[37/322] Compiling C object 'drivers/a715181@@rte_pmd_mlx5@sha/meson-generated_.._rte_pmd_mlx5.pmd.c.o'.
[38/322] Generating symbol file 'drivers/a715181@@rte_pmd_octeontx2_crypto@sha/librte_pmd_octeontx2_crypto.so.21.0.symbols'.
[39/322] Generating rte_pmd_dsw_event.sym_chk with a meson_exe.py custom command.
[40/322] Generating rte_pmd_octeontx_event.sym_chk with a meson_exe.py custom command.
[41/322] Generating rte_pmd_octeontx2_event.sym_chk with a meson_exe.py custom command.
[42/322] Compiling C object 'app/a172ced@@dpdk-test-acl@exe/test-acl_main.c.o'.
[43/322] Generating rte_pmd_sw_event.sym_chk with a meson_exe.py custom command.
[44/322] Compiling C object 'app/a172ced@@dpdk-proc-info@exe/proc-info_main.c.o'.
[45/322] Compiling C object 'app/a172ced@@dpdk-test-bbdev@exe/test-bbdev_test_bbdev.c.o'.
[46/322] Compiling C object 'drivers/a715181@@tmp_rte_pmd_bbdev_fpga_lte_fec@sta/baseband_fpga_lte_fec_fpga_lte_fec.c.o'.
[47/322] Compiling C object 'app/a172ced@@dpdk-test-compress-perf@exe/test-compress-perf_comp_perf_test_throughput.c.o'.
[48/322] Compiling C object 'drivers/a715181@@tmp_rte_pmd_bbdev_fpga_5gnr_fec@sta/baseband_fpga_5gnr_fec_rte_fpga_5gnr_fec.c.o'.
[49/322] Compiling C object 'app/a172ced@@dpdk-pdump@exe/pdump_main.c.o'.
[50/322] Compiling C object 'app/a172ced@@dpdk-test-compress-perf@exe/test-compress-perf_comp_perf_test_verify.c.o'.
[51/322] Compiling C object 'app/a172ced@@dpdk-test-bbdev@exe/test-bbdev_test_bbdev_vector.c.o'.
[52/322] Compiling C object 'drivers/a715181@@tmp_rte_pmd_bbdev_null@sta/baseband_null_bbdev_null.c.o'.
[53/322] Compiling C object 'drivers/a715181@@tmp_rte_pmd_bbdev_turbo_sw@sta/baseband_turbo_sw_bbdev_turbo_software.c.o'.
ninja: build stopped: subcommand failed.

https://lab.dpdk.org/results/dashboard/patchsets/13812/

UNH-IOL DPDK Community Lab

^ permalink raw reply	[flat|nested] only message in thread

only message in thread, back to index

Thread overview: (only message) (download: mbox.gz / follow: Atom feed)
-- links below jump to the message on this page --
2020-10-17 19:39 [dpdk-test-report] |FAILURE| pw81223-81243 [PATCH] [v5, 22/22] doc: Add new DLB eventdev driver to relnotes dpdklab

automatic DPDK test reports

Archives are clonable:
	git clone --mirror http://inbox.dpdk.org/test-report/0 test-report/git/0.git

	# If you have public-inbox 1.1+ installed, you may
	# initialize and index your mirror using the following commands:
	public-inbox-init -V2 test-report test-report/ http://inbox.dpdk.org/test-report \
		test-report@dpdk.org
	public-inbox-index test-report


Newsgroup available over NNTP:
	nntp://inbox.dpdk.org/inbox.dpdk.test-report


AGPL code for this site: git clone https://public-inbox.org/ public-inbox