automatic DPDK test reports
 help / color / mirror / Atom feed
* [dpdk-test-report] |WARNING| pw88090 [PATCH] rte_metrics: unconditionally export rte_metrics_tel_xxx functions
       [not found] <1614029102-30858-1-git-send-email-jizh@linux.microsoft.com>
@ 2021-02-22 21:26 ` checkpatch
  2021-02-22 22:56 ` [dpdk-test-report] |FAILURE| pw88090 " 0-day Robot
  2021-02-22 22:56 ` [dpdk-test-report] |FAILURE| pw88090 [dpdk-dev] [PATCH] " 0-day Robot
  2 siblings, 0 replies; 3+ messages in thread
From: checkpatch @ 2021-02-22 21:26 UTC (permalink / raw)
  To: test-report; +Cc: Jie

Test-Label: checkpatch
Test-Status: WARNING
http://dpdk.org/patch/88090

_coding style issues_


ERROR:POINTER_LOCATION: "foo* bar" should be "foo *bar"
#261: FILE: lib/librte_metrics/rte_metrics_telemetry.c:469:
+rte_metrics_tel_get_global_stats(struct telemetry_encode_param* ep)

total: 1 errors, 0 warnings, 184 lines checked

^ permalink raw reply	[flat|nested] 3+ messages in thread

* [dpdk-test-report] |FAILURE| pw88090 rte_metrics: unconditionally export rte_metrics_tel_xxx functions
       [not found] <1614029102-30858-1-git-send-email-jizh@linux.microsoft.com>
  2021-02-22 21:26 ` [dpdk-test-report] |WARNING| pw88090 [PATCH] rte_metrics: unconditionally export rte_metrics_tel_xxx functions checkpatch
@ 2021-02-22 22:56 ` 0-day Robot
  2021-02-22 22:56 ` [dpdk-test-report] |FAILURE| pw88090 [dpdk-dev] [PATCH] " 0-day Robot
  2 siblings, 0 replies; 3+ messages in thread
From: 0-day Robot @ 2021-02-22 22:56 UTC (permalink / raw)
  To: test-report; +Cc: jizh, robot

From: robot@bytheb.org

Test-Label: travis-robot
Test-Status: FAILURE
http://patchwork.dpdk.org/api/patches/88090/

_travis build: failed_
Build URL: https://travis-ci.com/ovsrobot/dpdk/builds/217891635

^ permalink raw reply	[flat|nested] 3+ messages in thread

* [dpdk-test-report] |FAILURE| pw88090 [dpdk-dev] [PATCH] rte_metrics: unconditionally export rte_metrics_tel_xxx functions
       [not found] <1614029102-30858-1-git-send-email-jizh@linux.microsoft.com>
  2021-02-22 21:26 ` [dpdk-test-report] |WARNING| pw88090 [PATCH] rte_metrics: unconditionally export rte_metrics_tel_xxx functions checkpatch
  2021-02-22 22:56 ` [dpdk-test-report] |FAILURE| pw88090 " 0-day Robot
@ 2021-02-22 22:56 ` 0-day Robot
  2 siblings, 0 replies; 3+ messages in thread
From: 0-day Robot @ 2021-02-22 22:56 UTC (permalink / raw)
  To: test-report; +Cc: jizh, robot

From: robot@bytheb.org

Test-Label: github-robot
Test-Status: FAILURE
http://patchwork.dpdk.org/api/patches/88090/

_github build: failed_
Build URL: https://github.com/ovsrobot/dpdk/actions/runs/590609691
Build Logs:
-----------------------Summary of failed steps-----------------------
ubuntu-18.04-gcc-static failed at step "Build and test"
ubuntu-18.04-gcc-shared-abi+doc+tests failed at step "Build and test"
ubuntu-18.04-clang-static failed at step "Build and test"
ubuntu-18.04-clang-shared-doc+tests failed at step "Build and test"
ubuntu-18.04-gcc-static-aarch64 failed at step "Build and test"
ubuntu-18.04-gcc-shared-aarch64 failed at step "Build and test"
----------------------End summary of failed steps--------------------

-------------------------------BEGIN LOGS----------------------------
####################################################################################
#### [Begin job log] ubuntu-18.04-gcc-static at step "Build and test"
####################################################################################
[174/3164] Generating rte_cmdline_mingw with a custom command.
[175/3164] Linking static target lib/librte_cmdline.a.
[176/3164] Compiling C object 'lib/lib@@rte_metrics@sta/librte_metrics_rte_metrics.c.o'.
[177/3164] Generating cmdline.sym_chk with a meson_exe.py custom command.
[178/3164] Linking target lib/librte_cmdline.so.21.2.
[179/3164] Generating rte_metrics_def with a custom command.
[180/3164] Generating rte_metrics_mingw with a custom command.
[181/3164] Compiling C object 'lib/lib@@rte_hash@sta/librte_hash_rte_cuckoo_hash.c.o'.
[182/3164] Compiling C object 'lib/lib@@rte_hash@sta/librte_hash_rte_fbk_hash.c.o'.
[183/3164] Linking static target lib/librte_hash.a.
[184/3164] Generating rte_hash_def with a custom command.
[185/3164] Compiling C object 'lib/lib@@rte_metrics@sta/librte_metrics_rte_metrics_telemetry.c.o'.
FAILED: lib/lib@@rte_metrics@sta/librte_metrics_rte_metrics_telemetry.c.o 
ccache gcc -Ilib/lib@@rte_metrics@sta -Ilib -I../lib -Ilib/librte_metrics/../librte_telemetry -I../lib/librte_metrics/../librte_telemetry -Ilib/librte_metrics -I../lib/librte_metrics -I. -I../ -Iconfig -I../config -Ilib/librte_eal/include -I../lib/librte_eal/include -Ilib/librte_eal/linux/include -I../lib/librte_eal/linux/include -Ilib/librte_eal/x86/include -I../lib/librte_eal/x86/include -Ilib/librte_eal/common -I../lib/librte_eal/common -Ilib/librte_eal -I../lib/librte_eal -Ilib/librte_kvargs -I../lib/librte_kvargs -Ilib/librte_telemetry/../librte_metrics -I../lib/librte_telemetry/../librte_metrics -Ilib/librte_telemetry -I../lib/librte_telemetry -Ilib/librte_ethdev -I../lib/librte_ethdev -Ilib/librte_net -I../lib/librte_net -Ilib/librte_mbuf -I../lib/librte_mbuf -Ilib/librte_mempool -I../lib/librte_mempool -Ilib/librte_ring -I../lib/librte_ring -Ilib/librte_meter -I../lib/librte_meter -fdiagnostics-color=always -pipe -D_FILE_OFFSET_BITS=64 -Wall -Winvalid-pch -Werror -O2 -g -include rte_config.h -Wextra -Wcast-qual -Wdeprecated -Wformat -Wformat-nonliteral -Wformat-security -Wmissing-declarations -Wmissing-prototypes -Wnested-externs -Wold-style-definition -Wpointer-arith -Wsign-compare -Wstrict-prototypes -Wundef -Wwrite-strings -Wno-missing-field-initializers -D_GNU_SOURCE -fPIC -march=corei7 -DALLOW_EXPERIMENTAL_API -DALLOW_INTERNAL_API -Wno-format-truncation  -MD -MQ 'lib/lib@@rte_metrics@sta/librte_metrics_rte_metrics_telemetry.c.o' -MF 'lib/lib@@rte_metrics@sta/librte_metrics_rte_metrics_telemetry.c.o.d' -o 'lib/lib@@rte_metrics@sta/librte_metrics_rte_metrics_telemetry.c.o' -c ../lib/librte_metrics/rte_metrics_telemetry.c
../lib/librte_metrics/rte_metrics_telemetry.c:166:1: error: ‘rte_metrics_tel_format_port’ defined but not used [-Werror=unused-function]
 rte_metrics_tel_format_port(uint32_t pid, json_t *ports,
 ^~~~~~~~~~~~~~~~~~~~~~~~~~~
../lib/librte_metrics/rte_metrics_telemetry.c:35:1: error: ‘rte_metrics_tel_reg_port_ethdev_to_metrics’ defined but not used [-Werror=unused-function]
 rte_metrics_tel_reg_port_ethdev_to_metrics(uint16_t port_id)
 ^~~~~~~~~~~~~~~~~~~~~~~~~~~~~~~~~~~~~~~~~~
cc1: all warnings being treated as errors
[186/3164] Generating rte_hash_mingw with a custom command.
[187/3164] Generating ethdev.sym_chk with a meson_exe.py custom command.
ninja: build stopped: subcommand failed.
##[error]Process completed with exit code 1.
####################################################################################
#### [End job log] ubuntu-18.04-gcc-static at step "Build and test"
####################################################################################




####################################################################################
#### [Begin job log] ubuntu-18.04-gcc-shared-abi+doc+tests at step "Build and test"
####################################################################################
[168/3380] Compiling C object 'lib/lib@@rte_cmdline@sta/librte_cmdline_cmdline_parse_portlist.c.o'.
[169/3380] Compiling C object 'lib/lib@@rte_cmdline@sta/librte_cmdline_cmdline_parse_string.c.o'.
[170/3380] Compiling C object 'lib/lib@@rte_cmdline@sta/librte_cmdline_cmdline_rdline.c.o'.
[171/3380] Compiling C object 'lib/lib@@rte_cmdline@sta/librte_cmdline_cmdline_vt100.c.o'.
[172/3380] Compiling C object 'lib/lib@@rte_cmdline@sta/librte_cmdline_cmdline_socket.c.o'.
[173/3380] Generating rte_cmdline_mingw with a custom command.
[174/3380] Compiling C object 'lib/lib@@rte_cmdline@sta/librte_cmdline_cmdline_os_unix.c.o'.
[175/3380] Linking static target lib/librte_cmdline.a.
[176/3380] Generating cmdline.sym_chk with a meson_exe.py custom command.
[177/3380] Compiling C object 'lib/lib@@rte_metrics@sta/librte_metrics_rte_metrics.c.o'.
[178/3380] Linking target lib/librte_cmdline.so.21.2.
[179/3380] Compiling C object 'lib/lib@@rte_metrics@sta/librte_metrics_rte_metrics_telemetry.c.o'.
FAILED: lib/lib@@rte_metrics@sta/librte_metrics_rte_metrics_telemetry.c.o 
ccache gcc -Ilib/lib@@rte_metrics@sta -Ilib -I../lib -Ilib/librte_metrics/../librte_telemetry -I../lib/librte_metrics/../librte_telemetry -Ilib/librte_metrics -I../lib/librte_metrics -I. -I../ -Iconfig -I../config -Ilib/librte_eal/include -I../lib/librte_eal/include -Ilib/librte_eal/linux/include -I../lib/librte_eal/linux/include -Ilib/librte_eal/x86/include -I../lib/librte_eal/x86/include -Ilib/librte_eal/common -I../lib/librte_eal/common -Ilib/librte_eal -I../lib/librte_eal -Ilib/librte_kvargs -I../lib/librte_kvargs -Ilib/librte_telemetry/../librte_metrics -I../lib/librte_telemetry/../librte_metrics -Ilib/librte_telemetry -I../lib/librte_telemetry -Ilib/librte_ethdev -I../lib/librte_ethdev -Ilib/librte_net -I../lib/librte_net -Ilib/librte_mbuf -I../lib/librte_mbuf -Ilib/librte_mempool -I../lib/librte_mempool -Ilib/librte_ring -I../lib/librte_ring -Ilib/librte_meter -I../lib/librte_meter -fdiagnostics-color=always -pipe -D_FILE_OFFSET_BITS=64 -Wall -Winvalid-pch -Werror -O2 -g -include rte_config.h -Wextra -Wcast-qual -Wdeprecated -Wformat -Wformat-nonliteral -Wformat-security -Wmissing-declarations -Wmissing-prototypes -Wnested-externs -Wold-style-definition -Wpointer-arith -Wsign-compare -Wstrict-prototypes -Wundef -Wwrite-strings -Wno-missing-field-initializers -D_GNU_SOURCE -fPIC -march=corei7 -DALLOW_EXPERIMENTAL_API -DALLOW_INTERNAL_API -Wno-format-truncation  -MD -MQ 'lib/lib@@rte_metrics@sta/librte_metrics_rte_metrics_telemetry.c.o' -MF 'lib/lib@@rte_metrics@sta/librte_metrics_rte_metrics_telemetry.c.o.d' -o 'lib/lib@@rte_metrics@sta/librte_metrics_rte_metrics_telemetry.c.o' -c ../lib/librte_metrics/rte_metrics_telemetry.c
../lib/librte_metrics/rte_metrics_telemetry.c:166:1: error: ‘rte_metrics_tel_format_port’ defined but not used [-Werror=unused-function]
 rte_metrics_tel_format_port(uint32_t pid, json_t *ports,
 ^~~~~~~~~~~~~~~~~~~~~~~~~~~
../lib/librte_metrics/rte_metrics_telemetry.c:35:1: error: ‘rte_metrics_tel_reg_port_ethdev_to_metrics’ defined but not used [-Werror=unused-function]
 rte_metrics_tel_reg_port_ethdev_to_metrics(uint16_t port_id)
 ^~~~~~~~~~~~~~~~~~~~~~~~~~~~~~~~~~~~~~~~~~
cc1: all warnings being treated as errors
[180/3380] Generating ethdev.sym_chk with a meson_exe.py custom command.
[181/3380] Generating symbol file 'lib/lib@@rte_cmdline@sha/librte_cmdline.so.21.2.symbols'.
ninja: build stopped: subcommand failed.
##[error]Process completed with exit code 1.
####################################################################################
#### [End job log] ubuntu-18.04-gcc-shared-abi+doc+tests at step "Build and test"
####################################################################################




####################################################################################
#### [Begin job log] ubuntu-18.04-clang-static at step "Build and test"
####################################################################################
[173/3166] Generating rte_cmdline_def with a custom command.
[174/3166] Linking static target lib/librte_cmdline.a.
[175/3166] Generating rte_cmdline_mingw with a custom command.
[176/3166] Compiling C object 'lib/lib@@rte_metrics@sta/librte_metrics_rte_metrics.c.o'.
[177/3166] Generating ethdev.sym_chk with a meson_exe.py custom command.
[178/3166] Linking target lib/librte_ethdev.so.21.2.
[179/3166] Generating cmdline.sym_chk with a meson_exe.py custom command.
[180/3166] Linking target lib/librte_cmdline.so.21.2.
[181/3166] Generating symbol file 'lib/lib@@rte_ethdev@sha/librte_ethdev.so.21.2.symbols'.
[182/3166] Generating rte_metrics_def with a custom command.
[183/3166] Generating rte_metrics_mingw with a custom command.
[184/3166] Compiling C object 'lib/lib@@rte_metrics@sta/librte_metrics_rte_metrics_telemetry.c.o'.
FAILED: lib/lib@@rte_metrics@sta/librte_metrics_rte_metrics_telemetry.c.o 
ccache clang -Ilib/lib@@rte_metrics@sta -Ilib -I../lib -Ilib/librte_metrics/../librte_telemetry -I../lib/librte_metrics/../librte_telemetry -Ilib/librte_metrics -I../lib/librte_metrics -I. -I../ -Iconfig -I../config -Ilib/librte_eal/include -I../lib/librte_eal/include -Ilib/librte_eal/linux/include -I../lib/librte_eal/linux/include -Ilib/librte_eal/x86/include -I../lib/librte_eal/x86/include -Ilib/librte_eal/common -I../lib/librte_eal/common -Ilib/librte_eal -I../lib/librte_eal -Ilib/librte_kvargs -I../lib/librte_kvargs -Ilib/librte_telemetry/../librte_metrics -I../lib/librte_telemetry/../librte_metrics -Ilib/librte_telemetry -I../lib/librte_telemetry -Ilib/librte_ethdev -I../lib/librte_ethdev -Ilib/librte_net -I../lib/librte_net -Ilib/librte_mbuf -I../lib/librte_mbuf -Ilib/librte_mempool -I../lib/librte_mempool -Ilib/librte_ring -I../lib/librte_ring -Ilib/librte_meter -I../lib/librte_meter -Xclang -fcolor-diagnostics -pipe -D_FILE_OFFSET_BITS=64 -Wall -Winvalid-pch -Werror -O2 -g -include rte_config.h -Wextra -Wcast-qual -Wdeprecated -Wformat -Wformat-nonliteral -Wformat-security -Wmissing-declarations -Wmissing-prototypes -Wnested-externs -Wold-style-definition -Wpointer-arith -Wsign-compare -Wstrict-prototypes -Wundef -Wwrite-strings -Wno-address-of-packed-member -Wno-missing-field-initializers -D_GNU_SOURCE -fPIC -march=corei7 -DALLOW_EXPERIMENTAL_API -DALLOW_INTERNAL_API  -MD -MQ 'lib/lib@@rte_metrics@sta/librte_metrics_rte_metrics_telemetry.c.o' -MF 'lib/lib@@rte_metrics@sta/librte_metrics_rte_metrics_telemetry.c.o.d' -o 'lib/lib@@rte_metrics@sta/librte_metrics_rte_metrics_telemetry.c.o' -c ../lib/librte_metrics/rte_metrics_telemetry.c
../lib/librte_metrics/rte_metrics_telemetry.c:35:1: error: unused function 'rte_metrics_tel_reg_port_ethdev_to_metrics' [-Werror,-Wunused-function]
rte_metrics_tel_reg_port_ethdev_to_metrics(uint16_t port_id)
^
../lib/librte_metrics/rte_metrics_telemetry.c:166:1: error: unused function 'rte_metrics_tel_format_port' [-Werror,-Wunused-function]
rte_metrics_tel_format_port(uint32_t pid, json_t *ports,
^
2 errors generated.
[185/3166] Compiling C object 'lib/lib@@rte_hash@sta/librte_hash_rte_fbk_hash.c.o'.
[186/3166] Compiling C object 'lib/lib@@rte_hash@sta/librte_hash_rte_cuckoo_hash.c.o'.
ninja: build stopped: subcommand failed.
##[error]Process completed with exit code 1.
####################################################################################
#### [End job log] ubuntu-18.04-clang-static at step "Build and test"
####################################################################################




####################################################################################
#### [Begin job log] ubuntu-18.04-clang-shared-doc+tests at step "Build and test"
####################################################################################
[168/3382] Compiling C object 'lib/lib@@rte_cmdline@sta/librte_cmdline_cmdline_parse_num.c.o'.
[169/3382] Compiling C object 'lib/lib@@rte_cmdline@sta/librte_cmdline_cmdline_parse_portlist.c.o'.
[170/3382] Compiling C object 'lib/lib@@rte_cmdline@sta/librte_cmdline_cmdline_parse_string.c.o'.
[171/3382] Compiling C object 'lib/lib@@rte_cmdline@sta/librte_cmdline_cmdline_rdline.c.o'.
[172/3382] Compiling C object 'lib/lib@@rte_cmdline@sta/librte_cmdline_cmdline_socket.c.o'.
[173/3382] Compiling C object 'lib/lib@@rte_cmdline@sta/librte_cmdline_cmdline_vt100.c.o'.
[174/3382] Compiling C object 'lib/lib@@rte_cmdline@sta/librte_cmdline_cmdline_os_unix.c.o'.
[175/3382] Generating rte_cmdline_def with a custom command.
[176/3382] Linking static target lib/librte_cmdline.a.
[177/3382] Generating rte_cmdline_mingw with a custom command.
[178/3382] Generating cmdline.sym_chk with a meson_exe.py custom command.
[179/3382] Compiling C object 'lib/lib@@rte_metrics@sta/librte_metrics_rte_metrics_telemetry.c.o'.
FAILED: lib/lib@@rte_metrics@sta/librte_metrics_rte_metrics_telemetry.c.o 
ccache clang -Ilib/lib@@rte_metrics@sta -Ilib -I../lib -Ilib/librte_metrics/../librte_telemetry -I../lib/librte_metrics/../librte_telemetry -Ilib/librte_metrics -I../lib/librte_metrics -I. -I../ -Iconfig -I../config -Ilib/librte_eal/include -I../lib/librte_eal/include -Ilib/librte_eal/linux/include -I../lib/librte_eal/linux/include -Ilib/librte_eal/x86/include -I../lib/librte_eal/x86/include -Ilib/librte_eal/common -I../lib/librte_eal/common -Ilib/librte_eal -I../lib/librte_eal -Ilib/librte_kvargs -I../lib/librte_kvargs -Ilib/librte_telemetry/../librte_metrics -I../lib/librte_telemetry/../librte_metrics -Ilib/librte_telemetry -I../lib/librte_telemetry -Ilib/librte_ethdev -I../lib/librte_ethdev -Ilib/librte_net -I../lib/librte_net -Ilib/librte_mbuf -I../lib/librte_mbuf -Ilib/librte_mempool -I../lib/librte_mempool -Ilib/librte_ring -I../lib/librte_ring -Ilib/librte_meter -I../lib/librte_meter -Xclang -fcolor-diagnostics -pipe -D_FILE_OFFSET_BITS=64 -Wall -Winvalid-pch -Werror -O2 -g -include rte_config.h -Wextra -Wcast-qual -Wdeprecated -Wformat -Wformat-nonliteral -Wformat-security -Wmissing-declarations -Wmissing-prototypes -Wnested-externs -Wold-style-definition -Wpointer-arith -Wsign-compare -Wstrict-prototypes -Wundef -Wwrite-strings -Wno-address-of-packed-member -Wno-missing-field-initializers -D_GNU_SOURCE -fPIC -march=corei7 -DALLOW_EXPERIMENTAL_API -DALLOW_INTERNAL_API  -MD -MQ 'lib/lib@@rte_metrics@sta/librte_metrics_rte_metrics_telemetry.c.o' -MF 'lib/lib@@rte_metrics@sta/librte_metrics_rte_metrics_telemetry.c.o.d' -o 'lib/lib@@rte_metrics@sta/librte_metrics_rte_metrics_telemetry.c.o' -c ../lib/librte_metrics/rte_metrics_telemetry.c
../lib/librte_metrics/rte_metrics_telemetry.c:35:1: error: unused function 'rte_metrics_tel_reg_port_ethdev_to_metrics' [-Werror,-Wunused-function]
rte_metrics_tel_reg_port_ethdev_to_metrics(uint16_t port_id)
^
../lib/librte_metrics/rte_metrics_telemetry.c:166:1: error: unused function 'rte_metrics_tel_format_port' [-Werror,-Wunused-function]
rte_metrics_tel_format_port(uint32_t pid, json_t *ports,
^
2 errors generated.
[180/3382] Generating ethdev.sym_chk with a meson_exe.py custom command.
[181/3382] Compiling C object 'lib/lib@@rte_metrics@sta/librte_metrics_rte_metrics.c.o'.
ninja: build stopped: subcommand failed.
##[error]Process completed with exit code 1.
####################################################################################
#### [End job log] ubuntu-18.04-clang-shared-doc+tests at step "Build and test"
####################################################################################




####################################################################################
#### [Begin job log] ubuntu-18.04-gcc-static-aarch64 at step "Build and test"
####################################################################################
[183/3164] Generating cmdline.sym_chk with a meson_exe.py custom command.
[184/3164] Compiling C object 'lib/lib@@rte_hash@sta/librte_hash_rte_cuckoo_hash.c.o'.
[185/3164] Linking target lib/librte_cmdline.so.21.2.
[186/3164] Linking static target lib/librte_hash.a.
[187/3164] Generating rte_hash_def with a custom command.
[188/3164] Generating rte_hash_mingw with a custom command.
[189/3164] Compiling C object 'lib/lib@@rte_timer@sta/librte_timer_rte_timer.c.o'.
[190/3164] Linking static target lib/librte_timer.a.
[191/3164] Generating rte_timer_def with a custom command.
[192/3164] Generating rte_timer_mingw with a custom command.
[193/3164] Generating hash.sym_chk with a meson_exe.py custom command.
[194/3164] Compiling C object 'lib/lib@@rte_metrics@sta/librte_metrics_rte_metrics_telemetry.c.o'.
FAILED: lib/lib@@rte_metrics@sta/librte_metrics_rte_metrics_telemetry.c.o 
ccache gcc -Ilib/lib@@rte_metrics@sta -Ilib -I../lib -Ilib/librte_metrics/../librte_telemetry -I../lib/librte_metrics/../librte_telemetry -Ilib/librte_metrics -I../lib/librte_metrics -I. -I../ -Iconfig -I../config -Ilib/librte_eal/include -I../lib/librte_eal/include -Ilib/librte_eal/linux/include -I../lib/librte_eal/linux/include -Ilib/librte_eal/x86/include -I../lib/librte_eal/x86/include -Ilib/librte_eal/common -I../lib/librte_eal/common -Ilib/librte_eal -I../lib/librte_eal -Ilib/librte_kvargs -I../lib/librte_kvargs -Ilib/librte_telemetry/../librte_metrics -I../lib/librte_telemetry/../librte_metrics -Ilib/librte_telemetry -I../lib/librte_telemetry -Ilib/librte_ethdev -I../lib/librte_ethdev -Ilib/librte_net -I../lib/librte_net -Ilib/librte_mbuf -I../lib/librte_mbuf -Ilib/librte_mempool -I../lib/librte_mempool -Ilib/librte_ring -I../lib/librte_ring -Ilib/librte_meter -I../lib/librte_meter -fdiagnostics-color=always -pipe -D_FILE_OFFSET_BITS=64 -Wall -Winvalid-pch -Werror -O2 -g -include rte_config.h -Wextra -Wcast-qual -Wdeprecated -Wformat -Wformat-nonliteral -Wformat-security -Wmissing-declarations -Wmissing-prototypes -Wnested-externs -Wold-style-definition -Wpointer-arith -Wsign-compare -Wstrict-prototypes -Wundef -Wwrite-strings -Wno-missing-field-initializers -D_GNU_SOURCE -fPIC -march=corei7 -DALLOW_EXPERIMENTAL_API -DALLOW_INTERNAL_API -Wno-format-truncation  -MD -MQ 'lib/lib@@rte_metrics@sta/librte_metrics_rte_metrics_telemetry.c.o' -MF 'lib/lib@@rte_metrics@sta/librte_metrics_rte_metrics_telemetry.c.o.d' -o 'lib/lib@@rte_metrics@sta/librte_metrics_rte_metrics_telemetry.c.o' -c ../lib/librte_metrics/rte_metrics_telemetry.c
../lib/librte_metrics/rte_metrics_telemetry.c:166:1: error: ‘rte_metrics_tel_format_port’ defined but not used [-Werror=unused-function]
 rte_metrics_tel_format_port(uint32_t pid, json_t *ports,
 ^~~~~~~~~~~~~~~~~~~~~~~~~~~
../lib/librte_metrics/rte_metrics_telemetry.c:35:1: error: ‘rte_metrics_tel_reg_port_ethdev_to_metrics’ defined but not used [-Werror=unused-function]
 rte_metrics_tel_reg_port_ethdev_to_metrics(uint16_t port_id)
 ^~~~~~~~~~~~~~~~~~~~~~~~~~~~~~~~~~~~~~~~~~
cc1: all warnings being treated as errors
[195/3164] Generating timer.sym_chk with a meson_exe.py custom command.
[196/3164] Linking target lib/librte_hash.so.21.2.
ninja: build stopped: subcommand failed.
##[error]Process completed with exit code 1.
####################################################################################
#### [End job log] ubuntu-18.04-gcc-static-aarch64 at step "Build and test"
####################################################################################




####################################################################################
#### [Begin job log] ubuntu-18.04-gcc-shared-aarch64 at step "Build and test"
####################################################################################
[170/3377] Compiling C object 'lib/lib@@rte_cmdline@sta/librte_cmdline_cmdline_rdline.c.o'.
[171/3377] Compiling C object 'lib/lib@@rte_cmdline@sta/librte_cmdline_cmdline_vt100.c.o'.
[172/3377] Compiling C object 'lib/lib@@rte_cmdline@sta/librte_cmdline_cmdline_socket.c.o'.
[173/3377] Generating rte_cmdline_mingw with a custom command.
[174/3377] Compiling C object 'lib/lib@@rte_cmdline@sta/librte_cmdline_cmdline_os_unix.c.o'.
[175/3377] Linking static target lib/librte_cmdline.a.
[176/3377] Compiling C object 'lib/lib@@rte_metrics@sta/librte_metrics_rte_metrics.c.o'.
[177/3377] Generating cmdline.sym_chk with a meson_exe.py custom command.
[178/3377] Linking target lib/librte_cmdline.so.21.2.
[179/3377] Generating symbol file 'lib/lib@@rte_cmdline@sha/librte_cmdline.so.21.2.symbols'.
[180/3377] Generating rte_metrics_def with a custom command.
[181/3377] Compiling C object 'lib/lib@@rte_metrics@sta/librte_metrics_rte_metrics_telemetry.c.o'.
FAILED: lib/lib@@rte_metrics@sta/librte_metrics_rte_metrics_telemetry.c.o 
ccache gcc -Ilib/lib@@rte_metrics@sta -Ilib -I../lib -Ilib/librte_metrics/../librte_telemetry -I../lib/librte_metrics/../librte_telemetry -Ilib/librte_metrics -I../lib/librte_metrics -I. -I../ -Iconfig -I../config -Ilib/librte_eal/include -I../lib/librte_eal/include -Ilib/librte_eal/linux/include -I../lib/librte_eal/linux/include -Ilib/librte_eal/x86/include -I../lib/librte_eal/x86/include -Ilib/librte_eal/common -I../lib/librte_eal/common -Ilib/librte_eal -I../lib/librte_eal -Ilib/librte_kvargs -I../lib/librte_kvargs -Ilib/librte_telemetry/../librte_metrics -I../lib/librte_telemetry/../librte_metrics -Ilib/librte_telemetry -I../lib/librte_telemetry -Ilib/librte_ethdev -I../lib/librte_ethdev -Ilib/librte_net -I../lib/librte_net -Ilib/librte_mbuf -I../lib/librte_mbuf -Ilib/librte_mempool -I../lib/librte_mempool -Ilib/librte_ring -I../lib/librte_ring -Ilib/librte_meter -I../lib/librte_meter -fdiagnostics-color=always -pipe -D_FILE_OFFSET_BITS=64 -Wall -Winvalid-pch -Werror -O2 -g -include rte_config.h -Wextra -Wcast-qual -Wdeprecated -Wformat -Wformat-nonliteral -Wformat-security -Wmissing-declarations -Wmissing-prototypes -Wnested-externs -Wold-style-definition -Wpointer-arith -Wsign-compare -Wstrict-prototypes -Wundef -Wwrite-strings -Wno-missing-field-initializers -D_GNU_SOURCE -fPIC -march=corei7 -DALLOW_EXPERIMENTAL_API -DALLOW_INTERNAL_API -Wno-format-truncation  -MD -MQ 'lib/lib@@rte_metrics@sta/librte_metrics_rte_metrics_telemetry.c.o' -MF 'lib/lib@@rte_metrics@sta/librte_metrics_rte_metrics_telemetry.c.o.d' -o 'lib/lib@@rte_metrics@sta/librte_metrics_rte_metrics_telemetry.c.o' -c ../lib/librte_metrics/rte_metrics_telemetry.c
../lib/librte_metrics/rte_metrics_telemetry.c:166:1: error: ‘rte_metrics_tel_format_port’ defined but not used [-Werror=unused-function]
 rte_metrics_tel_format_port(uint32_t pid, json_t *ports,
 ^~~~~~~~~~~~~~~~~~~~~~~~~~~
../lib/librte_metrics/rte_metrics_telemetry.c:35:1: error: ‘rte_metrics_tel_reg_port_ethdev_to_metrics’ defined but not used [-Werror=unused-function]
 rte_metrics_tel_reg_port_ethdev_to_metrics(uint16_t port_id)
 ^~~~~~~~~~~~~~~~~~~~~~~~~~~~~~~~~~~~~~~~~~
cc1: all warnings being treated as errors
[182/3377] Generating rte_metrics_mingw with a custom command.
[183/3377] Generating ethdev.sym_chk with a meson_exe.py custom command.
ninja: build stopped: subcommand failed.
##[error]Process completed with exit code 1.
####################################################################################
#### [End job log] ubuntu-18.04-gcc-shared-aarch64 at step "Build and test"
####################################################################################
--------------------------------END LOGS-----------------------------

^ permalink raw reply	[flat|nested] 3+ messages in thread

end of thread, other threads:[~2021-02-22 22:56 UTC | newest]

Thread overview: 3+ messages (download: mbox.gz / follow: Atom feed)
-- links below jump to the message on this page --
     [not found] <1614029102-30858-1-git-send-email-jizh@linux.microsoft.com>
2021-02-22 21:26 ` [dpdk-test-report] |WARNING| pw88090 [PATCH] rte_metrics: unconditionally export rte_metrics_tel_xxx functions checkpatch
2021-02-22 22:56 ` [dpdk-test-report] |FAILURE| pw88090 " 0-day Robot
2021-02-22 22:56 ` [dpdk-test-report] |FAILURE| pw88090 [dpdk-dev] [PATCH] " 0-day Robot

automatic DPDK test reports

This inbox may be cloned and mirrored by anyone:

	git clone --mirror http://inbox.dpdk.org/test-report/0 test-report/git/0.git

	# If you have public-inbox 1.1+ installed, you may
	# initialize and index your mirror using the following commands:
	public-inbox-init -V2 test-report test-report/ http://inbox.dpdk.org/test-report \
		test-report@dpdk.org
	public-inbox-index test-report

Example config snippet for mirrors.
Newsgroup available over NNTP:
	nntp://inbox.dpdk.org/inbox.dpdk.test-report


AGPL code for this site: git clone https://public-inbox.org/public-inbox.git