* [dpdk-test-report] |FAILURE| pw97557 [PATCH] net/virtio: reconfigure LSC handler when required
@ 2021-08-31 11:37 dpdklab
0 siblings, 0 replies; 2+ messages in thread
From: dpdklab @ 2021-08-31 11:37 UTC (permalink / raw)
To: Test Report; +Cc: dpdklab, David Marchand
[-- Attachment #1: Type: text/plain, Size: 2321 bytes --]
Test-Label: iol-aarch64-unit-testing
Test-Status: FAILURE
http://dpdk.org/patch/97557
_Testing issues_
Submitter: David Marchand <david.marchand@redhat.com>
Date: Monday, August 30 2021 15:13:13
DPDK git baseline: Repo:dpdk
Branch: master
CommitID:bfd3c352eb9729f97da6e1b5e958e121542d8a8d
97557 --> testing fail
Test environment and result as below:
+----------------------+----------------+--------------+
| Environment | dpdk_unit_test | lpm_autotest |
+======================+================+==============+
| Ubuntu 20.04 ARM | FAIL | SKIPPED |
+----------------------+----------------+--------------+
| Ubuntu 20.04 ARM SVE | SKIPPED | PASS |
+----------------------+----------------+--------------+
==== 20 line log output for Ubuntu 20.04 ARM (dpdk_unit_test): ====
85/94 DPDK:fast-tests / thash_autotest OK 1.15s
86/94 DPDK:fast-tests / trace_autotest OK 1.97s
87/94 DPDK:fast-tests / telemetry_json_autotest OK 2.34s
88/94 DPDK:fast-tests / telemetry_data_autotest OK 0.92s
89/94 DPDK:fast-tests / ring_pmd_autotest OK 1.11s
90/94 DPDK:fast-tests / event_eth_tx_adapter_autotest OK 3.61s
91/94 DPDK:fast-tests / bitratestats_autotest OK 1.10s
92/94 DPDK:fast-tests / latencystats_autotest OK 1.11s
93/94 DPDK:fast-tests / pdump_autotest OK 6.01s
94/94 DPDK:fast-tests / compressdev_autotest SKIP 2.16s exit status 77
Ok: 89
Expected Fail: 0
Fail: 1
Unexpected Pass: 0
Skipped: 4
Timeout: 0
Full log written to /home-local/jenkins-local/jenkins-agent/workspace/Arm-gigabyte-Unit-Test-DPDK/dpdk/build/meson-logs/testlog.txt
==== End log output ====
Ubuntu 20.04 ARM
Kernel: 5.4.0-53-generic
Compiler: gcc 9.3
Ubuntu 20.04 ARM SVE
Kernel: 5.4.0-80-generic
Compiler: gcc 10.3.0 (Ubuntu 10.3.0-1ubuntu1~20.04)
To view detailed results, visit:
https://lab.dpdk.org/results/dashboard/patchsets/18418/
UNH-IOL DPDK Community Lab
To manage your email subscriptions, visit:
https://lab.dpdk.org/results/dashboard/preferences/subscriptions/
^ permalink raw reply [flat|nested] 2+ messages in thread
* [dpdk-test-report] |FAILURE| pw97557 [PATCH] net/virtio: reconfigure LSC handler when required
@ 2021-08-30 17:03 dpdklab
0 siblings, 0 replies; 2+ messages in thread
From: dpdklab @ 2021-08-30 17:03 UTC (permalink / raw)
To: Ajit Khaparde, Test Report; +Cc: dpdk-test-reports, David Marchand
[-- Attachment #1: Type: text/plain, Size: 828 bytes --]
Test-Label: iol-broadcom-Functional
Test-Status: FAILURE
http://dpdk.org/patch/97557
_Functional Testing issues_
Submitter: David Marchand <david.marchand@redhat.com>
Date: Monday, August 30 2021 15:13:13
DPDK git baseline: Repo:dpdk
Branch: master
CommitID:bfd3c352eb9729f97da6e1b5e958e121542d8a8d
97557 --> functional testing fail
Test environment and result as below:
Ubuntu 20.04
Kernel: 4.15.0-65-generic
Compiler: gcc gcc (Ubuntu 7.4.0-1ubuntu1~18.04.1) 7.4.0
NIC: Broadcom Inc. brcm_57414 25000 Mbps
Target: x86_64-native-linuxapp-gcc
Fail/Total: 1/3
Failed Tests:
- mtu_update
To view detailed results, visit:
https://lab.dpdk.org/results/dashboard/patchsets/18418/
UNH-IOL DPDK Community Lab
To manage your email subscriptions, visit:
https://lab.dpdk.org/results/dashboard/preferences/subscriptions/
^ permalink raw reply [flat|nested] 2+ messages in thread
end of thread, other threads:[~2021-08-31 11:37 UTC | newest]
Thread overview: 2+ messages (download: mbox.gz / follow: Atom feed)
-- links below jump to the message on this page --
2021-08-31 11:37 [dpdk-test-report] |FAILURE| pw97557 [PATCH] net/virtio: reconfigure LSC handler when required dpdklab
-- strict thread matches above, loose matches on Subject: below --
2021-08-30 17:03 dpdklab
This is a public inbox, see mirroring instructions
for how to clone and mirror all data and code used for this inbox;
as well as URLs for NNTP newsgroup(s).