automatic DPDK test reports
 help / color / mirror / Atom feed
* [dpdk-test-report] |FAILURE| pw101523-101535 [PATCH] [v4, 12/12] app/test: enable subset of unit tests on Windows
@ 2021-10-14  3:44 dpdklab
  0 siblings, 0 replies; only message in thread
From: dpdklab @ 2021-10-14  3:44 UTC (permalink / raw)
  To: test-report; +Cc: dpdk-test-reports

[-- Attachment #1: Type: text/plain, Size: 11937 bytes --]

Test-Label: iol-testing
Test-Status: FAILURE
http://dpdk.org/patch/101523

_build patch failure_

Submitter: Jie Zhou <jizh@linux.microsoft.com>
Date: Thursday, October 14 2021 03:30:14 
Applied on: CommitID:d75eed0fbe4b942bc6df2e2908a8b5c2c30c99aa
Apply patch set 101523-101535 failed:

[1/1] Linking target app/test/dpdk-test
FAILED: app/test/dpdk-test 
cc  -o app/test/dpdk-test app/test/dpdk-test.p/commands.c.o app/test/dpdk-test.p/packet_burst_generator.c.o app/test/dpdk-test.p/test.c.o app/test/dpdk-test.p/test_acl.c.o app/test/dpdk-test.p/test_alarm.c.o app/test/dpdk-test.p/test_atomic.c.o app/test/dpdk-test.p/test_barrier.c.o app/test/dpdk-test.p/test_bitops.c.o app/test/dpdk-test.p/test_bitmap.c.o app/test/dpdk-test.p/test_bpf.c.o app/test/dpdk-test.p/test_byteorder.c.o app/test/dpdk-test.p/test_cksum.c.o app/test/dpdk-test.p/test_cmdline.c.o app/test/dpdk-test.p/test_cmdline_cirbuf.c.o app/test/dpdk-test.p/test_cmdline_etheraddr.c.o app/test/dpdk-test.p/test_cmdline_ipaddr.c.o app/test/dpdk-test.p/test_cmdline_lib.c.o app/test/dpdk-test.p/test_cmdline_num.c.o app/test/dpdk-test.p/test_cmdline_portlist.c.o app/test/dpdk-test.p/test_cmdline_string.c.o app/test/dpdk-test.p/test_common.c.o app/test/dpdk-test.p/test_cpuflags.c.o app/test/dpdk-test.p/test_crc.c.o app/test/dpdk-test.p/test_cryptodev.c.o app/test/dpdk-test.p/test_cryptodev_asym.c.o app/test/dpdk-test.p/test_cryptodev_blockcipher.c.o app/test/dpdk-test.p/test_cryptodev_security_ipsec.c.o app/test/dpdk-test.p/test_cryptodev_security_pdcp.c.o app/test/dpdk-test.p/test_cycles.c.o app/test/dpdk-test.p/test_debug.c.o app/test/dpdk-test.p/test_distributor.c.o app/test/dpdk-test.p/test_distributor_perf.c.o app/test/dpdk-test.p/test_eal_flags.c.o app/test/dpdk-test.p/test_eal_fs.c.o app/test/dpdk-test.p/test_efd.c.o app/test/dpdk-test.p/test_efd_perf.c.o app/test/dpdk-test.p/test_errno.c.o app/test/dpdk-test.p/test_ethdev_link.c.o app/test/dpdk-test.p/test_event_crypto_adapter.c.o app/test/dpdk-test.p/test_event_eth_rx_adapter.c.o app/test/dpdk-test.p/test_event_ring.c.o app/test/dpdk-test.p/test_event_timer_adapter.c.o app/test/dpdk-test.p/test_eventdev.c.o app/test/dpdk-test.p/test_external_mem.c.o app/test/dpdk-test.p/test_fbarray.c.o app/test/dpdk-test.p/test_fib.c.o app/test/dpdk-test.p/test_fib_perf.c.o app/test/dpdk-test.p/test_fib6.c.o app/test/dpdk-test.p/test_fib6_perf.c.o app/test/dpdk-test.p/test_func_reentrancy.c.o app/test/dpdk-test.p/test_flow_classify.c.o app/test/dpdk-test.p/test_graph.c.o app/test/dpdk-test.p/test_graph_perf.c.o app/test/dpdk-test.p/test_hash.c.o app/test/dpdk-test.p/test_hash_functions.c.o app/test/dpdk-test.p/test_hash_multiwriter.c.o app/test/dpdk-test.p/test_hash_readwrite.c.o app/test/dpdk-test.p/test_hash_perf.c.o app/test/dpdk-test.p/test_hash_readwrite_lf_perf.c.o app/test/dpdk-test.p/test_interrupts.c.o app/test/dpdk-test.p/test_ipfrag.c.o app/test/dpdk-test.p/test_ipsec.c.o app/test/dpdk-test.p/test_ipsec_sad.c.o app/test/dpdk-test.p/test_ipsec_perf.c.o app/test/dpdk-test.p/test_kni.c.o app/test/dpdk-test.p/test_kvargs.c.o app/test/dpdk-test.p/test_lcores.c.o app/test/dpdk-test.p/test_logs.c.o app/test/dpdk-test.p/test_lpm.c.o app/test/dpdk-test.p/test_lpm6.c.o app/test/dpdk-test.p/test_lpm6_perf.c.o app/test/dpdk-test.p/test_lpm_perf.c.o app/test/dpdk-test.p/test_malloc.c.o app/test/dpdk-test.p/test_mbuf.c.o app/test/dpdk-test.p/test_member.c.o app/test/dpdk-test.p/test_member_perf.c.o app/test/dpdk-test.p/test_memcpy.c.o app/test/dpdk-test.p/test_memcpy_perf.c.o app/test/dpdk-test.p/test_memory.c.o app/test/dpdk-test.p/test_mempool.c.o app/test/dpdk-test.p/test_mempool_perf.c.o app/test/dpdk-test.p/test_memzone.c.o app/test/dpdk-test.p/test_meter.c.o app/test/dpdk-test.p/test_metrics.c.o app/test/dpdk-test.p/test_mcslock.c.o app/test/dpdk-test.p/test_mp_secondary.c.o app/test/dpdk-test.p/test_per_lcore.c.o app/test/dpdk-test.p/test_pflock.c.o app/test/dpdk-test.p/test_pmd_perf.c.o app/test/dpdk-test.p/test_power.c.o app/test/dpdk-test.p/test_power_cpufreq.c.o app/test/dpdk-test.p/test_power_kvm_vm.c.o app/test/dpdk-test.p/test_prefetch.c.o app/test/dpdk-test.p/test_rand_perf.c.o app/test/dpdk-test.p/test_rawdev.c.o app/test/dpdk-test.p/test_rcu_qsbr.c.o app/test/dpdk-test.p/test_rcu_qsbr_perf.c.o app/test/dpdk-test.p/test_reciprocal_division.c.o app/test/dpdk-test.p/test_reciprocal_division_perf.c.o app/test/dpdk-test.p/test_red.c.o app/test/dpdk-test.p/test_reorder.c.o app/test/dpdk-test.p/test_rib.c.o app/test/dpdk-test.p/test_rib6.c.o app/test/dpdk-test.p/test_ring.c.o app/test/dpdk-test.p/test_ring_mpmc_stress.c.o app/test/dpdk-test.p/test_ring_hts_stress.c.o app/test/dpdk-test.p/test_ring_mt_peek_stress.c.o app/test/dpdk-test.p/test_ring_mt_peek_stress_zc.c.o app/test/dpdk-test.p/test_ring_perf.c.o app/test/dpdk-test.p/test_ring_rts_stress.c.o app/test/dpdk-test.p/test_ring_st_peek_stress.c.o app/test/dpdk-test.p/test_ring_st_peek_stress_zc.c.o app/test/dpdk-test.p/test_ring_stress.c.o app/test/dpdk-test.p/test_rwlock.c.o app/test/dpdk-test.p/test_sched.c.o app/test/dpdk-test.p/test_security.c.o app/test/dpdk-test.p/test_service_cores.c.o app/test/dpdk-test.p/test_spinlock.c.o app/test/dpdk-test.p/test_stack.c.o app/test/dpdk-test.p/test_stack_perf.c.o app/test/dpdk-test.p/test_string_fns.c.o app/test/dpdk-test.p/test_table.c.o app/test/dpdk-test.p/test_table_acl.c.o app/test/dpdk-test.p/test_table_combined.c.o app/test/dpdk-test.p/test_table_pipeline.c.o app/test/dpdk-test.p/test_table_ports.c.o app/test/dpdk-test.p/test_table_tables.c.o app/test/dpdk-test.p/test_tailq.c.o app/test/dpdk-test.p/test_thash.c.o app/test/dpdk-test.p/test_timer.c.o app/test/dpdk-test.p/test_timer_perf.c.o app/test/dpdk-test.p/test_timer_racecond.c.o app/test/dpdk-test.p/test_timer_secondary.c.o app/test/dpdk-test.p/test_ticketlock.c.o app/test/dpdk-test.p/test_trace.c.o app/test/dpdk-test.p/test_trace_register.c.o app/test/dpdk-test.p/test_trace_perf.c.o app/test/dpdk-test.p/test_version.c.o app/test/dpdk-test.p/virtual_pmd.c.o app/test/dpdk-test.p/test_telemetry_json.c.o app/test/dpdk-test.p/test_telemetry_data.c.o app/test/dpdk-test.p/test_link_bonding.c.o app/test/dpdk-test.p/test_link_bonding_rssconf.c.o app/test/dpdk-test.p/test_link_bonding_mode4.c.o app/test/dpdk-test.p/test_pmd_ring_perf.c.o app/test/dpdk-test.p/test_pmd_ring.c.o app/test/dpdk-test.p/test_event_eth_tx_adapter.c.o app/test/dpdk-test.p/test_bitratestats.c.o app/test/dpdk-test.p/test_latencystats.c.o app/test/dpdk-test.p/sample_packet_forward.c.o app/test/dpdk-test.p/test_pdump.c.o app/test/dpdk-test.p/test_compressdev.c.o -Wl,--as-needed -Wl,--no-undefined -Wl,-O1 -Wl,--whole-archive -Wl,--start-group lib/librte_node.a lib/librte_graph.a lib/librte_bpf.a lib/librte_flow_classify.a lib/librte_pipeline.a lib/librte_table.a lib/librte_port.a lib/librte_fib.a lib/librte_ipsec.a lib/librte_vhost.a lib/librte_stack.a lib/librte_security.a lib/librte_sched.a lib/librte_reorder.a lib/librte_rib.a lib/librte_regexdev.a lib/librte_rawdev.a lib/librte_pdump.a lib/librte_power.a lib/librte_member.a lib/librte_lpm.a lib/librte_latencystats.a lib/librte_kni.a lib/librte_jobstats.a lib/librte_ip_frag.a lib/librte_gso.a lib/librte_gro.a lib/librte_eventdev.a lib/librte_efd.a lib/librte_distributor.a lib/librte_cryptodev.a lib/librte_compressdev.a lib/librte_cfgfile.a lib/librte_bitratestats.a lib/librte_bbdev.a lib/librte_acl.a lib/librte_timer.a lib/librte_hash.a lib/librte_metrics.a lib/librte_cmdline.a lib/librte_pci.a lib/librte_ethdev.a lib/librte_meter.a lib/librte_net.a lib/librte_mbuf.a lib/librte_mempool.a lib/librte_rcu.a lib/librte_ring.a lib/librte_eal.a lib/librte_telemetry.a lib/librte_kvargs.a drivers/librte_common_cpt.a drivers/librte_common_dpaax.a drivers/librte_common_iavf.a drivers/librte_common_octeontx.a drivers/librte_common_octeontx2.a drivers/librte_bus_auxiliary.a drivers/librte_bus_dpaa.a drivers/librte_bus_fslmc.a drivers/librte_bus_ifpga.a drivers/librte_bus_pci.a drivers/librte_bus_vdev.a drivers/librte_bus_vmbus.a drivers/librte_common_cnxk.a drivers/librte_common_mlx5.a drivers/librte_common_qat.a drivers/librte_common_sfc_efx.a drivers/librte_mempool_bucket.a drivers/librte_mempool_cnxk.a drivers/librte_mempool_dpaa.a drivers/librte_mempool_dpaa2.a drivers/librte_mempool_octeontx.a drivers/librte_mempool_octeontx2.a drivers/librte_mempool_ring.a drivers/librte_mempool_stack.a drivers/librte_net_af_packet.a drivers/librte_net_ark.a drivers/librte_net_atlantic.a drivers/librte_net_avp.a drivers/librte_net_axgbe.a drivers/librte_net_bnx2x.a drivers/librte_net_bnxt.a drivers/librte_net_bond.a drivers/librte_net_cnxk.a drivers/librte_net_cxgbe.a drivers/librte_net_dpaa.a drivers/librte_net_dpaa2.a drivers/librte_net_e1000.a drivers/librte_net_ena.a drivers/librte_net_enetc.a drivers/librte_net_enic.a drivers/librte_net_failsafe.a drivers/librte_net_fm10k.a drivers/librte_net_hinic.a drivers/librte_net_hns3.a drivers/librte_net_i40e.a drivers/librte_net_iavf.a drivers/librte_net_ice.a drivers/librte_net_igc.a drivers/librte_net_ionic.a drivers/librte_net_ipn3ke.a drivers/librte_net_ixgbe.a drivers/librte_net_kni.a drivers/librte_net_liquidio.a drivers/librte_net_memif.a drivers/librte_net_mlx4.a drivers/librte_net_mlx5.a drivers/librte_net_netvsc.a drivers/librte_net_nfp.a drivers/librte_net_ngbe.a drivers/librte_net_null.a drivers/librte_net_octeontx.a drivers/librte_net_octeontx2.a drivers/librte_net_octeontx_ep.a drivers/librte_net_pcap.a drivers/librte_net_pfe.a drivers/librte_net_qede.a drivers/librte_net_ring.a drivers/librte_net_sfc.a drivers/librte_net_softnic.a drivers/librte_net_tap.a drivers/librte_net_thunderx.a drivers/librte_net_txgbe.a drivers/librte_net_vdev_netvsc.a drivers/librte_net_vhost.a drivers/librte_net_virtio.a drivers/librte_net_vmxnet3.a drivers/librte_raw_cnxk_bphy.a drivers/librte_raw_dpaa2_cmdif.a drivers/librte_raw_dpaa2_qdma.a drivers/librte_raw_ifpga.a drivers/librte_raw_ioat.a drivers/librte_raw_ntb.a drivers/librte_raw_octeontx2_dma.a drivers/librte_raw_octeontx2_ep.a drivers/librte_raw_skeleton.a drivers/librte_crypto_bcmfs.a drivers/librte_crypto_caam_jr.a drivers/librte_crypto_ccp.a drivers/librte_crypto_cnxk.a drivers/librte_crypto_dpaa_sec.a drivers/librte_crypto_dpaa2_sec.a drivers/librte_crypto_mlx5.a drivers/librte_crypto_nitrox.a drivers/librte_crypto_null.a drivers/librte_crypto_octeontx.a drivers/librte_crypto_octeontx2.a drivers/librte_crypto_openssl.a drivers/librte_crypto_scheduler.a drivers/librte_crypto_virtio.a drivers/librte_compress_mlx5.a drivers/librte_compress_octeontx.a drivers/librte_compress_zlib.a drivers/librte_regex_mlx5.a drivers/librte_regex_octeontx2.a drivers/librte_vdpa_ifc.a drivers/librte_vdpa_mlx5.a drivers/librte_event_cnxk.a drivers/librte_event_dlb2.a drivers/librte_event_dpaa.a drivers/librte_event_dpaa2.a drivers/librte_event_dsw.a drivers/librte_event_octeontx2.a drivers/librte_event_opdl.a drivers/librte_event_skeleton.a drivers/librte_event_sw.a drivers/librte_event_octeontx.a drivers/librte_baseband_acc100.a drivers/librte_baseband_fpga_5gnr_fec.a drivers/librte_baseband_fpga_lte_fec.a drivers/librte_baseband_null.a drivers/librte_baseband_turbo_sw.a -Wl,--no-whole-archive -Wl,--no-as-needed -pthread -lm -ldl -lnuma -lfdt -Wl,-rpath,XXXXXXXXXXXXXXXXXXXXXXXXXXXXXXXXXXXXXXXXXXXXXX /usr/lib/x86_64-linux-gnu/libz.so /usr/lib/x86_64-linux-gnu/libelf.so /usr/lib/x86_64-linux-gnu/libpcap.so -lmlx5 -libverbs /usr/lib/x86_64-linux-gnu/libcrypto.so -lmlx4 -libverbs -lmlx5 -libverbs -latomic -lrt -lmlx5 -libverbs -lmlx5 -libverbs -lmlx5 -libverbs -lmlx5 -libverbs -Wl,--end-group
app/test/dpdk-test.p/test_fib6.c.o: In function `check_fib':
test_fib6.c:(.text+0x8ef): undefined reference to `get_msk_part'
collect2: error: ld returned 1 exit status
ninja: build stopped: subcommand failed.

https://lab.dpdk.org/results/dashboard/patchsets/19401/

UNH-IOL DPDK Community Lab

^ permalink raw reply	[flat|nested] only message in thread

only message in thread, other threads:[~2021-10-14  3:44 UTC | newest]

Thread overview: (only message) (download: mbox.gz / follow: Atom feed)
-- links below jump to the message on this page --
2021-10-14  3:44 [dpdk-test-report] |FAILURE| pw101523-101535 [PATCH] [v4, 12/12] app/test: enable subset of unit tests on Windows dpdklab

automatic DPDK test reports

This inbox may be cloned and mirrored by anyone:

	git clone --mirror http://inbox.dpdk.org/test-report/0 test-report/git/0.git

	# If you have public-inbox 1.1+ installed, you may
	# initialize and index your mirror using the following commands:
	public-inbox-init -V2 test-report test-report/ http://inbox.dpdk.org/test-report \
		test-report@dpdk.org
	public-inbox-index test-report

Example config snippet for mirrors.
Newsgroup available over NNTP:
	nntp://inbox.dpdk.org/inbox.dpdk.test-report


AGPL code for this site: git clone https://public-inbox.org/public-inbox.git