automatic DPDK test reports
 help / color / mirror / Atom feed
* |SUCCESS| pw126339-126342 [PATCH 4/4] app: add testgraph application
       [not found] <20230421060245.3136217-5-vattunuru@marvell.com>
@ 2023-04-21  5:52 ` qemudev
  2023-04-21  5:56 ` qemudev
                   ` (2 subsequent siblings)
  3 siblings, 0 replies; 29+ messages in thread
From: qemudev @ 2023-04-21  5:52 UTC (permalink / raw)
  To: test-report

Test-Label: loongarch-compilation
Test-Status: SUCCESS
http://dpdk.org/patch/126342

_Compilation OK_

Submitter: Vamsi Attunuru <vattunuru@marvell.com>
Date: Thu, 20 Apr 2023 23:02:42 -0700
DPDK git baseline: Repo:dpdk
  Branch: main
  CommitID: 5f34cc454df420b9b2da8deb949fb76cba058b87

126339-126342 --> meson & ninja build successfully

Test environment and result as below:

+---------------------+----------------+
|     Environment     | compilation    |
+---------------------+----------------+
| Loongnix-Server 8.3 | PASS           |
+---------------------+----------------+

Loongnix-Server 8.3
    Kernel: 4.19.190+
    Compiler: gcc 8.3


^ permalink raw reply	[flat|nested] 29+ messages in thread

* |SUCCESS| pw126339-126342 [PATCH 4/4] app: add testgraph application
       [not found] <20230421060245.3136217-5-vattunuru@marvell.com>
  2023-04-21  5:52 ` |SUCCESS| pw126339-126342 [PATCH 4/4] app: add testgraph application qemudev
@ 2023-04-21  5:56 ` qemudev
  2023-04-21  6:04 ` |SUCCESS| pw126342 " checkpatch
  2023-04-21  6:59 ` |FAILURE| " 0-day Robot
  3 siblings, 0 replies; 29+ messages in thread
From: qemudev @ 2023-04-21  5:56 UTC (permalink / raw)
  To: test-report

Test-Label: loongarch-unit-testing
Test-Status: SUCCESS
http://dpdk.org/patch/126342

_Unit Testing PASS_

Submitter: Vamsi Attunuru <vattunuru@marvell.com>
Date: Thu, 20 Apr 2023 23:02:42 -0700
DPDK git baseline: Repo:dpdk
  Branch: main
  CommitID: 5f34cc454df420b9b2da8deb949fb76cba058b87

126339-126342 --> testing pass

Test environment and result as below:

+---------------------+----------------+
|     Environment     | dpdk_unit_test |
+---------------------+----------------+
| Loongnix-Server 8.3 | PASS           |
+---------------------+----------------+

Loongnix-Server 8.3
    Kernel: 4.19.190+
    Compiler: gcc 8.3


Test result details:
  1/104 DPDK:fast-tests / acl_autotest                            OK              2.82s
  2/104 DPDK:fast-tests / atomic_autotest                         OK              7.13s
  3/104 DPDK:fast-tests / bitmap_autotest                         OK              0.07s
  4/104 DPDK:fast-tests / bpf_autotest                            OK              0.07s
  5/104 DPDK:fast-tests / bpf_convert_autotest                    OK              0.07s
  6/104 DPDK:fast-tests / bitops_autotest                         OK              0.07s
  7/104 DPDK:fast-tests / byteorder_autotest                      OK              0.07s
  8/104 DPDK:fast-tests / cksum_autotest                          OK              0.07s
  9/104 DPDK:fast-tests / cmdline_autotest                        OK              0.07s
 10/104 DPDK:fast-tests / common_autotest                         OK              0.92s
 11/104 DPDK:fast-tests / cpuflags_autotest                       OK              0.07s
 12/104 DPDK:fast-tests / debug_autotest                          OK              2.17s
 13/104 DPDK:fast-tests / devargs_autotest                        OK              0.07s
 14/104 DPDK:fast-tests / eal_flags_c_opt_autotest                OK              0.62s
 15/104 DPDK:fast-tests / eal_flags_main_opt_autotest             OK              0.22s
 16/104 DPDK:fast-tests / eal_flags_n_opt_autotest                OK              0.17s
 17/104 DPDK:fast-tests / eal_flags_hpet_autotest                 OK              0.12s
 18/104 DPDK:fast-tests / eal_flags_no_huge_autotest              OK              0.22s
 19/104 DPDK:fast-tests / eal_flags_a_opt_autotest                OK              0.27s
 20/104 DPDK:fast-tests / eal_flags_b_opt_autotest                OK              0.22s
 21/104 DPDK:fast-tests / eal_flags_vdev_opt_autotest             OK              0.17s
 22/104 DPDK:fast-tests / eal_flags_r_opt_autotest                OK              0.17s
 23/104 DPDK:fast-tests / eal_flags_mem_autotest                  OK              0.52s
 24/104 DPDK:fast-tests / eal_flags_file_prefix_autotest          OK             22.26s
 25/104 DPDK:fast-tests / eal_flags_misc_autotest                 OK              0.77s
 26/104 DPDK:fast-tests / eal_fs_autotest                         OK              0.07s
 27/104 DPDK:fast-tests / errno_autotest                          OK              0.07s
 28/104 DPDK:fast-tests / ethdev_link_status                      OK              0.07s
 29/104 DPDK:fast-tests / event_ring_autotest                     OK              0.07s
 30/104 DPDK:fast-tests / fib_autotest                            OK              0.87s
 31/104 DPDK:fast-tests / fib6_autotest                           OK              0.92s
 32/104 DPDK:fast-tests / func_reentrancy_autotest                OK              2.23s
 33/104 DPDK:fast-tests / hash_autotest                           OK              0.97s
 34/104 DPDK:fast-tests / interrupt_autotest                      OK              1.37s
 35/104 DPDK:fast-tests / ipfrag_autotest                         OK              0.07s
 36/104 DPDK:fast-tests / lcores_autotest                         OK              5.07s
 37/104 DPDK:fast-tests / logs_autotest                           OK              0.07s
 38/104 DPDK:fast-tests / lpm_autotest                            OK              5.95s
 39/104 DPDK:fast-tests / lpm6_autotest                           OK              8.91s
 40/104 DPDK:fast-tests / malloc_autotest                         OK             64.05s
 41/104 DPDK:fast-tests / mbuf_autotest                           OK              6.63s
 42/104 DPDK:fast-tests / mcslock_autotest                        OK              3.42s
 43/104 DPDK:fast-tests / memcpy_autotest                         OK              6.68s
 44/104 DPDK:fast-tests / memory_autotest                         OK              0.12s
 45/104 DPDK:fast-tests / mempool_autotest                        OK              0.47s
 46/104 DPDK:fast-tests / memzone_autotest                        OK              0.17s
 47/104 DPDK:fast-tests / meter_autotest                          OK              0.07s
 48/104 DPDK:fast-tests / multiprocess_autotest                   OK              0.17s
 49/104 DPDK:fast-tests / per_lcore_autotest                      OK              0.17s
 50/104 DPDK:fast-tests / pflock_autotest                         OK              0.87s
 51/104 DPDK:fast-tests / prefetch_autotest                       OK              0.07s
 52/104 DPDK:fast-tests / rcu_qsbr_autotest                       OK              0.57s
 53/104 DPDK:fast-tests / pie_autotest                            OK              0.07s
 54/104 DPDK:fast-tests / rib_autotest                            OK             10.29s
 55/104 DPDK:fast-tests / rib6_autotest                           OK             10.29s
 56/104 DPDK:fast-tests / ring_autotest                           OK              0.12s
 57/104 DPDK:fast-tests / rwlock_test1_autotest                   OK              0.82s
 58/104 DPDK:fast-tests / rwlock_rda_autotest                     OK              5.07s
 59/104 DPDK:fast-tests / rwlock_rds_wrm_autotest                 OK              5.07s
 60/104 DPDK:fast-tests / rwlock_rde_wro_autotest                 OK              5.07s
 61/104 DPDK:fast-tests / sched_autotest                          OK              0.07s
 62/104 DPDK:fast-tests / security_autotest                       OK              0.07s
 63/104 DPDK:fast-tests / seqlock_autotest                        OK              2.07s
 64/104 DPDK:fast-tests / spinlock_autotest                       OK              0.17s
 65/104 DPDK:fast-tests / stack_autotest                          OK              0.87s
 66/104 DPDK:fast-tests / stack_lf_autotest                       SKIP            0.07s   exit status 77
 67/104 DPDK:fast-tests / string_autotest                         OK              0.07s
 68/104 DPDK:fast-tests / tailq_autotest                          OK              0.07s
 69/104 DPDK:fast-tests / ticketlock_autotest                     OK              0.22s
 70/104 DPDK:fast-tests / timer_autotest                          OK              3.87s
 71/104 DPDK:fast-tests / user_delay_us                           OK              0.07s
 72/104 DPDK:fast-tests / version_autotest                        OK              0.07s
 73/104 DPDK:fast-tests / crc_autotest                            OK              0.07s
 74/104 DPDK:fast-tests / distributor_autotest                    OK              1.22s
 75/104 DPDK:fast-tests / eventdev_common_autotest                OK              0.07s
 76/104 DPDK:fast-tests / fbarray_autotest                        OK              0.07s
 77/104 DPDK:fast-tests / hash_readwrite_func_autotest            OK              6.43s
 78/104 DPDK:fast-tests / ipsec_autotest                          SKIP            0.07s   exit status 77
 79/104 DPDK:fast-tests / kni_autotest                            SKIP            0.07s   exit status 77
 80/104 DPDK:fast-tests / kvargs_autotest                         OK              0.07s
 81/104 DPDK:fast-tests / member_autotest                         OK              1.27s
 82/104 DPDK:fast-tests / power_cpufreq_autotest                  SKIP            0.07s   exit status 77
 83/104 DPDK:fast-tests / power_autotest                          OK              0.07s
 84/104 DPDK:fast-tests / power_kvm_vm_autotest                   SKIP            0.07s   exit status 77
 85/104 DPDK:fast-tests / power_intel_uncore_autotest             SKIP            0.07s   exit status 77
 86/104 DPDK:fast-tests / reorder_autotest                        OK              0.12s
 87/104 DPDK:fast-tests / service_autotest                        OK              3.02s
 88/104 DPDK:fast-tests / thash_autotest                          OK              0.07s
 89/104 DPDK:fast-tests / threads_autotest                        OK              0.27s
 90/104 DPDK:fast-tests / trace_autotest                          OK              0.07s
 91/104 DPDK:fast-tests / trace_autotest_with_traces              OK              0.12s
 92/104 DPDK:fast-tests / metrics_autotest                        OK              0.07s
 93/104 DPDK:fast-tests / telemetry_json_autotest                 OK              0.07s
 94/104 DPDK:fast-tests / telemetry_data_autotest                 OK              0.07s
 95/104 DPDK:fast-tests / table_autotest                          OK             10.14s
 96/104 DPDK:fast-tests / ring_pmd_autotest                       OK              0.07s
 97/104 DPDK:fast-tests / event_eth_tx_adapter_autotest           OK              1.47s
 98/104 DPDK:fast-tests / bitratestats_autotest                   OK              0.07s
 99/104 DPDK:fast-tests / latencystats_autotest                   OK              0.07s
100/104 DPDK:fast-tests / pdump_autotest                          OK              5.17s
101/104 DPDK:fast-tests / vdev_autotest                           OK              0.07s
102/104 DPDK:fast-tests / rawdev_autotest                         OK              0.07s
103/104 DPDK:fast-tests / compressdev_autotest                    SKIP            0.07s   exit status 77
104/104 DPDK:fast-tests / telemetry_all                           OK             14.79s


Ok:                 97
Expected Fail:      0
Fail:               0
Unexpected Pass:    0
Skipped:            7
Timeout:            0


^ permalink raw reply	[flat|nested] 29+ messages in thread

* |SUCCESS| pw126342 [PATCH 4/4] app: add testgraph application
       [not found] <20230421060245.3136217-5-vattunuru@marvell.com>
  2023-04-21  5:52 ` |SUCCESS| pw126339-126342 [PATCH 4/4] app: add testgraph application qemudev
  2023-04-21  5:56 ` qemudev
@ 2023-04-21  6:04 ` checkpatch
  2023-04-21  6:59 ` |FAILURE| " 0-day Robot
  3 siblings, 0 replies; 29+ messages in thread
From: checkpatch @ 2023-04-21  6:04 UTC (permalink / raw)
  To: test-report

Test-Label: checkpatch
Test-Status: SUCCESS
http://dpdk.org/patch/126342

_coding style OK_



^ permalink raw reply	[flat|nested] 29+ messages in thread

* |FAILURE| pw126342 [PATCH 4/4] app: add testgraph application
       [not found] <20230421060245.3136217-5-vattunuru@marvell.com>
                   ` (2 preceding siblings ...)
  2023-04-21  6:04 ` |SUCCESS| pw126342 " checkpatch
@ 2023-04-21  6:59 ` 0-day Robot
  3 siblings, 0 replies; 29+ messages in thread
From: 0-day Robot @ 2023-04-21  6:59 UTC (permalink / raw)
  To: test-report; +Cc: vattunuru, robot

From: robot@bytheb.org

Test-Label: github-robot: build
Test-Status: FAILURE
http://patchwork.dpdk.org/patch/126342/

_github build: failed_
Build URL: https://github.com/ovsrobot/dpdk/actions/runs/4762063151
Build Logs:
-----------------------Summary of failed steps-----------------------
"ubuntu-20.04-gcc-abi+debug+doc+tests" failed at step Build and test
"ubuntu-20.04-clang-asan+doc+tests" failed at step Build and test
"ubuntu-20.04-gcc-static-mingw" failed at step Install test tools packages
"ubuntu-20.04-gcc-aarch64" failed at step Build and test
"ubuntu-20.04-gcc-ppc64le" failed at step Build and test
"ubuntu-20.04-gcc-riscv64" failed at step Build and test
"fedora:35-gcc" failed at step Build
"fedora:35-clang" failed at step Build
----------------------End summary of failed steps--------------------

-------------------------------BEGIN LOGS----------------------------
####################################################################################
#### [Begin job log] "ubuntu-20.04-gcc-abi+debug+doc+tests" at step Build and test
####################################################################################
[22/721] Linking target app/dpdk-test-cmdline.
[23/721] Linking target app/dpdk-test-compress-perf.
[24/721] Linking target app/dpdk-test-fib.
[25/721] Linking target app/dpdk-test-crypto-perf.
[26/721] Linking target app/dpdk-test-flow-perf.
[27/721] Linking target app/dpdk-test-gpudev.
[28/721] Linking target app/dpdk-test-eventdev.
[29/721] Linking target app/dpdk-test-graph.
FAILED: app/dpdk-test-graph 
gcc  -o app/dpdk-test-graph 'app/a172ced@@dpdk-test-graph@exe/test-graph_cmdline.c.o' 'app/a172ced@@dpdk-test-graph@exe/test-graph_cmdline_graph.c.o' 'app/a172ced@@dpdk-test-graph@exe/test-graph_parameters.c.o' 'app/a172ced@@dpdk-test-graph@exe/test-graph_testgraph.c.o' -Wl,--as-needed -Wl,--no-undefined -Wl,--no-as-needed -pthread -Wl,--start-group -lm -ldl -lnuma -lfdt -larchive lib/librte_ethdev.so.23.2 lib/librte_eal.so.23.2 lib/librte_kvargs.so.23.2 lib/librte_telemetry.so.23.2 lib/librte_net.so.23.2 lib/librte_mbuf.so.23.2 lib/librte_mempool.so.23.2 lib/librte_ring.so.23.2 lib/librte_meter.so.23.2 lib/librte_cmdline.so.23.2 lib/librte_graph.so.23.2 lib/librte_pcapng.so.23.2 lib/librte_node.so.23.2 lib/librte_lpm.so.23.2 lib/librte_hash.so.23.2 lib/librte_rcu.so.23.2 lib/librte_cryptodev.so.23.2 /usr/lib/x86_64-linux-gnu/libbsd.so -Wl,--end-group '-Wl,-rpath,$ORIGIN/../lib:XXXXXXXXXXXXXXXXXXXXXXXXXXXXXXXX' -Wl,-rpath-link,/home/runner/work/dpdk/dpdk/build/lib
/usr/bin/ld: app/a172ced@@dpdk-test-graph@exe/test-graph_testgraph.c.o: in function `ethdev_tx_node_configure':
/home/runner/work/dpdk/dpdk/build/../app/test-graph/testgraph.c:657: undefined reference to `ethdev_tx_node_data_get'
/usr/bin/ld: /home/runner/work/dpdk/dpdk/build/../app/test-graph/testgraph.c:658: undefined reference to `ethdev_tx_node_get'
/usr/bin/ld: app/a172ced@@dpdk-test-graph@exe/test-graph_testgraph.c.o: in function `punt_kernel_node_configure':
/home/runner/work/dpdk/dpdk/build/../app/test-graph/testgraph.c:686: undefined reference to `punt_kernel_node_get'
/usr/bin/ld: app/a172ced@@dpdk-test-graph@exe/test-graph_testgraph.c.o: in function `ethdev_rx_node_configure':
/home/runner/work/dpdk/dpdk/build/../app/test-graph/testgraph.c:725: undefined reference to `ethdev_rx_get_node_data_get'
/usr/bin/ld: /home/runner/work/dpdk/dpdk/build/../app/test-graph/testgraph.c:726: undefined reference to `ethdev_rx_node_get'
/usr/bin/ld: app/a172ced@@dpdk-test-graph@exe/test-graph_testgraph.c.o: in function `update_ethdev_rx_node_next':
/home/runner/work/dpdk/dpdk/build/../app/test-graph/testgraph.c:765: undefined reference to `ethdev_rx_get_node_data_get'
collect2: error: ld returned 1 exit status
[30/721] Linking target app/dpdk-test-mldev.
[31/721] Linking target app/dpdk-test-pipeline.
ninja: build stopped: subcommand failed.
##[error]Process completed with exit code 1.
####################################################################################
#### [End job log] "ubuntu-20.04-gcc-abi+debug+doc+tests" at step Build and test
####################################################################################




####################################################################################
#### [Begin job log] "ubuntu-20.04-clang-asan+doc+tests" at step Build and test
####################################################################################
[23/721] Linking target app/dpdk-test-cmdline.
[24/721] Linking target app/dpdk-test-compress-perf.
[25/721] Linking target app/dpdk-test-crypto-perf.
[26/721] Linking target app/dpdk-test-fib.
[27/721] Linking target app/dpdk-test-eventdev.
[28/721] Linking target app/dpdk-test-flow-perf.
[29/721] Linking target app/dpdk-test-graph.
FAILED: app/dpdk-test-graph 
clang  -o app/dpdk-test-graph 'app/a172ced@@dpdk-test-graph@exe/test-graph_cmdline.c.o' 'app/a172ced@@dpdk-test-graph@exe/test-graph_cmdline_graph.c.o' 'app/a172ced@@dpdk-test-graph@exe/test-graph_parameters.c.o' 'app/a172ced@@dpdk-test-graph@exe/test-graph_testgraph.c.o' -fsanitize=address -Wl,--as-needed -Wl,--allow-shlib-undefined -Wl,--no-as-needed -pthread -Wl,--start-group -lm -ldl -lnuma -lfdt -larchive lib/librte_ethdev.so.23.2 lib/librte_eal.so.23.2 lib/librte_kvargs.so.23.2 lib/librte_telemetry.so.23.2 lib/librte_net.so.23.2 lib/librte_mbuf.so.23.2 lib/librte_mempool.so.23.2 lib/librte_ring.so.23.2 lib/librte_meter.so.23.2 lib/librte_cmdline.so.23.2 lib/librte_graph.so.23.2 lib/librte_pcapng.so.23.2 lib/librte_node.so.23.2 lib/librte_lpm.so.23.2 lib/librte_hash.so.23.2 lib/librte_rcu.so.23.2 lib/librte_cryptodev.so.23.2 /usr/lib/x86_64-linux-gnu/libbsd.so -Wl,--end-group '-Wl,-rpath,$ORIGIN/../lib:XXXXXXXXXXXXXXXXXXXXXXXXXXXXXXXX' -Wl,-rpath-link,/home/runner/work/dpdk/dpdk/build/lib
/usr/bin/ld: app/a172ced@@dpdk-test-graph@exe/test-graph_testgraph.c.o: in function `ethdev_rx_node_configure':
/home/runner/work/dpdk/dpdk/build/../app/test-graph/testgraph.c:725: undefined reference to `ethdev_rx_get_node_data_get'
/usr/bin/ld: /home/runner/work/dpdk/dpdk/build/../app/test-graph/testgraph.c:726: undefined reference to `ethdev_rx_node_get'
/usr/bin/ld: app/a172ced@@dpdk-test-graph@exe/test-graph_testgraph.c.o: in function `ethdev_tx_node_configure':
/home/runner/work/dpdk/dpdk/build/../app/test-graph/testgraph.c:657: undefined reference to `ethdev_tx_node_data_get'
/usr/bin/ld: /home/runner/work/dpdk/dpdk/build/../app/test-graph/testgraph.c:658: undefined reference to `ethdev_tx_node_get'
/usr/bin/ld: app/a172ced@@dpdk-test-graph@exe/test-graph_testgraph.c.o: in function `punt_kernel_node_configure':
/home/runner/work/dpdk/dpdk/build/../app/test-graph/testgraph.c:686: undefined reference to `punt_kernel_node_get'
/usr/bin/ld: app/a172ced@@dpdk-test-graph@exe/test-graph_testgraph.c.o: in function `update_ethdev_rx_node_next':
/home/runner/work/dpdk/dpdk/build/../app/test-graph/testgraph.c:765: undefined reference to `ethdev_rx_get_node_data_get'
/usr/bin/ld: /home/runner/work/dpdk/dpdk/build/../app/test-graph/testgraph.c:765: undefined reference to `ethdev_rx_get_node_data_get'
clang: error: linker command failed with exit code 1 (use -v to see invocation)
[30/721] Linking target app/dpdk-test-mldev.
[31/721] Linking target app/dpdk-test-pipeline.
ninja: build stopped: subcommand failed.
##[error]Process completed with exit code 1.
####################################################################################
#### [End job log] "ubuntu-20.04-clang-asan+doc+tests" at step Build and test
####################################################################################




####################################################################################
#### [Begin job log] "ubuntu-20.04-gcc-static-mingw" at step Install test tools packages
####################################################################################
Get:1 http://ppa.launchpad.net/ubuntu-toolchain-r/test/ubuntu focal/main amd64 gdb amd64 10.2-0ubuntu1~20.04~1 [3282 kB]
Err:2 http://azure.archive.ubuntu.com/ubuntu focal/main amd64 libbabeltrace1 amd64 1.5.8-1build1
  Could not connect to azure.archive.ubuntu.com:80 (52.147.219.192), connection timed out
Err:3 http://azure.archive.ubuntu.com/ubuntu focal/universe amd64 libipt2 amd64 2.0.1-1
  Unable to connect to azure.archive.ubuntu.com:http:
Err:4 http://azure.archive.ubuntu.com/ubuntu focal/universe amd64 libsource-highlight-common all 3.1.8-1.2build5
  Unable to connect to azure.archive.ubuntu.com:http:
Err:5 http://azure.archive.ubuntu.com/ubuntu focal/universe amd64 libboost-regex1.71.0 amd64 1.71.0-6ubuntu6
  Unable to connect to azure.archive.ubuntu.com:http:
Err:6 http://azure.archive.ubuntu.com/ubuntu focal/universe amd64 libsource-highlight4v5 amd64 3.1.8-1.2build5
  Unable to connect to azure.archive.ubuntu.com:http:
Err:7 http://azure.archive.ubuntu.com/ubuntu focal/universe amd64 libxxhash0 amd64 0.7.3-1
  Unable to connect to azure.archive.ubuntu.com:http:
Err:8 http://azure.archive.ubuntu.com/ubuntu focal-updates/main amd64 libc6-dbg amd64 2.31-0ubuntu9.9
  Unable to connect to azure.archive.ubuntu.com:http:
Fetched 3282 kB in 30s (108 kB/s)
E: Failed to fetch http://azure.archive.ubuntu.com/ubuntu/pool/main/b/babeltrace/libbabeltrace1_1.5.8-1build1_amd64.deb  Could not connect to azure.archive.ubuntu.com:80 (52.147.219.192), connection timed out
E: Failed to fetch http://azure.archive.ubuntu.com/ubuntu/pool/universe/i/intel-processor-trace/libipt2_2.0.1-1_amd64.deb  Unable to connect to azure.archive.ubuntu.com:http:
E: Failed to fetch http://azure.archive.ubuntu.com/ubuntu/pool/universe/s/source-highlight/libsource-highlight-common_3.1.8-1.2build5_all.deb  Unable to connect to azure.archive.ubuntu.com:http:
E: Failed to fetch http://azure.archive.ubuntu.com/ubuntu/pool/universe/b/boost1.71/libboost-regex1.71.0_1.71.0-6ubuntu6_amd64.deb  Unable to connect to azure.archive.ubuntu.com:http:
E: Failed to fetch http://azure.archive.ubuntu.com/ubuntu/pool/universe/s/source-highlight/libsource-highlight4v5_3.1.8-1.2build5_amd64.deb  Unable to connect to azure.archive.ubuntu.com:http:
E: Failed to fetch http://azure.archive.ubuntu.com/ubuntu/pool/universe/x/xxhash/libxxhash0_0.7.3-1_amd64.deb  Unable to connect to azure.archive.ubuntu.com:http:
E: Failed to fetch http://azure.archive.ubuntu.com/ubuntu/pool/main/g/glibc/libc6-dbg_2.31-0ubuntu9.9_amd64.deb  Unable to connect to azure.archive.ubuntu.com:http:
E: Unable to fetch some archives, maybe run apt-get update or try with --fix-missing?
##[error]Process completed with exit code 100.
####################################################################################
#### [End job log] "ubuntu-20.04-gcc-static-mingw" at step Install test tools packages
####################################################################################




####################################################################################
#### [Begin job log] "ubuntu-20.04-gcc-aarch64" at step Build and test
####################################################################################
[30/691] Linking target app/dpdk-test-cmdline.
[31/691] Linking target app/dpdk-test-bbdev.
[32/691] Linking target app/dpdk-test-compress-perf.
[33/691] Linking target app/dpdk-test-crypto-perf.
[34/691] Linking target app/dpdk-test-eventdev.
[35/691] Linking target app/dpdk-test-fib.
[36/691] Linking target app/dpdk-test-flow-perf.
[37/691] Linking target app/dpdk-test-graph.
FAILED: app/dpdk-test-graph 
aarch64-linux-gnu-gcc  -o app/dpdk-test-graph 'app/a172ced@@dpdk-test-graph@exe/test-graph_cmdline.c.o' 'app/a172ced@@dpdk-test-graph@exe/test-graph_cmdline_graph.c.o' 'app/a172ced@@dpdk-test-graph@exe/test-graph_parameters.c.o' 'app/a172ced@@dpdk-test-graph@exe/test-graph_testgraph.c.o' -Wl,--as-needed -Wl,--no-undefined -Wl,--no-as-needed -pthread -Wl,--start-group -lm -ldl lib/librte_ethdev.so.23.2 lib/librte_eal.so.23.2 lib/librte_kvargs.so.23.2 lib/librte_telemetry.so.23.2 lib/librte_net.so.23.2 lib/librte_mbuf.so.23.2 lib/librte_mempool.so.23.2 lib/librte_ring.so.23.2 lib/librte_meter.so.23.2 lib/librte_cmdline.so.23.2 lib/librte_graph.so.23.2 lib/librte_pcapng.so.23.2 lib/librte_node.so.23.2 lib/librte_lpm.so.23.2 lib/librte_hash.so.23.2 lib/librte_rcu.so.23.2 lib/librte_cryptodev.so.23.2 -Wl,--end-group '-Wl,-rpath,$ORIGIN/../lib:XXXXXXXXXXXXXXX' -Wl,-rpath-link,/home/runner/work/dpdk/dpdk/build/lib
/usr/lib/gcc-cross/aarch64-linux-gnu/9/../../../../aarch64-linux-gnu/bin/ld: app/a172ced@@dpdk-test-graph@exe/test-graph_testgraph.c.o: in function `update_ethdev_rx_node_next':
/home/runner/work/dpdk/dpdk/build/../app/test-graph/testgraph.c:765: undefined reference to `ethdev_rx_get_node_data_get'
/usr/lib/gcc-cross/aarch64-linux-gnu/9/../../../../aarch64-linux-gnu/bin/ld: app/a172ced@@dpdk-test-graph@exe/test-graph_testgraph.c.o: in function `punt_kernel_node_configure':
/home/runner/work/dpdk/dpdk/build/../app/test-graph/testgraph.c:686: undefined reference to `punt_kernel_node_get'
/usr/lib/gcc-cross/aarch64-linux-gnu/9/../../../../aarch64-linux-gnu/bin/ld: app/a172ced@@dpdk-test-graph@exe/test-graph_testgraph.c.o: in function `ethdev_rx_node_configure':
/home/runner/work/dpdk/dpdk/build/../app/test-graph/testgraph.c:725: undefined reference to `ethdev_rx_get_node_data_get'
/usr/lib/gcc-cross/aarch64-linux-gnu/9/../../../../aarch64-linux-gnu/bin/ld: /home/runner/work/dpdk/dpdk/build/../app/test-graph/testgraph.c:726: undefined reference to `ethdev_rx_node_get'
/usr/lib/gcc-cross/aarch64-linux-gnu/9/../../../../aarch64-linux-gnu/bin/ld: app/a172ced@@dpdk-test-graph@exe/test-graph_testgraph.c.o: in function `ethdev_tx_node_configure':
/home/runner/work/dpdk/dpdk/build/../app/test-graph/testgraph.c:657: undefined reference to `ethdev_tx_node_data_get'
/usr/lib/gcc-cross/aarch64-linux-gnu/9/../../../../aarch64-linux-gnu/bin/ld: /home/runner/work/dpdk/dpdk/build/../app/test-graph/testgraph.c:658: undefined reference to `ethdev_tx_node_get'
collect2: error: ld returned 1 exit status
[38/691] Linking target app/dpdk-test-gpudev.
[39/691] Linking target app/dpdk-test-mldev.
ninja: build stopped: subcommand failed.
##[error]Process completed with exit code 1.
####################################################################################
#### [End job log] "ubuntu-20.04-gcc-aarch64" at step Build and test
####################################################################################




####################################################################################
#### [Begin job log] "ubuntu-20.04-gcc-ppc64le" at step Build and test
####################################################################################
[37/691] Linking target app/dpdk-test-acl.
[38/691] Linking target app/dpdk-test-cmdline.
[39/691] Linking target app/dpdk-test-bbdev.
[40/691] Linking target app/dpdk-test-compress-perf.
[41/691] Linking target app/dpdk-test-crypto-perf.
[42/691] Linking target app/dpdk-test-fib.
[43/691] Linking target app/dpdk-test-eventdev.
[44/691] Linking target app/dpdk-test-graph.
FAILED: app/dpdk-test-graph 
powerpc64le-linux-gnu-gcc  -o app/dpdk-test-graph 'app/a172ced@@dpdk-test-graph@exe/test-graph_cmdline.c.o' 'app/a172ced@@dpdk-test-graph@exe/test-graph_cmdline_graph.c.o' 'app/a172ced@@dpdk-test-graph@exe/test-graph_parameters.c.o' 'app/a172ced@@dpdk-test-graph@exe/test-graph_testgraph.c.o' -Wl,--as-needed -Wl,--no-undefined -Wl,--no-as-needed -pthread -Wl,--start-group -lm -ldl lib/librte_ethdev.so.23.2 lib/librte_eal.so.23.2 lib/librte_kvargs.so.23.2 lib/librte_telemetry.so.23.2 lib/librte_net.so.23.2 lib/librte_mbuf.so.23.2 lib/librte_mempool.so.23.2 lib/librte_ring.so.23.2 lib/librte_meter.so.23.2 lib/librte_cmdline.so.23.2 lib/librte_graph.so.23.2 lib/librte_pcapng.so.23.2 lib/librte_node.so.23.2 lib/librte_lpm.so.23.2 lib/librte_hash.so.23.2 lib/librte_rcu.so.23.2 lib/librte_cryptodev.so.23.2 -Wl,--end-group '-Wl,-rpath,$ORIGIN/../lib:XXXXXXXXXXXXXXX' -Wl,-rpath-link,/home/runner/work/dpdk/dpdk/build/lib
/usr/lib/gcc-cross/powerpc64le-linux-gnu/9/../../../../powerpc64le-linux-gnu/bin/ld: app/a172ced@@dpdk-test-graph@exe/test-graph_testgraph.c.o: in function `update_ethdev_rx_node_next':
/home/runner/work/dpdk/dpdk/build/../app/test-graph/testgraph.c:765: undefined reference to `ethdev_rx_get_node_data_get'
/usr/lib/gcc-cross/powerpc64le-linux-gnu/9/../../../../powerpc64le-linux-gnu/bin/ld: app/a172ced@@dpdk-test-graph@exe/test-graph_testgraph.c.o: in function `punt_kernel_node_configure':
/home/runner/work/dpdk/dpdk/build/../app/test-graph/testgraph.c:686: undefined reference to `punt_kernel_node_get'
/usr/lib/gcc-cross/powerpc64le-linux-gnu/9/../../../../powerpc64le-linux-gnu/bin/ld: app/a172ced@@dpdk-test-graph@exe/test-graph_testgraph.c.o: in function `ethdev_tx_node_configure':
/home/runner/work/dpdk/dpdk/build/../app/test-graph/testgraph.c:657: undefined reference to `ethdev_tx_node_data_get'
/usr/lib/gcc-cross/powerpc64le-linux-gnu/9/../../../../powerpc64le-linux-gnu/bin/ld: /home/runner/work/dpdk/dpdk/build/../app/test-graph/testgraph.c:658: undefined reference to `ethdev_tx_node_get'
/usr/lib/gcc-cross/powerpc64le-linux-gnu/9/../../../../powerpc64le-linux-gnu/bin/ld: app/a172ced@@dpdk-test-graph@exe/test-graph_testgraph.c.o: in function `ethdev_rx_node_configure':
/home/runner/work/dpdk/dpdk/build/../app/test-graph/testgraph.c:725: undefined reference to `ethdev_rx_get_node_data_get'
/usr/lib/gcc-cross/powerpc64le-linux-gnu/9/../../../../powerpc64le-linux-gnu/bin/ld: /home/runner/work/dpdk/dpdk/build/../app/test-graph/testgraph.c:726: undefined reference to `ethdev_rx_node_get'
collect2: error: ld returned 1 exit status
[45/691] Linking target app/dpdk-test-flow-perf.
[46/691] Linking target app/dpdk-test-gpudev.
ninja: build stopped: subcommand failed.
##[error]Process completed with exit code 1.
####################################################################################
#### [End job log] "ubuntu-20.04-gcc-ppc64le" at step Build and test
####################################################################################




####################################################################################
#### [Begin job log] "ubuntu-20.04-gcc-riscv64" at step Build and test
####################################################################################
[34/690] Linking target app/dpdk-test-cmdline.
[35/690] Linking target app/dpdk-test-compress-perf.
[36/690] Linking target app/dpdk-test-crypto-perf.
[37/690] Linking target app/dpdk-test-fib.
[38/690] Linking target app/dpdk-test-bbdev.
[39/690] Linking target app/dpdk-test-eventdev.
[40/690] Linking target app/dpdk-test-graph.
FAILED: app/dpdk-test-graph 
riscv64-linux-gnu-gcc  -o app/dpdk-test-graph 'app/a172ced@@dpdk-test-graph@exe/test-graph_cmdline.c.o' 'app/a172ced@@dpdk-test-graph@exe/test-graph_cmdline_graph.c.o' 'app/a172ced@@dpdk-test-graph@exe/test-graph_parameters.c.o' 'app/a172ced@@dpdk-test-graph@exe/test-graph_testgraph.c.o' -Wl,--as-needed -Wl,--no-undefined -Wl,--no-as-needed -pthread -Wl,--start-group -lm -ldl lib/librte_ethdev.so.23.2 lib/librte_eal.so.23.2 lib/librte_kvargs.so.23.2 lib/librte_telemetry.so.23.2 lib/librte_net.so.23.2 lib/librte_mbuf.so.23.2 lib/librte_mempool.so.23.2 lib/librte_ring.so.23.2 lib/librte_meter.so.23.2 lib/librte_cmdline.so.23.2 lib/librte_graph.so.23.2 lib/librte_pcapng.so.23.2 lib/librte_node.so.23.2 lib/librte_lpm.so.23.2 lib/librte_hash.so.23.2 lib/librte_rcu.so.23.2 lib/librte_cryptodev.so.23.2 -Wl,--end-group '-Wl,-rpath,$ORIGIN/../lib:XXXXXXXXXXXXXXX' -Wl,-rpath-link,/home/runner/work/dpdk/dpdk/build/lib
/usr/lib/gcc-cross/riscv64-linux-gnu/9/../../../../riscv64-linux-gnu/bin/ld: app/a172ced@@dpdk-test-graph@exe/test-graph_testgraph.c.o: in function `update_ethdev_rx_node_next':
/home/runner/work/dpdk/dpdk/build/../app/test-graph/testgraph.c:761: undefined reference to `ethdev_rx_get_node_data_get'
/usr/lib/gcc-cross/riscv64-linux-gnu/9/../../../../riscv64-linux-gnu/bin/ld: app/a172ced@@dpdk-test-graph@exe/test-graph_testgraph.c.o: in function `ethdev_rxq_configure':
/home/runner/work/dpdk/dpdk/build/../app/test-graph/testgraph.c:1001: undefined reference to `punt_kernel_node_get'
/usr/lib/gcc-cross/riscv64-linux-gnu/9/../../../../riscv64-linux-gnu/bin/ld: app/a172ced@@dpdk-test-graph@exe/test-graph_testgraph.c.o: in function `strcpy':
/usr/riscv64-linux-gnu/include/bits/string_fortified.h:90: undefined reference to `ethdev_rx_get_node_data_get'
/usr/lib/gcc-cross/riscv64-linux-gnu/9/../../../../riscv64-linux-gnu/bin/ld: app/a172ced@@dpdk-test-graph@exe/test-graph_testgraph.c.o: in function `link_ethdev_rx_to_punt_kernel_node':
/home/runner/work/dpdk/dpdk/build/../app/test-graph/testgraph.c:856: undefined reference to `ethdev_rx_node_get'
/usr/lib/gcc-cross/riscv64-linux-gnu/9/../../../../riscv64-linux-gnu/bin/ld: app/a172ced@@dpdk-test-graph@exe/test-graph_testgraph.c.o: in function `configure_graph_nodes':
/home/runner/work/dpdk/dpdk/build/../app/test-graph/testgraph.c:1096: undefined reference to `ethdev_tx_node_data_get'
/usr/lib/gcc-cross/riscv64-linux-gnu/9/../../../../riscv64-linux-gnu/bin/ld: /home/runner/work/dpdk/dpdk/build/../app/test-graph/testgraph.c:1096: undefined reference to `ethdev_tx_node_get'
collect2: error: ld returned 1 exit status
[41/690] Linking target app/dpdk-test-flow-perf.
[42/690] Linking target app/dpdk-test-mldev.
ninja: build stopped: subcommand failed.
##[error]Process completed with exit code 1.
####################################################################################
#### [End job log] "ubuntu-20.04-gcc-riscv64" at step Build and test
####################################################################################




####################################################################################
#### [Begin job log] "fedora:35-gcc" at step Build
####################################################################################
####################################################################################
#### [End job log] "fedora:35-gcc" at step Build
####################################################################################




####################################################################################
#### [Begin job log] "fedora:35-clang" at step Build
####################################################################################
####################################################################################
#### [End job log] "fedora:35-clang" at step Build
####################################################################################
--------------------------------END LOGS-----------------------------

^ permalink raw reply	[flat|nested] 29+ messages in thread

* |SUCCESS| pw126339-126342 [PATCH] [4/4] app: add testgraph application
@ 2023-04-21 14:01 dpdklab
  0 siblings, 0 replies; 29+ messages in thread
From: dpdklab @ 2023-04-21 14:01 UTC (permalink / raw)
  To: Test Report; +Cc: dpdk-test-reports, David Marchand, Thomas Monjalon

Test-Label: iol-x86_64-unit-testing
Test-Status: SUCCESS
http://dpdk.org/patch/126342

_Testing PASS_

Submitter: Vamsi Attunuru <vattunuru@marvell.com>
Date: Friday, April 21 2023 06:02:45 
DPDK git baseline: Repo:dpdk
  Branch: master
  CommitID:5f34cc454df420b9b2da8deb949fb76cba058b87

126339-126342 --> testing pass

Test environment and result as below:

+---------------------+----------------+
|     Environment     | dpdk_unit_test |
+=====================+================+
| Ubuntu 20.04        | PASS           |
+---------------------+----------------+
| Windows Server 2019 | PASS           |
+---------------------+----------------+


Ubuntu 20.04
	Kernel: 4.18.0-240.10.1.el8_3.x86_64
	Compiler: gcc 9.3.0-17ubuntu1~20.04

Windows Server 2019
	Kernel: 10.0
	Compiler: clang 14.0 and gcc 8.1.0 (MinGW)

To view detailed results, visit:
https://lab.dpdk.org/results/dashboard/patchsets/26076/

UNH-IOL DPDK Community Lab

To manage your email subscriptions, visit: 
https://lab.dpdk.org/results/dashboard/preferences/subscriptions/

^ permalink raw reply	[flat|nested] 29+ messages in thread

* |SUCCESS| pw126339-126342 [PATCH] [4/4] app: add testgraph application
@ 2023-04-21 14:00 dpdklab
  0 siblings, 0 replies; 29+ messages in thread
From: dpdklab @ 2023-04-21 14:00 UTC (permalink / raw)
  To: Test Report; +Cc: dpdklab, David Marchand, Thomas Monjalon

Test-Label: iol-testing
Test-Status: SUCCESS
http://dpdk.org/patch/126342

_Testing PASS_

Submitter: Vamsi Attunuru <vattunuru@marvell.com>
Date: Friday, April 21 2023 06:02:45 
DPDK git baseline: Repo:dpdk
  Branch: master
  CommitID:5f34cc454df420b9b2da8deb949fb76cba058b87

126339-126342 --> testing pass

Test environment and result as below:

+--------------+----------------------+
| Environment  | dpdk_fips_validation |
+==============+======================+
| Ubuntu 20.04 | PASS                 |
+--------------+----------------------+


Ubuntu 20.04
	Kernel: 4.18.0-240.10.1.el8_3.x86_64
	Compiler: gcc 9.3.0-17ubuntu1~20.04

To view detailed results, visit:
https://lab.dpdk.org/results/dashboard/patchsets/26076/

UNH-IOL DPDK Community Lab

To manage your email subscriptions, visit: 
https://lab.dpdk.org/results/dashboard/preferences/subscriptions/

^ permalink raw reply	[flat|nested] 29+ messages in thread

* |SUCCESS| pw126339-126342 [PATCH] [4/4] app: add testgraph application
@ 2023-04-21 10:26 dpdklab
  0 siblings, 0 replies; 29+ messages in thread
From: dpdklab @ 2023-04-21 10:26 UTC (permalink / raw)
  To: Test Report; +Cc: dpdklab, David Marchand, Thomas Monjalon

Test-Label: iol-abi-testing
Test-Status: SUCCESS
http://dpdk.org/patch/126342

_Testing PASS_

Submitter: Vamsi Attunuru <vattunuru@marvell.com>
Date: Friday, April 21 2023 06:02:45 
DPDK git baseline: Repo:dpdk
  Branch: master
  CommitID:5f34cc454df420b9b2da8deb949fb76cba058b87

126339-126342 --> testing pass

Test environment and result as below:

+------------------+----------+
|   Environment    | abi_test |
+==================+==========+
| RHEL8            | PASS     |
+------------------+----------+
| RHEL 7           | PASS     |
+------------------+----------+
| Debian Bullseye  | PASS     |
+------------------+----------+
| CentOS Stream 9  | PASS     |
+------------------+----------+
| Ubuntu 22.04     | PASS     |
+------------------+----------+
| CentOS Stream 8  | PASS     |
+------------------+----------+
| openSUSE Leap 15 | PASS     |
+------------------+----------+
| Debian Buster    | PASS     |
+------------------+----------+


RHEL8
	Kernel: 4.18.0-240.10.1.el8_3.x86_64
	Compiler: gcc 8.3.1 20191121 (Red Hat 8.3.1-5)

RHEL 7
	Kernel: 4.18.0-240.10.1.el8_3.x86_64
	Compiler: gcc 4.8.5 20150623 (Red Hat 4.8.5-44)

Debian Bullseye
	Kernel: 5.4.0-122-generic
	Compiler: gcc 10.2.1-6

CentOS Stream 9
	Kernel: 4.18.0-240.10.1.el8_3.x86_64
	Compiler: gcc 11.3.1 20220421

Ubuntu 22.04
	Kernel: Container Host Kernel
	Compiler: clang 14.0.5-1.fc36

CentOS Stream 8
	Kernel: 4.18.0-240.10.1.el8_3.x86_64
	Compiler: gcc 8.4.1 20200928

openSUSE Leap 15
	Kernel: 4.18.0-240.10.1.el8_3.x86_64
	Compiler: gcc 7.5.0

Debian Buster
	Kernel: 5.4.0-122-generic
	Compiler: gcc 8.3.0-6

To view detailed results, visit:
https://lab.dpdk.org/results/dashboard/patchsets/26076/

UNH-IOL DPDK Community Lab

To manage your email subscriptions, visit: 
https://lab.dpdk.org/results/dashboard/preferences/subscriptions/

^ permalink raw reply	[flat|nested] 29+ messages in thread

* |SUCCESS| pw126339-126342 [PATCH] [4/4] app: add testgraph application
@ 2023-04-21 10:24 dpdklab
  0 siblings, 0 replies; 29+ messages in thread
From: dpdklab @ 2023-04-21 10:24 UTC (permalink / raw)
  To: Test Report; +Cc: Vamsi Attunuru, David Marchand, Thomas Monjalon

Test-Label: iol-abi-testing
Test-Status: SUCCESS
http://dpdk.org/patch/126342

_Testing PASS_

Submitter: Vamsi Attunuru <vattunuru@marvell.com>
Date: Friday, April 21 2023 06:02:45 
DPDK git baseline: Repo:dpdk
  Branch: master
  CommitID:5f34cc454df420b9b2da8deb949fb76cba058b87

126339-126342 --> testing pass

Test environment and result as below:

+------------------+----------+
|   Environment    | abi_test |
+==================+==========+
| RHEL8            | PASS     |
+------------------+----------+
| RHEL 7           | PASS     |
+------------------+----------+
| Debian Bullseye  | PASS     |
+------------------+----------+
| CentOS Stream 9  | PASS     |
+------------------+----------+
| Ubuntu 22.04     | PASS     |
+------------------+----------+
| CentOS Stream 8  | PASS     |
+------------------+----------+
| openSUSE Leap 15 | PASS     |
+------------------+----------+
| Debian Buster    | PASS     |
+------------------+----------+


RHEL8
	Kernel: 4.18.0-240.10.1.el8_3.x86_64
	Compiler: gcc 8.3.1 20191121 (Red Hat 8.3.1-5)

RHEL 7
	Kernel: 4.18.0-240.10.1.el8_3.x86_64
	Compiler: gcc 4.8.5 20150623 (Red Hat 4.8.5-44)

Debian Bullseye
	Kernel: 5.4.0-122-generic
	Compiler: gcc 10.2.1-6

CentOS Stream 9
	Kernel: 4.18.0-240.10.1.el8_3.x86_64
	Compiler: gcc 11.3.1 20220421

Ubuntu 22.04
	Kernel: Container Host Kernel
	Compiler: clang 14.0.5-1.fc36

CentOS Stream 8
	Kernel: 4.18.0-240.10.1.el8_3.x86_64
	Compiler: gcc 8.4.1 20200928

openSUSE Leap 15
	Kernel: 4.18.0-240.10.1.el8_3.x86_64
	Compiler: gcc 7.5.0

Debian Buster
	Kernel: 5.4.0-122-generic
	Compiler: gcc 8.3.0-6

To view detailed results, visit:
https://lab.dpdk.org/results/dashboard/patchsets/26076/

UNH-IOL DPDK Community Lab

To manage your email subscriptions, visit: 
https://lab.dpdk.org/results/dashboard/preferences/subscriptions/

^ permalink raw reply	[flat|nested] 29+ messages in thread

* |SUCCESS| pw126339-126342 [PATCH] [4/4] app: add testgraph application
@ 2023-04-21 10:22 dpdklab
  0 siblings, 0 replies; 29+ messages in thread
From: dpdklab @ 2023-04-21 10:22 UTC (permalink / raw)
  To: Test Report; +Cc: dpdklab, David Marchand, Thomas Monjalon

Test-Label: iol-abi-testing
Test-Status: SUCCESS
http://dpdk.org/patch/126342

_Testing PASS_

Submitter: Vamsi Attunuru <vattunuru@marvell.com>
Date: Friday, April 21 2023 06:02:45 
DPDK git baseline: Repo:dpdk
  Branch: master
  CommitID:5f34cc454df420b9b2da8deb949fb76cba058b87

126339-126342 --> testing pass

Test environment and result as below:

+------------------+----------+
|   Environment    | abi_test |
+==================+==========+
| RHEL8            | PASS     |
+------------------+----------+
| RHEL 7           | PASS     |
+------------------+----------+
| Debian Bullseye  | PASS     |
+------------------+----------+
| CentOS Stream 9  | PASS     |
+------------------+----------+
| Ubuntu 22.04     | PASS     |
+------------------+----------+
| CentOS Stream 8  | PASS     |
+------------------+----------+
| openSUSE Leap 15 | PASS     |
+------------------+----------+


RHEL8
	Kernel: 4.18.0-240.10.1.el8_3.x86_64
	Compiler: gcc 8.3.1 20191121 (Red Hat 8.3.1-5)

RHEL 7
	Kernel: 4.18.0-240.10.1.el8_3.x86_64
	Compiler: gcc 4.8.5 20150623 (Red Hat 4.8.5-44)

Debian Bullseye
	Kernel: 5.4.0-122-generic
	Compiler: gcc 10.2.1-6

CentOS Stream 9
	Kernel: 4.18.0-240.10.1.el8_3.x86_64
	Compiler: gcc 11.3.1 20220421

Ubuntu 22.04
	Kernel: Container Host Kernel
	Compiler: clang 14.0.5-1.fc36

CentOS Stream 8
	Kernel: 4.18.0-240.10.1.el8_3.x86_64
	Compiler: gcc 8.4.1 20200928

openSUSE Leap 15
	Kernel: 4.18.0-240.10.1.el8_3.x86_64
	Compiler: gcc 7.5.0

To view detailed results, visit:
https://lab.dpdk.org/results/dashboard/patchsets/26076/

UNH-IOL DPDK Community Lab

To manage your email subscriptions, visit: 
https://lab.dpdk.org/results/dashboard/preferences/subscriptions/

^ permalink raw reply	[flat|nested] 29+ messages in thread

* |SUCCESS| pw126339-126342 [PATCH] [4/4] app: add testgraph application
@ 2023-04-21 10:14 dpdklab
  0 siblings, 0 replies; 29+ messages in thread
From: dpdklab @ 2023-04-21 10:14 UTC (permalink / raw)
  To: Test Report; +Cc: dpdk-test-reports, David Marchand, Thomas Monjalon

Test-Label: iol-abi-testing
Test-Status: SUCCESS
http://dpdk.org/patch/126342

_Testing PASS_

Submitter: Vamsi Attunuru <vattunuru@marvell.com>
Date: Friday, April 21 2023 06:02:45 
DPDK git baseline: Repo:dpdk
  Branch: master
  CommitID:5f34cc454df420b9b2da8deb949fb76cba058b87

126339-126342 --> testing pass

Test environment and result as below:

+------------------+----------+
|   Environment    | abi_test |
+==================+==========+
| RHEL8            | PASS     |
+------------------+----------+
| RHEL 7           | PASS     |
+------------------+----------+
| Debian Bullseye  | PASS     |
+------------------+----------+
| CentOS Stream 9  | PASS     |
+------------------+----------+
| Ubuntu 22.04     | PASS     |
+------------------+----------+
| CentOS Stream 8  | PASS     |
+------------------+----------+
| openSUSE Leap 15 | PASS     |
+------------------+----------+


RHEL8
	Kernel: 4.18.0-240.10.1.el8_3.x86_64
	Compiler: gcc 8.3.1 20191121 (Red Hat 8.3.1-5)

RHEL 7
	Kernel: 4.18.0-240.10.1.el8_3.x86_64
	Compiler: gcc 4.8.5 20150623 (Red Hat 4.8.5-44)

Debian Bullseye
	Kernel: 5.4.0-122-generic
	Compiler: gcc 10.2.1-6

CentOS Stream 9
	Kernel: 4.18.0-240.10.1.el8_3.x86_64
	Compiler: gcc 11.3.1 20220421

Ubuntu 22.04
	Kernel: Container Host Kernel
	Compiler: clang 14.0.5-1.fc36

CentOS Stream 8
	Kernel: 4.18.0-240.10.1.el8_3.x86_64
	Compiler: gcc 8.4.1 20200928

openSUSE Leap 15
	Kernel: 4.18.0-240.10.1.el8_3.x86_64
	Compiler: gcc 7.5.0

To view detailed results, visit:
https://lab.dpdk.org/results/dashboard/patchsets/26076/

UNH-IOL DPDK Community Lab

To manage your email subscriptions, visit: 
https://lab.dpdk.org/results/dashboard/preferences/subscriptions/

^ permalink raw reply	[flat|nested] 29+ messages in thread

* |SUCCESS| pw126339-126342 [PATCH] [4/4] app: add testgraph application
@ 2023-04-21 10:11 dpdklab
  0 siblings, 0 replies; 29+ messages in thread
From: dpdklab @ 2023-04-21 10:11 UTC (permalink / raw)
  To: Test Report; +Cc: dpdklab, David Marchand, Thomas Monjalon

Test-Label: iol-abi-testing
Test-Status: SUCCESS
http://dpdk.org/patch/126342

_Testing PASS_

Submitter: Vamsi Attunuru <vattunuru@marvell.com>
Date: Friday, April 21 2023 06:02:45 
DPDK git baseline: Repo:dpdk
  Branch: master
  CommitID:5f34cc454df420b9b2da8deb949fb76cba058b87

126339-126342 --> testing pass

Test environment and result as below:

+-----------------+----------+
|   Environment   | abi_test |
+=================+==========+
| RHEL8           | PASS     |
+-----------------+----------+
| RHEL 7          | PASS     |
+-----------------+----------+
| Debian Bullseye | PASS     |
+-----------------+----------+
| CentOS Stream 9 | PASS     |
+-----------------+----------+
| Ubuntu 22.04    | PASS     |
+-----------------+----------+
| CentOS Stream 8 | PASS     |
+-----------------+----------+


RHEL8
	Kernel: 4.18.0-240.10.1.el8_3.x86_64
	Compiler: gcc 8.3.1 20191121 (Red Hat 8.3.1-5)

RHEL 7
	Kernel: 4.18.0-240.10.1.el8_3.x86_64
	Compiler: gcc 4.8.5 20150623 (Red Hat 4.8.5-44)

Debian Bullseye
	Kernel: 5.4.0-122-generic
	Compiler: gcc 10.2.1-6

CentOS Stream 9
	Kernel: 4.18.0-240.10.1.el8_3.x86_64
	Compiler: gcc 11.3.1 20220421

Ubuntu 22.04
	Kernel: Container Host Kernel
	Compiler: clang 14.0.5-1.fc36

CentOS Stream 8
	Kernel: 4.18.0-240.10.1.el8_3.x86_64
	Compiler: gcc 8.4.1 20200928

To view detailed results, visit:
https://lab.dpdk.org/results/dashboard/patchsets/26076/

UNH-IOL DPDK Community Lab

To manage your email subscriptions, visit: 
https://lab.dpdk.org/results/dashboard/preferences/subscriptions/

^ permalink raw reply	[flat|nested] 29+ messages in thread

* |SUCCESS| pw126339-126342 [PATCH] [4/4] app: add testgraph application
@ 2023-04-21 10:10 dpdklab
  0 siblings, 0 replies; 29+ messages in thread
From: dpdklab @ 2023-04-21 10:10 UTC (permalink / raw)
  To: Test Report; +Cc: dpdklab, David Marchand, Thomas Monjalon

Test-Label: iol-abi-testing
Test-Status: SUCCESS
http://dpdk.org/patch/126342

_Testing PASS_

Submitter: Vamsi Attunuru <vattunuru@marvell.com>
Date: Friday, April 21 2023 06:02:45 
DPDK git baseline: Repo:dpdk
  Branch: master
  CommitID:5f34cc454df420b9b2da8deb949fb76cba058b87

126339-126342 --> testing pass

Test environment and result as below:

+-----------------+----------+
|   Environment   | abi_test |
+=================+==========+
| RHEL8           | PASS     |
+-----------------+----------+
| RHEL 7          | PASS     |
+-----------------+----------+
| Debian Bullseye | PASS     |
+-----------------+----------+
| CentOS Stream 9 | PASS     |
+-----------------+----------+
| Ubuntu 22.04    | PASS     |
+-----------------+----------+
| CentOS Stream 8 | PASS     |
+-----------------+----------+


RHEL8
	Kernel: 4.18.0-240.10.1.el8_3.x86_64
	Compiler: gcc 8.3.1 20191121 (Red Hat 8.3.1-5)

RHEL 7
	Kernel: 4.18.0-240.10.1.el8_3.x86_64
	Compiler: gcc 4.8.5 20150623 (Red Hat 4.8.5-44)

Debian Bullseye
	Kernel: 5.4.0-122-generic
	Compiler: gcc 10.2.1-6

CentOS Stream 9
	Kernel: 4.18.0-240.10.1.el8_3.x86_64
	Compiler: gcc 11.3.1 20220421

Ubuntu 22.04
	Kernel: Container Host Kernel
	Compiler: clang 14.0.5-1.fc36

CentOS Stream 8
	Kernel: 4.18.0-240.10.1.el8_3.x86_64
	Compiler: gcc 8.4.1 20200928

To view detailed results, visit:
https://lab.dpdk.org/results/dashboard/patchsets/26076/

UNH-IOL DPDK Community Lab

To manage your email subscriptions, visit: 
https://lab.dpdk.org/results/dashboard/preferences/subscriptions/

^ permalink raw reply	[flat|nested] 29+ messages in thread

* |SUCCESS| pw126339-126342 [PATCH] [4/4] app: add testgraph application
@ 2023-04-21 10:09 dpdklab
  0 siblings, 0 replies; 29+ messages in thread
From: dpdklab @ 2023-04-21 10:09 UTC (permalink / raw)
  To: Test Report; +Cc: dpdklab, David Marchand, Thomas Monjalon

Test-Label: iol-abi-testing
Test-Status: SUCCESS
http://dpdk.org/patch/126342

_Testing PASS_

Submitter: Vamsi Attunuru <vattunuru@marvell.com>
Date: Friday, April 21 2023 06:02:45 
DPDK git baseline: Repo:dpdk
  Branch: master
  CommitID:5f34cc454df420b9b2da8deb949fb76cba058b87

126339-126342 --> testing pass

Test environment and result as below:

+-----------------+----------+
|   Environment   | abi_test |
+=================+==========+
| RHEL8           | PASS     |
+-----------------+----------+
| RHEL 7          | PASS     |
+-----------------+----------+
| Debian Bullseye | PASS     |
+-----------------+----------+
| CentOS Stream 9 | PASS     |
+-----------------+----------+
| Ubuntu 22.04    | PASS     |
+-----------------+----------+


RHEL8
	Kernel: 4.18.0-240.10.1.el8_3.x86_64
	Compiler: gcc 8.3.1 20191121 (Red Hat 8.3.1-5)

RHEL 7
	Kernel: 4.18.0-240.10.1.el8_3.x86_64
	Compiler: gcc 4.8.5 20150623 (Red Hat 4.8.5-44)

Debian Bullseye
	Kernel: 5.4.0-122-generic
	Compiler: gcc 10.2.1-6

CentOS Stream 9
	Kernel: 4.18.0-240.10.1.el8_3.x86_64
	Compiler: gcc 11.3.1 20220421

Ubuntu 22.04
	Kernel: Container Host Kernel
	Compiler: clang 14.0.5-1.fc36

To view detailed results, visit:
https://lab.dpdk.org/results/dashboard/patchsets/26076/

UNH-IOL DPDK Community Lab

To manage your email subscriptions, visit: 
https://lab.dpdk.org/results/dashboard/preferences/subscriptions/

^ permalink raw reply	[flat|nested] 29+ messages in thread

* |SUCCESS| pw126339-126342 [PATCH] [4/4] app: add testgraph application
@ 2023-04-21 10:07 dpdklab
  0 siblings, 0 replies; 29+ messages in thread
From: dpdklab @ 2023-04-21 10:07 UTC (permalink / raw)
  To: Test Report; +Cc: dpdklab, David Marchand, Thomas Monjalon

Test-Label: iol-abi-testing
Test-Status: SUCCESS
http://dpdk.org/patch/126342

_Testing PASS_

Submitter: Vamsi Attunuru <vattunuru@marvell.com>
Date: Friday, April 21 2023 06:02:45 
DPDK git baseline: Repo:dpdk
  Branch: master
  CommitID:5f34cc454df420b9b2da8deb949fb76cba058b87

126339-126342 --> testing pass

Test environment and result as below:

+-----------------+----------+
|   Environment   | abi_test |
+=================+==========+
| RHEL8           | PASS     |
+-----------------+----------+
| RHEL 7          | PASS     |
+-----------------+----------+
| Debian Bullseye | PASS     |
+-----------------+----------+
| CentOS Stream 9 | PASS     |
+-----------------+----------+


RHEL8
	Kernel: 4.18.0-240.10.1.el8_3.x86_64
	Compiler: gcc 8.3.1 20191121 (Red Hat 8.3.1-5)

RHEL 7
	Kernel: 4.18.0-240.10.1.el8_3.x86_64
	Compiler: gcc 4.8.5 20150623 (Red Hat 4.8.5-44)

Debian Bullseye
	Kernel: 5.4.0-122-generic
	Compiler: gcc 10.2.1-6

CentOS Stream 9
	Kernel: 4.18.0-240.10.1.el8_3.x86_64
	Compiler: gcc 11.3.1 20220421

To view detailed results, visit:
https://lab.dpdk.org/results/dashboard/patchsets/26076/

UNH-IOL DPDK Community Lab

To manage your email subscriptions, visit: 
https://lab.dpdk.org/results/dashboard/preferences/subscriptions/

^ permalink raw reply	[flat|nested] 29+ messages in thread

* |SUCCESS| pw126339-126342 [PATCH] [4/4] app: add testgraph application
@ 2023-04-21 10:06 dpdklab
  0 siblings, 0 replies; 29+ messages in thread
From: dpdklab @ 2023-04-21 10:06 UTC (permalink / raw)
  To: Test Report; +Cc: Vamsi Attunuru, David Marchand, Thomas Monjalon

Test-Label: iol-abi-testing
Test-Status: SUCCESS
http://dpdk.org/patch/126342

_Testing PASS_

Submitter: Vamsi Attunuru <vattunuru@marvell.com>
Date: Friday, April 21 2023 06:02:45 
DPDK git baseline: Repo:dpdk
  Branch: master
  CommitID:5f34cc454df420b9b2da8deb949fb76cba058b87

126339-126342 --> testing pass

Test environment and result as below:

+-----------------+----------+
|   Environment   | abi_test |
+=================+==========+
| RHEL8           | PASS     |
+-----------------+----------+
| RHEL 7          | PASS     |
+-----------------+----------+
| Debian Bullseye | PASS     |
+-----------------+----------+


RHEL8
	Kernel: 4.18.0-240.10.1.el8_3.x86_64
	Compiler: gcc 8.3.1 20191121 (Red Hat 8.3.1-5)

RHEL 7
	Kernel: 4.18.0-240.10.1.el8_3.x86_64
	Compiler: gcc 4.8.5 20150623 (Red Hat 4.8.5-44)

Debian Bullseye
	Kernel: 5.4.0-122-generic
	Compiler: gcc 10.2.1-6

To view detailed results, visit:
https://lab.dpdk.org/results/dashboard/patchsets/26076/

UNH-IOL DPDK Community Lab

To manage your email subscriptions, visit: 
https://lab.dpdk.org/results/dashboard/preferences/subscriptions/

^ permalink raw reply	[flat|nested] 29+ messages in thread

* |SUCCESS| pw126339-126342 [PATCH] [4/4] app: add testgraph application
@ 2023-04-21  9:49 dpdklab
  0 siblings, 0 replies; 29+ messages in thread
From: dpdklab @ 2023-04-21  9:49 UTC (permalink / raw)
  To: Test Report; +Cc: dpdklab, David Marchand, Thomas Monjalon

Test-Label: iol-abi-testing
Test-Status: SUCCESS
http://dpdk.org/patch/126342

_Testing PASS_

Submitter: Vamsi Attunuru <vattunuru@marvell.com>
Date: Friday, April 21 2023 06:02:45 
DPDK git baseline: Repo:dpdk
  Branch: master
  CommitID:5f34cc454df420b9b2da8deb949fb76cba058b87

126339-126342 --> testing pass

Test environment and result as below:

+-------------+----------+
| Environment | abi_test |
+=============+==========+
| RHEL8       | PASS     |
+-------------+----------+
| RHEL 7      | PASS     |
+-------------+----------+


RHEL8
	Kernel: 4.18.0-240.10.1.el8_3.x86_64
	Compiler: gcc 8.3.1 20191121 (Red Hat 8.3.1-5)

RHEL 7
	Kernel: 4.18.0-240.10.1.el8_3.x86_64
	Compiler: gcc 4.8.5 20150623 (Red Hat 4.8.5-44)

To view detailed results, visit:
https://lab.dpdk.org/results/dashboard/patchsets/26076/

UNH-IOL DPDK Community Lab

To manage your email subscriptions, visit: 
https://lab.dpdk.org/results/dashboard/preferences/subscriptions/

^ permalink raw reply	[flat|nested] 29+ messages in thread

* |SUCCESS| pw126339-126342 [PATCH] [4/4] app: add testgraph application
@ 2023-04-21  9:33 dpdklab
  0 siblings, 0 replies; 29+ messages in thread
From: dpdklab @ 2023-04-21  9:33 UTC (permalink / raw)
  To: Test Report; +Cc: dpdklab, David Marchand, Thomas Monjalon

Test-Label: iol-abi-testing
Test-Status: SUCCESS
http://dpdk.org/patch/126342

_Testing PASS_

Submitter: Vamsi Attunuru <vattunuru@marvell.com>
Date: Friday, April 21 2023 06:02:45 
DPDK git baseline: Repo:dpdk
  Branch: master
  CommitID:5f34cc454df420b9b2da8deb949fb76cba058b87

126339-126342 --> testing pass

Test environment and result as below:

+-------------+----------+
| Environment | abi_test |
+=============+==========+
| RHEL8       | PASS     |
+-------------+----------+


RHEL8
	Kernel: 4.18.0-240.10.1.el8_3.x86_64
	Compiler: gcc 8.3.1 20191121 (Red Hat 8.3.1-5)

To view detailed results, visit:
https://lab.dpdk.org/results/dashboard/patchsets/26076/

UNH-IOL DPDK Community Lab

To manage your email subscriptions, visit: 
https://lab.dpdk.org/results/dashboard/preferences/subscriptions/

^ permalink raw reply	[flat|nested] 29+ messages in thread

* |SUCCESS| pw126339-126342 [PATCH] [4/4] app: add testgraph application
@ 2023-04-21  8:55 dpdklab
  0 siblings, 0 replies; 29+ messages in thread
From: dpdklab @ 2023-04-21  8:55 UTC (permalink / raw)
  To: Test Report; +Cc: dpdklab, David Marchand, Thomas Monjalon

Test-Label: iol-aarch64-unit-testing
Test-Status: SUCCESS
http://dpdk.org/patch/126342

_Testing PASS_

Submitter: Vamsi Attunuru <vattunuru@marvell.com>
Date: Friday, April 21 2023 06:02:45 
DPDK git baseline: Repo:dpdk
  Branch: master
  CommitID:5f34cc454df420b9b2da8deb949fb76cba058b87

126339-126342 --> testing pass

Test environment and result as below:

+----------------------+---------------------------+------------------------------+--------------+
|     Environment      | cryptodev_sw_zuc_autotest | cryptodev_sw_snow3g_autotest | lpm_autotest |
+======================+===========================+==============================+==============+
| Debian 11            | PASS                      | PASS                         | SKIPPED      |
+----------------------+---------------------------+------------------------------+--------------+
| Ubuntu 20.04 ARM SVE | SKIPPED                   | SKIPPED                      | PASS         |
+----------------------+---------------------------+------------------------------+--------------+


Debian 11
	Kernel: Container Host Kernel
	Compiler: gcc 10.2.1

Ubuntu 20.04 ARM SVE
	Kernel: 5.4.0-80-generic
	Compiler: gcc 10.3.0 (Ubuntu 10.3.0-1ubuntu1~20.04)

To view detailed results, visit:
https://lab.dpdk.org/results/dashboard/patchsets/26076/

UNH-IOL DPDK Community Lab

To manage your email subscriptions, visit: 
https://lab.dpdk.org/results/dashboard/preferences/subscriptions/

^ permalink raw reply	[flat|nested] 29+ messages in thread

* |SUCCESS| pw126339-126342 [PATCH] [4/4] app: add testgraph application
@ 2023-04-21  7:35 dpdklab
  0 siblings, 0 replies; 29+ messages in thread
From: dpdklab @ 2023-04-21  7:35 UTC (permalink / raw)
  To: Test Report; +Cc: dpdk-test-reports, David Marchand, Thomas Monjalon

Test-Label: iol-intel-Functional
Test-Status: SUCCESS
http://dpdk.org/patch/126342

_Functional Testing PASS_

Submitter: Vamsi Attunuru <vattunuru@marvell.com>
Date: Friday, April 21 2023 06:02:45 
DPDK git baseline: Repo:dpdk
  Branch: master
  CommitID:5f34cc454df420b9b2da8deb949fb76cba058b87

126339-126342 --> functional testing pass

Test environment and result as below:

Ubuntu 20.04
Kernel: 4.15.0-generic
Compiler: gcc 7.4
NIC: Intel Corporation Ethernet Converged Network Adapter 82599ES 10000 Mbps
Target: x86_64-native-linuxapp-gcc
Fail/Total: 0/2


Arm Ampere Altra - Ubuntu 20.04.4
Kernel: 5.4.0-137-generic aarch64
Compiler: gcc 9.4
NIC: Intel Corporation Ethernet Converged Network Adapter XL710-QDA2 40000 Mbps
Target: x86_64-native-linuxapp-gcc
Fail/Total: 0/1


Ubuntu 20.04
Kernel: 4.15.0-generic
Compiler: gcc 7.4
NIC: Intel Corporation Ethernet Converged Network Adapter XL710-QDA2 40000 Mbps
Target: x86_64-native-linuxapp-gcc
Fail/Total: 0/2


Ubuntu 20.04 ARM
Kernel: 4.15.0-132-generic
Compiler: gcc 7.5
NIC: Arm Intel Corporation Ethernet Converged Network Adapter XL710-QDA2 40000 Mbps
Target: x86_64-native-linuxapp-gcc
Fail/Total: 0/2


To view detailed results, visit:
https://lab.dpdk.org/results/dashboard/patchsets/26076/

UNH-IOL DPDK Community Lab

To manage your email subscriptions, visit: 
https://lab.dpdk.org/results/dashboard/preferences/subscriptions/

^ permalink raw reply	[flat|nested] 29+ messages in thread

* |SUCCESS| pw126339-126342 [PATCH] [4/4] app: add testgraph application
@ 2023-04-21  7:30 dpdklab
  0 siblings, 0 replies; 29+ messages in thread
From: dpdklab @ 2023-04-21  7:30 UTC (permalink / raw)
  To: Test Report; +Cc: dpdk-test-reports, David Marchand, Thomas Monjalon

Test-Label: iol-broadcom-Functional
Test-Status: SUCCESS
http://dpdk.org/patch/126342

_Functional Testing PASS_

Submitter: Vamsi Attunuru <vattunuru@marvell.com>
Date: Friday, April 21 2023 06:02:45 
DPDK git baseline: Repo:dpdk
  Branch: master
  CommitID:5f34cc454df420b9b2da8deb949fb76cba058b87

126339-126342 --> functional testing pass

Test environment and result as below:

Ubuntu 22.04
Kernel: 5.15.0-58-generic x86_64
Compiler: gcc gcc (Ubuntu 11.2.0-19ubuntu1) 11.2.0
NIC: Broadcom Inc. and subsidiaries BCM957508-P2100G Dual-Port 100 Gb/s QSFP56 100 Mbps
Target: x86_64-native-linuxapp-gcc
Fail/Total: 0/2


Arm Ampere Altra - Ubuntu 20.04.4
Kernel: 5.4.0-137-generic aarch64
Compiler: gcc 9.4
NIC: Broadcom Inc. and subsidiaries BCM957508-P2100G Dual-Port 100 Gb/s QSFP56 100 Mbps
Target: x86_64-native-linuxapp-gcc
Fail/Total: 0/1


Ubuntu 20.04 ARM
Kernel: 5.11.0-46-generic
Compiler: gcc 9.4.0
NIC: Arm Broadcom Inc. brcm_57414 25000 Mbps
Target: x86_64-native-linuxapp-gcc
Fail/Total: 0/1


To view detailed results, visit:
https://lab.dpdk.org/results/dashboard/patchsets/26076/

UNH-IOL DPDK Community Lab

To manage your email subscriptions, visit: 
https://lab.dpdk.org/results/dashboard/preferences/subscriptions/

^ permalink raw reply	[flat|nested] 29+ messages in thread

* |SUCCESS| pw126339-126342 [PATCH] [4/4] app: add testgraph application
@ 2023-04-21  7:25 dpdklab
  0 siblings, 0 replies; 29+ messages in thread
From: dpdklab @ 2023-04-21  7:25 UTC (permalink / raw)
  To: Test Report; +Cc: dpdk-test-reports, David Marchand, Thomas Monjalon

Test-Label: iol-broadcom-Performance
Test-Status: SUCCESS
http://dpdk.org/patch/126342

_Performance Testing PASS_

Submitter: Vamsi Attunuru <vattunuru@marvell.com>
Date: Friday, April 21 2023 06:02:45 
DPDK git baseline: Repo:dpdk
  Branch: master
  CommitID:5f34cc454df420b9b2da8deb949fb76cba058b87

126339-126342 --> performance testing pass

Test environment and result as below:

Ubuntu 22.04
Kernel: 5.15.0-39-generic
Compiler: gcc gcc (Ubuntu 11.2.0-19ubuntu1) 11.2.0
NIC: Broadcom Inc. and subsidiaries BCM57414 NetXtreme-E 10Gb/25Gb RDMA Ethernet Controller 16d7 25 Mbps
Target: x86_64-native-linuxapp-gcc
Fail/Total: 0/3

Detail performance results: 
+------------+---------+----------+-------------+------------------------------+
| frame_size | txd/rxd | num_cpus | num_threads |  throughput difference from  |
|            |         |          |             |           expected           |
+============+=========+==========+=============+==============================+
| 64         | 128     | 1        | 1           | -0.1%                        |
+------------+---------+----------+-------------+------------------------------+
| 64         | 512     | 1        | 1           | 0.2%                         |
+------------+---------+----------+-------------+------------------------------+
| 64         | 2048    | 1        | 1           | 0.1%                         |
+------------+---------+----------+-------------+------------------------------+

To view detailed results, visit:
https://lab.dpdk.org/results/dashboard/patchsets/26076/

UNH-IOL DPDK Community Lab

To manage your email subscriptions, visit: 
https://lab.dpdk.org/results/dashboard/preferences/subscriptions/

^ permalink raw reply	[flat|nested] 29+ messages in thread

* |SUCCESS| pw126339-126342 [PATCH] [4/4] app: add testgraph application
@ 2023-04-21  7:25 dpdklab
  0 siblings, 0 replies; 29+ messages in thread
From: dpdklab @ 2023-04-21  7:25 UTC (permalink / raw)
  To: Test Report; +Cc: dpdk-test-reports, David Marchand, Thomas Monjalon

Test-Label: iol-intel-Functional
Test-Status: SUCCESS
http://dpdk.org/patch/126342

_Functional Testing PASS_

Submitter: Vamsi Attunuru <vattunuru@marvell.com>
Date: Friday, April 21 2023 06:02:45 
DPDK git baseline: Repo:dpdk
  Branch: master
  CommitID:5f34cc454df420b9b2da8deb949fb76cba058b87

126339-126342 --> functional testing pass

Test environment and result as below:

Ubuntu 20.04
Kernel: 4.15.0-generic
Compiler: gcc 7.4
NIC: Intel Corporation Ethernet Converged Network Adapter 82599ES 10000 Mbps
Target: x86_64-native-linuxapp-gcc
Fail/Total: 0/2


Arm Ampere Altra - Ubuntu 20.04.4
Kernel: 5.4.0-137-generic aarch64
Compiler: gcc 9.4
NIC: Intel Corporation Ethernet Converged Network Adapter XL710-QDA2 40000 Mbps
Target: x86_64-native-linuxapp-gcc
Fail/Total: 0/1


Ubuntu 20.04 ARM
Kernel: 4.15.0-132-generic
Compiler: gcc 7.5
NIC: Arm Intel Corporation Ethernet Converged Network Adapter XL710-QDA2 40000 Mbps
Target: x86_64-native-linuxapp-gcc
Fail/Total: 0/2


To view detailed results, visit:
https://lab.dpdk.org/results/dashboard/patchsets/26076/

UNH-IOL DPDK Community Lab

To manage your email subscriptions, visit: 
https://lab.dpdk.org/results/dashboard/preferences/subscriptions/

^ permalink raw reply	[flat|nested] 29+ messages in thread

* |SUCCESS| pw126339-126342 [PATCH] [4/4] app: add testgraph application
@ 2023-04-21  7:22 dpdklab
  0 siblings, 0 replies; 29+ messages in thread
From: dpdklab @ 2023-04-21  7:22 UTC (permalink / raw)
  To: Test Report; +Cc: dpdk-test-reports, David Marchand, Thomas Monjalon

Test-Label: iol-intel-Performance
Test-Status: SUCCESS
http://dpdk.org/patch/126342

_Performance Testing PASS_

Submitter: Vamsi Attunuru <vattunuru@marvell.com>
Date: Friday, April 21 2023 06:02:45 
DPDK git baseline: Repo:dpdk
  Branch: master
  CommitID:5f34cc454df420b9b2da8deb949fb76cba058b87

126339-126342 --> performance testing pass

Test environment and result as below:

Ubuntu 20.04 ARM
Kernel: 4.15.0-132-generic
Compiler: gcc 7.5
NIC: Arm Intel Corporation Ethernet Converged Network Adapter XL710-QDA2 40000 Mbps
Target: x86_64-native-linuxapp-gcc
Fail/Total: 0/2

Detail performance results: 
+------------+---------+----------+-------------+------------------------------+
| frame_size | txd/rxd | num_cpus | num_threads |  throughput difference from  |
|            |         |          |             |           expected           |
+============+=========+==========+=============+==============================+
| 64         | 512     | 1        | 1           | 4.6%                         |
+------------+---------+----------+-------------+------------------------------+
| 64         | 2048    | 1        | 1           | -0.4%                        |
+------------+---------+----------+-------------+------------------------------+

Arm Ampere Altra - Ubuntu 20.04.4
Kernel: 5.4.0-137-generic aarch64
Compiler: gcc 9.4
NIC: Intel Corporation Ethernet Converged Network Adapter XL710-QDA2 40000 Mbps
Target: x86_64-native-linuxapp-gcc
Fail/Total: 0/2

Detail performance results: 
+------------+---------+----------+-------------+------------------------------+
| frame_size | txd/rxd | num_cpus | num_threads |  throughput difference from  |
|            |         |          |             |           expected           |
+============+=========+==========+=============+==============================+
| 64         | 512     | 1        | 1           | -0.0%                        |
+------------+---------+----------+-------------+------------------------------+
| 64         | 2048    | 1        | 1           | 0.1%                         |
+------------+---------+----------+-------------+------------------------------+

Ubuntu 20.04
Kernel: 4.15.0-generic
Compiler: gcc 7.4
NIC: Intel Corporation Ethernet Converged Network Adapter XL710-QDA2 40000 Mbps
Target: x86_64-native-linuxapp-gcc
Fail/Total: 0/4

Detail performance results: 
+----------+-------------+---------+------------+------------------------------+
| num_cpus | num_threads | txd/rxd | frame_size |  throughput difference from  |
|          |             |         |            |           expected           |
+==========+=============+=========+============+==============================+
| 1        | 2           | 512     | 64         | -0.0%                        |
+----------+-------------+---------+------------+------------------------------+
| 1        | 2           | 2048    | 64         | 0.1%                         |
+----------+-------------+---------+------------+------------------------------+
| 1        | 1           | 512     | 64         | -4.8%                        |
+----------+-------------+---------+------------+------------------------------+
| 1        | 1           | 2048    | 64         | 0.8%                         |
+----------+-------------+---------+------------+------------------------------+

To view detailed results, visit:
https://lab.dpdk.org/results/dashboard/patchsets/26076/

UNH-IOL DPDK Community Lab

To manage your email subscriptions, visit: 
https://lab.dpdk.org/results/dashboard/preferences/subscriptions/

^ permalink raw reply	[flat|nested] 29+ messages in thread

* |SUCCESS| pw126339-126342 [PATCH] [4/4] app: add testgraph application
@ 2023-04-21  7:21 dpdklab
  0 siblings, 0 replies; 29+ messages in thread
From: dpdklab @ 2023-04-21  7:21 UTC (permalink / raw)
  To: Test Report; +Cc: dpdk-test-reports, David Marchand, Thomas Monjalon

Test-Label: iol-broadcom-Functional
Test-Status: SUCCESS
http://dpdk.org/patch/126342

_Functional Testing PASS_

Submitter: Vamsi Attunuru <vattunuru@marvell.com>
Date: Friday, April 21 2023 06:02:45 
DPDK git baseline: Repo:dpdk
  Branch: master
  CommitID:5f34cc454df420b9b2da8deb949fb76cba058b87

126339-126342 --> functional testing pass

Test environment and result as below:

Ubuntu 22.04
Kernel: 5.15.0-58-generic x86_64
Compiler: gcc gcc (Ubuntu 11.2.0-19ubuntu1) 11.2.0
NIC: Broadcom Inc. and subsidiaries BCM957508-P2100G Dual-Port 100 Gb/s QSFP56 100 Mbps
Target: x86_64-native-linuxapp-gcc
Fail/Total: 0/2


Ubuntu 20.04 ARM
Kernel: 5.11.0-46-generic
Compiler: gcc 9.4.0
NIC: Arm Broadcom Inc. brcm_57414 25000 Mbps
Target: x86_64-native-linuxapp-gcc
Fail/Total: 0/1


To view detailed results, visit:
https://lab.dpdk.org/results/dashboard/patchsets/26076/

UNH-IOL DPDK Community Lab

To manage your email subscriptions, visit: 
https://lab.dpdk.org/results/dashboard/preferences/subscriptions/

^ permalink raw reply	[flat|nested] 29+ messages in thread

* |SUCCESS| pw126339-126342 [PATCH] [4/4] app: add testgraph application
@ 2023-04-21  7:21 dpdklab
  0 siblings, 0 replies; 29+ messages in thread
From: dpdklab @ 2023-04-21  7:21 UTC (permalink / raw)
  To: Test Report; +Cc: dpdk-test-reports, David Marchand, Thomas Monjalon

Test-Label: iol-intel-Performance
Test-Status: SUCCESS
http://dpdk.org/patch/126342

_Performance Testing PASS_

Submitter: Vamsi Attunuru <vattunuru@marvell.com>
Date: Friday, April 21 2023 06:02:45 
DPDK git baseline: Repo:dpdk
  Branch: master
  CommitID:5f34cc454df420b9b2da8deb949fb76cba058b87

126339-126342 --> performance testing pass

Test environment and result as below:

Ubuntu 20.04 ARM
Kernel: 4.15.0-132-generic
Compiler: gcc 7.5
NIC: Arm Intel Corporation Ethernet Converged Network Adapter XL710-QDA2 40000 Mbps
Target: x86_64-native-linuxapp-gcc
Fail/Total: 0/2

Detail performance results: 
+------------+---------+----------+-------------+------------------------------+
| frame_size | txd/rxd | num_cpus | num_threads |  throughput difference from  |
|            |         |          |             |           expected           |
+============+=========+==========+=============+==============================+
| 64         | 512     | 1        | 1           | 4.6%                         |
+------------+---------+----------+-------------+------------------------------+
| 64         | 2048    | 1        | 1           | -0.4%                        |
+------------+---------+----------+-------------+------------------------------+

Arm Ampere Altra - Ubuntu 20.04.4
Kernel: 5.4.0-137-generic aarch64
Compiler: gcc 9.4
NIC: Intel Corporation Ethernet Converged Network Adapter XL710-QDA2 40000 Mbps
Target: x86_64-native-linuxapp-gcc
Fail/Total: 0/2

Detail performance results: 
+------------+---------+----------+-------------+------------------------------+
| frame_size | txd/rxd | num_cpus | num_threads |  throughput difference from  |
|            |         |          |             |           expected           |
+============+=========+==========+=============+==============================+
| 64         | 512     | 1        | 1           | -0.0%                        |
+------------+---------+----------+-------------+------------------------------+
| 64         | 2048    | 1        | 1           | 0.1%                         |
+------------+---------+----------+-------------+------------------------------+

To view detailed results, visit:
https://lab.dpdk.org/results/dashboard/patchsets/26076/

UNH-IOL DPDK Community Lab

To manage your email subscriptions, visit: 
https://lab.dpdk.org/results/dashboard/preferences/subscriptions/

^ permalink raw reply	[flat|nested] 29+ messages in thread

* |SUCCESS| pw126339-126342 [PATCH] [4/4] app: add testgraph application
@ 2023-04-21  7:19 dpdklab
  0 siblings, 0 replies; 29+ messages in thread
From: dpdklab @ 2023-04-21  7:19 UTC (permalink / raw)
  To: Test Report; +Cc: dpdk-test-reports, David Marchand, Thomas Monjalon

Test-Label: iol-intel-Functional
Test-Status: SUCCESS
http://dpdk.org/patch/126342

_Functional Testing PASS_

Submitter: Vamsi Attunuru <vattunuru@marvell.com>
Date: Friday, April 21 2023 06:02:45 
DPDK git baseline: Repo:dpdk
  Branch: master
  CommitID:5f34cc454df420b9b2da8deb949fb76cba058b87

126339-126342 --> functional testing pass

Test environment and result as below:

Ubuntu 20.04
Kernel: 4.15.0-generic
Compiler: gcc 7.4
NIC: Intel Corporation Ethernet Converged Network Adapter 82599ES 10000 Mbps
Target: x86_64-native-linuxapp-gcc
Fail/Total: 0/2


Ubuntu 20.04 ARM
Kernel: 4.15.0-132-generic
Compiler: gcc 7.5
NIC: Arm Intel Corporation Ethernet Converged Network Adapter XL710-QDA2 40000 Mbps
Target: x86_64-native-linuxapp-gcc
Fail/Total: 0/2


To view detailed results, visit:
https://lab.dpdk.org/results/dashboard/patchsets/26076/

UNH-IOL DPDK Community Lab

To manage your email subscriptions, visit: 
https://lab.dpdk.org/results/dashboard/preferences/subscriptions/

^ permalink raw reply	[flat|nested] 29+ messages in thread

* |SUCCESS| pw126339-126342 [PATCH] [4/4] app: add testgraph application
@ 2023-04-21  7:18 dpdklab
  0 siblings, 0 replies; 29+ messages in thread
From: dpdklab @ 2023-04-21  7:18 UTC (permalink / raw)
  To: Test Report; +Cc: dpdk-test-reports, David Marchand, Thomas Monjalon

Test-Label: iol-intel-Functional
Test-Status: SUCCESS
http://dpdk.org/patch/126342

_Functional Testing PASS_

Submitter: Vamsi Attunuru <vattunuru@marvell.com>
Date: Friday, April 21 2023 06:02:45 
DPDK git baseline: Repo:dpdk
  Branch: master
  CommitID:5f34cc454df420b9b2da8deb949fb76cba058b87

126339-126342 --> functional testing pass

Test environment and result as below:

Ubuntu 20.04
Kernel: 4.15.0-generic
Compiler: gcc 7.4
NIC: Intel Corporation Ethernet Converged Network Adapter 82599ES 10000 Mbps
Target: x86_64-native-linuxapp-gcc
Fail/Total: 0/2


To view detailed results, visit:
https://lab.dpdk.org/results/dashboard/patchsets/26076/

UNH-IOL DPDK Community Lab

To manage your email subscriptions, visit: 
https://lab.dpdk.org/results/dashboard/preferences/subscriptions/

^ permalink raw reply	[flat|nested] 29+ messages in thread

* |SUCCESS| pw126339-126342 [PATCH] [4/4] app: add testgraph application
@ 2023-04-21  7:14 dpdklab
  0 siblings, 0 replies; 29+ messages in thread
From: dpdklab @ 2023-04-21  7:14 UTC (permalink / raw)
  To: Test Report; +Cc: dpdk-test-reports, David Marchand, Thomas Monjalon

Test-Label: iol-intel-Performance
Test-Status: SUCCESS
http://dpdk.org/patch/126342

_Performance Testing PASS_

Submitter: Vamsi Attunuru <vattunuru@marvell.com>
Date: Friday, April 21 2023 06:02:45 
DPDK git baseline: Repo:dpdk
  Branch: master
  CommitID:5f34cc454df420b9b2da8deb949fb76cba058b87

126339-126342 --> performance testing pass

Test environment and result as below:

Ubuntu 20.04 ARM
Kernel: 4.15.0-132-generic
Compiler: gcc 7.5
NIC: Arm Intel Corporation Ethernet Converged Network Adapter XL710-QDA2 40000 Mbps
Target: x86_64-native-linuxapp-gcc
Fail/Total: 0/2

Detail performance results: 
+------------+---------+----------+-------------+------------------------------+
| frame_size | txd/rxd | num_cpus | num_threads |  throughput difference from  |
|            |         |          |             |           expected           |
+============+=========+==========+=============+==============================+
| 64         | 512     | 1        | 1           | 4.6%                         |
+------------+---------+----------+-------------+------------------------------+
| 64         | 2048    | 1        | 1           | -0.4%                        |
+------------+---------+----------+-------------+------------------------------+

To view detailed results, visit:
https://lab.dpdk.org/results/dashboard/patchsets/26076/

UNH-IOL DPDK Community Lab

To manage your email subscriptions, visit: 
https://lab.dpdk.org/results/dashboard/preferences/subscriptions/

^ permalink raw reply	[flat|nested] 29+ messages in thread

* |SUCCESS| pw126339-126342 [PATCH] [4/4] app: add testgraph application
@ 2023-04-21  7:14 dpdklab
  0 siblings, 0 replies; 29+ messages in thread
From: dpdklab @ 2023-04-21  7:14 UTC (permalink / raw)
  To: Test Report; +Cc: dpdk-test-reports, David Marchand, Thomas Monjalon

Test-Label: iol-broadcom-Functional
Test-Status: SUCCESS
http://dpdk.org/patch/126342

_Functional Testing PASS_

Submitter: Vamsi Attunuru <vattunuru@marvell.com>
Date: Friday, April 21 2023 06:02:45 
DPDK git baseline: Repo:dpdk
  Branch: master
  CommitID:5f34cc454df420b9b2da8deb949fb76cba058b87

126339-126342 --> functional testing pass

Test environment and result as below:

Ubuntu 22.04
Kernel: 5.15.0-58-generic x86_64
Compiler: gcc gcc (Ubuntu 11.2.0-19ubuntu1) 11.2.0
NIC: Broadcom Inc. and subsidiaries BCM957508-P2100G Dual-Port 100 Gb/s QSFP56 100 Mbps
Target: x86_64-native-linuxapp-gcc
Fail/Total: 0/2


To view detailed results, visit:
https://lab.dpdk.org/results/dashboard/patchsets/26076/

UNH-IOL DPDK Community Lab

To manage your email subscriptions, visit: 
https://lab.dpdk.org/results/dashboard/preferences/subscriptions/

^ permalink raw reply	[flat|nested] 29+ messages in thread

end of thread, other threads:[~2023-04-21 14:01 UTC | newest]

Thread overview: 29+ messages (download: mbox.gz / follow: Atom feed)
-- links below jump to the message on this page --
     [not found] <20230421060245.3136217-5-vattunuru@marvell.com>
2023-04-21  5:52 ` |SUCCESS| pw126339-126342 [PATCH 4/4] app: add testgraph application qemudev
2023-04-21  5:56 ` qemudev
2023-04-21  6:04 ` |SUCCESS| pw126342 " checkpatch
2023-04-21  6:59 ` |FAILURE| " 0-day Robot
2023-04-21  7:14 |SUCCESS| pw126339-126342 [PATCH] [4/4] " dpdklab
2023-04-21  7:14 dpdklab
2023-04-21  7:18 dpdklab
2023-04-21  7:19 dpdklab
2023-04-21  7:21 dpdklab
2023-04-21  7:21 dpdklab
2023-04-21  7:22 dpdklab
2023-04-21  7:25 dpdklab
2023-04-21  7:25 dpdklab
2023-04-21  7:30 dpdklab
2023-04-21  7:35 dpdklab
2023-04-21  8:55 dpdklab
2023-04-21  9:33 dpdklab
2023-04-21  9:49 dpdklab
2023-04-21 10:06 dpdklab
2023-04-21 10:07 dpdklab
2023-04-21 10:09 dpdklab
2023-04-21 10:10 dpdklab
2023-04-21 10:11 dpdklab
2023-04-21 10:14 dpdklab
2023-04-21 10:22 dpdklab
2023-04-21 10:24 dpdklab
2023-04-21 10:26 dpdklab
2023-04-21 14:00 dpdklab
2023-04-21 14:01 dpdklab

This is a public inbox, see mirroring instructions
for how to clone and mirror all data and code used for this inbox;
as well as URLs for NNTP newsgroup(s).