automatic DPDK test reports
 help / color / mirror / Atom feed
* |FAILURE| pw132425 [PATCH v3] power: support amd-pstate cpufreq driver
       [not found] <20231009132053.810639-1-sivaprasad.tummala@amd.com>
@ 2023-10-09 13:02 ` qemudev
  2023-10-09 13:22 ` |SUCCESS| " checkpatch
  1 sibling, 0 replies; 2+ messages in thread
From: qemudev @ 2023-10-09 13:02 UTC (permalink / raw)
  To: test-report; +Cc: Sivaprasad Tummala, zhoumin

Test-Label: loongarch-compilation
Test-Status: FAILURE
http://dpdk.org/patch/132425

_ninja build failure_

Submitter: Sivaprasad Tummala <Sivaprasad.Tummala@amd.com>
Date: Mon, 9 Oct 2023 06:20:53 -0700
DPDK git baseline: Repo:dpdk
  Branch: main
  CommitID: 4dd146e597d81d900140a904e0b3b9feb1b0be6c

132425 --> ninja build failed

Test environment and result as below:

+---------------------+----------------+
|     Environment     | compilation    |
+---------------------+----------------+
| Loongnix-Server 8.3 | FAIL           |
+---------------------+----------------+

Loongnix-Server 8.3
    Kernel: 4.19.190+
    Compiler: gcc 8.3


Ninja build logs:
-------------------------------BEGIN LOGS----------------------------
FAILED: lib/librte_power.so.24.0
cc -o lib/librte_power.so.24.0 lib/librte_power.a.p/power_guest_channel.c.o lib/librte_power.a.p/power_power_acpi_cpufreq.c.o lib/librte_power.a.p/power_power_common.c.o lib/librte_power.a.p/power_power_cppc_cpufreq.c.o lib/librte_power.a.p/power_power_kvm_vm.c.o lib/librte_power.a.p/power_power_pstate_cpufreq.c.o lib/librte_power.a.p/power_power_amd_pstate_cpufreq.c.o lib/librte_power.a.p/power_rte_power.c.o lib/librte_power.a.p/power_rte_power_intel_uncore.c.o lib/librte_power.a.p/power_rte_power_pmd_mgmt.c.o -Wl,--as-needed -Wl,--no-undefined -Wl,-O1 -shared -fPIC -Wl,--start-group -Wl,-soname,librte_power.so.24 -Wl,--no-as-needed -pthread -lm -ldl -lnuma -lfdt lib/librte_eal.so.24.0 lib/librte_kvargs.so.24.0 lib/librte_log.so.24.0 lib/librte_telemetry.so.24.0 lib/librte_timer.so.24.0 lib/librte_ethdev.so.24.0 lib/librte_net.so.24.0 lib/librte_mbuf.so.24.0 lib/librte_mempool.so.24.0 lib/librte_ring.so.24.0 lib/librte_meter.so.24.0 -Wl,--end-group -Wl,--version-script=/home/zhoumin
 /dpdk/lib/power/version.map '-Wl,-rpath,$ORIGIN/' -Wl,-rpath-link,/home/zhoumin/dpdk/build/lib
/usr/bin/ld: lib/librte_power.a.p/power_power_amd_pstate_cpufreq.c.o: in function `power_amd_pstate_cpufreq_exit':
power_amd_pstate_cpufreq.c:(.text+0x2f8): undefined reference to `rte_atomic_compare_exchange_strong_explicit'
/usr/bin/ld: power_amd_pstate_cpufreq.c:(.text+0x350): undefined reference to `rte_atomic_store_explicit'
/usr/bin/ld: power_amd_pstate_cpufreq.c:(.text+0x3bc): undefined reference to `rte_atomic_store_explicit'
/usr/bin/ld: lib/librte_power.a.p/power_power_amd_pstate_cpufreq.c.o: in function `power_amd_pstate_cpufreq_init':
power_amd_pstate_cpufreq.c:(.text+0xb94): undefined reference to `rte_atomic_compare_exchange_strong_explicit'
/usr/bin/ld: power_amd_pstate_cpufreq.c:(.text+0xee8): undefined reference to `rte_atomic_store_explicit'
/usr/bin/ld: power_amd_pstate_cpufreq.c:(.text+0xf54): undefined reference to `rte_atomic_store_explicit'
collect2: error: ld returned 1 exit status
[1320/2355] Compiling C object drivers/libtmp_rte_net_ixgbe.a.p/net_ixgbe_ixgbe_pf.c.o
[1321/2355] Linking target lib/librte_vhost.so.24.0
[1322/2355] Compiling C object drivers/net/ixgbe/base/libixgbe_base.a.p/ixgbe_phy.c.o
[1323/2355] Compiling C object drivers/libtmp_rte_net_ixgbe.a.p/net_ixgbe_ixgbe_fdir.c.o
[1324/2355] Compiling C object drivers/net/ice/base/libice_base.a.p/ice_flow.c.o
[1325/2355] Compiling C object drivers/libtmp_rte_net_ixgbe.a.p/net_ixgbe_rte_pmd_ixgbe.c.o
[1326/2355] Compiling C object drivers/libtmp_rte_net_netvsc.a.p/net_netvsc_hn_rndis.c.o
[1327/2355] Compiling C object drivers/libtmp_rte_net_igc.a.p/net_igc_igc_txrx.c.o
[1328/2355] Compiling C object drivers/net/ice/base/libice_base.a.p/ice_switch.c.o
[1329/2355] Compiling C object drivers/libtmp_rte_net_memif.a.p/net_memif_memif_socket.c.o
[1330/2355] Compiling C object drivers/libtmp_rte_net_netvsc.a.p/net_netvsc_hn_ethdev.c.o
[1331/2355] Compiling C object drivers/libtmp_rte_net_netvsc.a.p/net_netvsc_hn_vf.c.o
[1332/2355] Compiling C object drivers/libtmp_rte_net_ice.a.p/net_ice_ice_ethdev.c.o
[1333/2355] Compiling C object drivers/libtmp_rte_net_nfp.a.p/net_nfp_flower_nfp_flower.c.o
[1334/2355] Compiling C object drivers/libtmp_rte_net_nfp.a.p/net_nfp_flower_nfp_flower_cmsg.c.o
[1335/2355] Generating rte_net_ionic.pmd.c with a custom command
[1336/2355] Generating symbol file lib/librte_lpm.so.24.0.p/librte_lpm.so.24.0.symbols
[1337/2355] Compiling C object drivers/libtmp_rte_net_ice.a.p/net_ice_ice_rxtx.c.o
[1338/2355] Compiling C object drivers/net/ixgbe/base/libixgbe_base.a.p/ixgbe_x550.c.o
[1339/2355] Generating symbol file lib/librte_eventdev.so.24.0.p/librte_eventdev.so.24.0.symbols
[1340/2355] Generating symbol file lib/librte_ipsec.so.24.0.p/librte_ipsec.so.24.0.symbols
[1341/2355] Generating symbol file lib/librte_metrics.so.24.0.p/librte_metrics.so.24.0.symbols
[1342/2355] Generating symbol file lib/librte_gso.so.24.0.p/librte_gso.so.24.0.symbols
[1343/2355] Compiling C object drivers/net/ixgbe/base/libixgbe_base.a.p/ixgbe_common.c.o
[1344/2355] Generating symbol file lib/librte_bpf.so.24.0.p/librte_bpf.so.24.0.symbols
[1345/2355] Compiling C object drivers/libtmp_rte_net_ixgbe.a.p/net_ixgbe_ixgbe_flow.c.o
[1346/2355] Generating symbol file lib/librte_ip_frag.so.24.0.p/librte_ip_frag.so.24.0.symbols
[1347/2355] Generating symbol file lib/librte_pcapng.so.24.0.p/librte_pcapng.so.24.0.symbols
[1348/2355] Compiling C object drivers/libtmp_rte_net_netvsc.a.p/net_netvsc_hn_rxtx.c.o
[1349/2355] Compiling C object drivers/libtmp_rte_net_memif.a.p/net_memif_rte_eth_memif.c.o
[1350/2355] Compiling C object drivers/libtmp_rte_net_ixgbe.a.p/net_ixgbe_ixgbe_ethdev.c.o
[1351/2355] Compiling C object drivers/libtmp_rte_net_ixgbe.a.p/net_ixgbe_ixgbe_rxtx.c.o
[1352/2355] Generating rte_common_cnxk.sym_chk with a custom command (wrapped by meson to capture output)
ninja: build stopped: subcommand failed.
-------------------------------END LOGS------------------------------


^ permalink raw reply	[flat|nested] 2+ messages in thread

* |SUCCESS| pw132425 [PATCH v3] power: support amd-pstate cpufreq driver
       [not found] <20231009132053.810639-1-sivaprasad.tummala@amd.com>
  2023-10-09 13:02 ` |FAILURE| pw132425 [PATCH v3] power: support amd-pstate cpufreq driver qemudev
@ 2023-10-09 13:22 ` checkpatch
  1 sibling, 0 replies; 2+ messages in thread
From: checkpatch @ 2023-10-09 13:22 UTC (permalink / raw)
  To: test-report

Test-Label: checkpatch
Test-Status: SUCCESS
http://dpdk.org/patch/132425

_coding style OK_



^ permalink raw reply	[flat|nested] 2+ messages in thread

end of thread, other threads:[~2023-10-09 13:23 UTC | newest]

Thread overview: 2+ messages (download: mbox.gz / follow: Atom feed)
-- links below jump to the message on this page --
     [not found] <20231009132053.810639-1-sivaprasad.tummala@amd.com>
2023-10-09 13:02 ` |FAILURE| pw132425 [PATCH v3] power: support amd-pstate cpufreq driver qemudev
2023-10-09 13:22 ` |SUCCESS| " checkpatch

This is a public inbox, see mirroring instructions
for how to clone and mirror all data and code used for this inbox;
as well as URLs for NNTP newsgroup(s).