From: qemudev@loongson.cn
To: test-report@dpdk.org
Cc: Tomasz Duszynski <tduszynski@marvell.com>, zhoumin@loongson.cn
Subject: |FAILURE| pw152531 [PATCH v2] raw/cnxk_gpio: switch to character based GPIO interface
Date: Mon, 24 Mar 2025 15:55:01 +0800 [thread overview]
Message-ID: <202503240755.52O7t1Sv1381330@localhost.localdomain> (raw)
In-Reply-To: <20250324082848.1361839-1-tduszynski@marvell.com>
Test-Label: loongarch-compilation
Test-Status: FAILURE
http://dpdk.org/patch/152531
_ninja build failure_
Submitter: Tomasz Duszynski <tduszynski@marvell.com>
Date: Mon, 24 Mar 2025 09:28:48 +0100
DPDK git baseline: Repo:dpdk-next-net-mrvl
Branch: for-next-net
CommitID: 5f37ee9c859f3ce08ca4364f1d8c0e70ec33ac83
152531 --> ninja build failed
Test environment and result as below:
+---------------------+----------------+
| Environment | compilation |
+---------------------+----------------+
| Loongnix-Server 8.3 | FAIL |
+---------------------+----------------+
Loongnix-Server 8.3
Kernel: 4.19.190+
Compiler: gcc 8.3
Ninja build logs:
-------------------------------BEGIN LOGS----------------------------
FAILED: drivers/libtmp_rte_raw_cnxk_gpio.a.p/raw_cnxk_gpio_cnxk_gpio_selftest.c.o
cc -Idrivers/libtmp_rte_raw_cnxk_gpio.a.p -Idrivers -I../drivers -Idrivers/raw/cnxk_gpio -I../drivers/raw/cnxk_gpio -Ilib/rawdev -I../lib/rawdev -I. -I.. -Iconfig -I../config -Ilib/eal/include -I../lib/eal/include -Ilib/eal/linux/include -I../lib/eal/linux/include -Ilib/eal/loongarch/include -I../lib/eal/loongarch/include -I../kernel/linux -Ilib/eal/common -I../lib/eal/common -Ilib/eal -I../lib/eal -Ilib/kvargs -I../lib/kvargs -Ilib/log -I../lib/log -Ilib/metrics -I../lib/metrics -Ilib/telemetry -I../lib/telemetry -Idrivers/bus/vdev -I../drivers/bus/vdev -Idrivers/common/cnxk -I../drivers/common/cnxk -Idrivers/bus/pci -I../drivers/bus/pci -Ilib/net -I../lib/net -Ilib/ethdev -I../lib/ethdev -Ilib/meter -I../lib/meter -Ilib/pci -I../lib/pci -I../drivers/bus/pci/linux -Ilib/mbuf -I../lib/mbuf -Ilib/mempool -I../lib/mempool -Ilib/ring -I../lib/ring -Ilib/security -I../lib/security -Ilib/cryptodev -I../lib/cryptodev -Ilib/rcu -I../lib/rcu -fdiagnostics-color=always -pipe -D_FILE_OFFSET_BI
TS=64 -Wall -Winvalid-pch -Wextra -std=c11 -O3 -include rte_config.h -Wvla -Wcast-qual -Wdeprecated -Wformat -Wformat-nonliteral -Wformat-security -Wmissing-declarations -Wmissing-prototypes -Wnested-externs -Wold-style-definition -Wpointer-arith -Wsign-compare -Wstrict-prototypes -Wundef -Wwrite-strings -Wno-packed-not-aligned -Wno-missing-field-initializers -D_GNU_SOURCE -fPIC -march=loongarch64 -DALLOW_EXPERIMENTAL_API -DALLOW_INTERNAL_API -Wno-format-truncation -DRTE_LOG_DEFAULT_LOGTYPE=pmd.raw.cnxk_gpio -MD -MQ drivers/libtmp_rte_raw_cnxk_gpio.a.p/raw_cnxk_gpio_cnxk_gpio_selftest.c.o -MF drivers/libtmp_rte_raw_cnxk_gpio.a.p/raw_cnxk_gpio_cnxk_gpio_selftest.c.o.d -o drivers/libtmp_rte_raw_cnxk_gpio.a.p/raw_cnxk_gpio_cnxk_gpio_selftest.c.o -c ../drivers/raw/cnxk_gpio/cnxk_gpio_selftest.c
./drivers/raw/cnxk_gpio/cnxk_gpio_selftest.c: In function ‘cnxk_gpio_irq_handler’:
./drivers/raw/cnxk_gpio/cnxk_gpio_selftest.c:70:16: error: ‘struct gpio_v2_line_event’ has no member named ‘offset’
if ((int)event->offset != gpio)
^~
In file included from ../lib/eal/include/rte_debug.h:17,
from ../lib/eal/include/generic/rte_cycles.h:16,
from ../lib/eal/loongarch/include/rte_cycles.h:8,
from ../drivers/raw/cnxk_gpio/cnxk_gpio_selftest.c:11:
./drivers/raw/cnxk_gpio/cnxk_gpio_selftest.c:71:66: error: ‘struct gpio_v2_line_event’ has no member named ‘offset’
CNXK_GPIO_LOG(ERR, "event from gpio%d instead of gpio%d", event->offset, gpio);
^~
./lib/log/rte_log.h:334:32: note: in definition of macro ‘RTE_LOG’
RTE_LOGTYPE_ ## t, # t ": " __VA_ARGS__)
^~~~~~~~~~~
./lib/log/rte_log.h:388:16: note: in expansion of macro ‘RTE_FMT’
RTE_LOG(l, t, RTE_FMT(RTE_FMT_HEAD(__VA_ARGS__ ,) "n", ^~~~~~~
./lib/log/rte_log.h:389:3: note: in expansion of macro ‘RTE_FMT_TAIL’
RTE_FMT_TAIL(__VA_ARGS__ ,))); ^~~~~~~~~~~~
./drivers/raw/cnxk_gpio/cnxk_gpio.h:12:2: note: in expansion of macro ‘RTE_LOG_LINE’
RTE_LOG_LINE(level, CNXK_GPIO, __VA_ARGS__)
^~~~~~~~~~~~
./drivers/raw/cnxk_gpio/cnxk_gpio_selftest.c:71:3: note: in expansion of macro ‘CNXK_GPIO_LOG’
CNXK_GPIO_LOG(ERR, "event from gpio%d instead of gpio%d", event->offset, gpio);
^~~~~~~~~~~~~
[1794/2683] Compiling C object drivers/libtmp_rte_net_ngbe.a.p/net_ngbe_ngbe_rxtx.c.o
[1795/2683] Generating rte_net_idpf.sym_chk with a custom command (wrapped by meson to capture output)
[1796/2683] Compiling C object drivers/libtmp_rte_raw_cnxk_gpio.a.p/raw_cnxk_gpio_cnxk_gpio.c.o
[1797/2683] Compiling C object drivers/net/txgbe/base/libtxgbe_base.a.p/txgbe_phy.c.o
[1798/2683] Compiling C object drivers/libtmp_rte_net_virtio.a.p/net_virtio_virtqueue.c.o
[1799/2683] Compiling C object drivers/libtmp_rte_raw_cnxk_bphy.a.p/raw_cnxk_bphy_cnxk_bphy_cgx.c.o
[1800/2683] Compiling C object drivers/libtmp_rte_raw_cnxk_bphy.a.p/raw_cnxk_bphy_cnxk_bphy_cgx_test.c.o
[1801/2683] Compiling C object drivers/libtmp_rte_raw_cnxk_bphy.a.p/raw_cnxk_bphy_cnxk_bphy.c.o
[1802/2683] Compiling C object drivers/libtmp_rte_raw_cnxk_bphy.a.p/raw_cnxk_bphy_cnxk_bphy_irq.c.o
[1803/2683] Compiling C object drivers/libtmp_rte_net_xsc.a.p/net_xsc_xsc_np.c.o
[1804/2683] Compiling C object drivers/libtmp_rte_net_xsc.a.p/net_xsc_xsc_ethdev.c.o
[1805/2683] Compiling C object drivers/libtmp_rte_net_xsc.a.p/net_xsc_xsc_vfio.c.o
[1806/2683] Compiling C object drivers/libtmp_rte_net_xsc.a.p/net_xsc_xsc_vfio_mbox.c.o
[1807/2683] Compiling C object drivers/libtmp_rte_net_txgbe.a.p/net_txgbe_txgbe_flow.c.o
[1808/2683] Compiling C object drivers/libtmp_rte_raw_cnxk_rvu_lf.a.p/raw_cnxk_rvu_lf_cnxk_rvu_lf.c.o
[1809/2683] Compiling C object drivers/libtmp_rte_net_virtio.a.p/net_virtio_virtio_user_virtio_user_dev.c.o
[1810/2683] Compiling C object drivers/libtmp_rte_net_xsc.a.p/net_xsc_xsc_tx.c.o
[1811/2683] Compiling C object drivers/net/txgbe/base/libtxgbe_base.a.p/txgbe_hw.c.o
[1812/2683] Generating rte_net_ring.sym_chk with a custom command (wrapped by meson to capture output)
[1813/2683] Compiling C object drivers/libtmp_rte_net_xsc.a.p/net_xsc_xsc_rx.c.o
[1814/2683] Compiling C object drivers/libtmp_rte_net_thunderx.a.p/net_thunderx_nicvf_ethdev.c.o
[1815/2683] Generating rte_net_tap.pmd.c with a custom command
[1816/2683] Compiling C object drivers/libtmp_rte_net_vhost.a.p/net_vhost_rte_eth_vhost.c.o
[1817/2683] Compiling C object drivers/libtmp_rte_net_virtio.a.p/net_virtio_virtio_ethdev.c.o
[1818/2683] Compiling C object drivers/libtmp_rte_net_vmxnet3.a.p/net_vmxnet3_vmxnet3_ethdev.c.o
[1819/2683] Compiling C object drivers/libtmp_rte_net_qede.a.p/net_qede_qede_debug.c.o
[1820/2683] Generating rte_net_softnic.sym_chk with a custom command (wrapped by meson to capture output)
[1821/2683] Generating rte_net_ixgbe.sym_chk with a custom command (wrapped by meson to capture output)
[1822/2683] Compiling C object drivers/libtmp_rte_net_txgbe.a.p/net_txgbe_txgbe_ethdev.c.o
[1823/2683] Compiling C object drivers/libtmp_rte_net_vmxnet3.a.p/net_vmxnet3_vmxnet3_rxtx.c.o
[1824/2683] Compiling C object drivers/libtmp_rte_net_virtio.a.p/net_virtio_virtio_rxtx.c.o
[1825/2683] Compiling C object drivers/libtmp_rte_net_txgbe.a.p/net_txgbe_txgbe_rxtx.c.o
[1826/2683] Generating rte_common_cnxk.sym_chk with a custom command (wrapped by meson to capture output)
ninja: build stopped: subcommand failed.
-------------------------------END LOGS------------------------------
next parent reply other threads:[~2025-03-24 8:31 UTC|newest]
Thread overview: 43+ messages / expand[flat|nested] mbox.gz Atom feed top
[not found] <20250324082848.1361839-1-tduszynski@marvell.com>
2025-03-24 7:55 ` qemudev [this message]
2025-03-24 8:29 ` |WARNING| " checkpatch
2025-03-24 9:43 ` |SUCCESS| " 0-day Robot
2025-03-24 12:01 ` |SUCCESS| pw152531 [PATCH] [v2] raw/cnxk_gpio: switch to character b dpdklab
2025-03-24 12:05 ` dpdklab
2025-03-24 12:26 ` dpdklab
2025-03-24 12:33 ` dpdklab
2025-03-24 12:39 ` dpdklab
2025-03-24 12:55 ` |PENDING| " dpdklab
2025-03-24 12:58 ` |SUCCESS| " dpdklab
2025-03-24 13:05 ` dpdklab
2025-03-24 13:08 ` dpdklab
2025-03-24 13:12 ` |PENDING| " dpdklab
2025-03-24 13:17 ` |SUCCESS| " dpdklab
2025-03-24 13:23 ` |FAILURE| " dpdklab
2025-03-24 13:24 ` dpdklab
2025-03-24 13:26 ` dpdklab
2025-03-24 13:27 ` dpdklab
2025-03-24 13:32 ` dpdklab
2025-03-24 13:35 ` |PENDING| " dpdklab
2025-03-24 13:38 ` |WARNING| " dpdklab
2025-03-24 13:38 ` dpdklab
2025-03-24 13:38 ` dpdklab
2025-03-24 13:44 ` dpdklab
2025-03-24 13:45 ` dpdklab
2025-03-24 13:56 ` dpdklab
2025-03-24 14:00 ` dpdklab
2025-03-24 14:30 ` dpdklab
2025-03-24 14:31 ` dpdklab
2025-03-24 14:44 ` |PENDING| " dpdklab
2025-03-24 15:05 ` |FAILURE| " dpdklab
2025-03-24 15:09 ` dpdklab
2025-03-24 15:10 ` dpdklab
2025-03-24 15:10 ` dpdklab
2025-03-24 15:10 ` dpdklab
2025-03-24 15:14 ` |WARNING| " dpdklab
2025-03-24 15:26 ` |FAILURE| " dpdklab
2025-03-24 15:50 ` dpdklab
2025-03-24 16:35 ` dpdklab
2025-03-24 16:35 ` dpdklab
2025-03-24 16:39 ` dpdklab
2025-03-24 17:23 ` dpdklab
2025-03-24 17:34 ` dpdklab
Reply instructions:
You may reply publicly to this message via plain-text email
using any one of the following methods:
* Save the following mbox file, import it into your mail client,
and reply-to-all from there: mbox
Avoid top-posting and favor interleaved quoting:
https://en.wikipedia.org/wiki/Posting_style#Interleaved_style
* Reply using the --to, --cc, and --in-reply-to
switches of git-send-email(1):
git send-email \
--in-reply-to=202503240755.52O7t1Sv1381330@localhost.localdomain \
--to=qemudev@loongson.cn \
--cc=tduszynski@marvell.com \
--cc=test-report@dpdk.org \
--cc=zhoumin@loongson.cn \
/path/to/YOUR_REPLY
https://kernel.org/pub/software/scm/git/docs/git-send-email.html
* If your mail client supports setting the In-Reply-To header
via mailto: links, try the mailto: link
Be sure your reply has a Subject: header at the top and a blank line
before the message body.
This is a public inbox, see mirroring instructions
for how to clone and mirror all data and code used for this inbox;
as well as URLs for NNTP newsgroup(s).