automatic DPDK test reports
 help / color / mirror / Atom feed
From: qemudev@loongson.cn
To: test-report@dpdk.org
Cc: <pbhagavatula@marvell.com>, zhoumin@loongson.cn
Subject: |FAILURE| pw152564-152565 [RFC 2/2] eventdev: add default software vector adapter
Date: Wed, 26 Mar 2025 20:40:42 +0800	[thread overview]
Message-ID: <202503261240.52QCegg52578787@localhost.localdomain> (raw)
In-Reply-To: <20250326131441.5965-3-pbhagavatula@marvell.com>

Test-Label: loongarch-compilation
Test-Status: FAILURE
http://dpdk.org/patch/152565

_ninja build failure_

Submitter: Pavan Nikhilesh Bhagavatula <pbhagavatula@marvell.com>
Date: Wed, 26 Mar 2025 18:44:35 +0530
DPDK git baseline: Repo:dpdk-next-eventdev
  Branch: for-main
  CommitID: fa3aca8a525decfd12bd5fa01ebc98789d5f7278

152564-152565 --> ninja build failed

Test environment and result as below:

+---------------------+----------------+
|     Environment     | compilation    |
+---------------------+----------------+
| Loongnix-Server 8.3 | FAIL           |
+---------------------+----------------+

Loongnix-Server 8.3
    Kernel: 4.19.190+
    Compiler: gcc 8.3


Ninja build logs:
-------------------------------BEGIN LOGS----------------------------
FAILED: lib/eventdev.sym_chk
/usr/local/bin/meson --internal exe --capture lib/eventdev.sym_chk -- /home/zhoumin/gh_dpdk/buildtools/check-symbols.sh /home/zhoumin/gh_dpdk/lib/eventdev/version.map lib/librte_eventdev.a
--- stderr ---
rte_event_vector_adapter_create is not flagged as experimental
but is listed in version map
Please add __rte_experimental to the definition of rte_event_vector_adapter_create
rte_event_vector_adapter_create_ext is not flagged as experimental
but is listed in version map
Please add __rte_experimental to the definition of rte_event_vector_adapter_create_ext
rte_event_vector_adapter_lookup is not flagged as experimental
but is listed in version map
Please add __rte_experimental to the definition of rte_event_vector_adapter_lookup
rte_event_vector_adapter_destroy is not flagged as experimental
but is listed in version map
Please add __rte_experimental to the definition of rte_event_vector_adapter_destroy
rte_event_vector_adapter_info_get is not flagged as experimental
but is listed in version map
Please add __rte_experimental to the definition of rte_event_vector_adapter_info_get
rte_event_vector_adapter_conf_get is not flagged as experimental
but is listed in version map
Please add __rte_experimental to the definition of rte_event_vector_adapter_conf_get
rte_event_vector_adapter_remaining is not flagged as experimental
but is listed in version map
Please add __rte_experimental to the definition of rte_event_vector_adapter_remaining
rte_event_vector_adapter_stats_get is not flagged as experimental
but is listed in version map
Please add __rte_experimental to the definition of rte_event_vector_adapter_stats_get
rte_event_vector_adapter_stats_reset is not flagged as experimental
but is listed in version map
Please add __rte_experimental to the definition of rte_event_vector_adapter_stats_reset

[735/2688] Generating rte_mempool_octeontx.pmd.c with a custom command
[736/2688] Compiling C object drivers/libtmp_rte_net_ark.a.p/net_ark_ark_udm.c.o
[737/2688] Generating rte_mempool_dpaa.pmd.c with a custom command
[738/2688] Generating rte_mempool_cnxk.pmd.c with a custom command
[739/2688] Generating rte_common_nitrox.sym_chk with a custom command (wrapped by meson to capture output)
[740/2688] Compiling C object drivers/libtmp_rte_dma_odm.a.p/dma_odm_odm_dmadev.c.o
[741/2688] Compiling C object drivers/libtmp_rte_net_ark.a.p/net_ark_ark_pktdir.c.o
[742/2688] Generating rte_mempool_dpaa2.pmd.c with a custom command
[743/2688] Generating rte_common_zsda.pmd.c with a custom command
[744/2688] Generating rte_common_nfp.sym_chk with a custom command (wrapped by meson to capture output)
[745/2688] Compiling C object drivers/libtmp_rte_net_ark.a.p/net_ark_ark_ethdev_tx.c.o
[746/2688] Compiling C object drivers/libtmp_rte_net_ark.a.p/net_ark_ark_pktchkr.c.o
[747/2688] Compiling C object drivers/raw/ifpga/base/libifpga_rawdev_base.a.p/ifpga_fme.c.o
[748/2688] Compiling C object drivers/libtmp_rte_net_ark.a.p/net_ark_ark_ethdev.c.o
[749/2688] Compiling C object drivers/libtmp_rte_net_ark.a.p/net_ark_ark_pktgen.c.o
[750/2688] Compiling C object drivers/libtmp_rte_net_atlantic.a.p/net_atlantic_hw_atl_hw_atl_utils_fw2x.c.o
[751/2688] Compiling C object drivers/libtmp_rte_net_af_packet.a.p/net_af_packet_rte_eth_af_packet.c.o
[752/2688] Compiling C object drivers/libtmp_rte_net_ark.a.p/net_ark_ark_ethdev_rx.c.o
[753/2688] Compiling C object drivers/libtmp_rte_dma_cnxk.a.p/dma_cnxk_cnxk_dmadev_fp.c.o
[754/2688] Compiling C object drivers/libtmp_rte_dma_dpaa2.a.p/dma_dpaa2_dpaa2_qdma.c.o
[755/2688] Compiling C object drivers/libtmp_rte_common_qat.a.p/crypto_qat_dev_qat_sym_pmd_gen1.c.o
[756/2688] Compiling C object drivers/libtmp_rte_mempool_bucket.a.p/mempool_bucket_rte_mempool_bucket.c.o
[757/2688] Compiling C object drivers/libtmp_rte_net_atlantic.a.p/net_atlantic_atl_ethdev.c.o
[758/2688] Compiling C object drivers/libtmp_rte_net_atlantic.a.p/net_atlantic_atl_rxtx.c.o
[759/2688] Compiling C object drivers/libtmp_rte_dma_skeleton.a.p/dma_skeleton_skeleton_dmadev.c.o
[760/2688] Compiling C object drivers/libtmp_rte_dma_dpaa.a.p/dma_dpaa_dpaa_qdma.c.o
[761/2688] Generating rte_common_cnxk.pmd.c with a custom command
[762/2688] Generating rte_bus_dpaa.sym_chk with a custom command (wrapped by meson to capture output)
[763/2688] Generating rte_bus_fslmc.sym_chk with a custom command (wrapped by meson to capture output)
[764/2688] Generating eal.sym_chk with a custom command (wrapped by meson to capture output)
[765/2688] Generating ethdev.sym_chk with a custom command (wrapped by meson to capture output)
[766/2688] Compiling C object lib/librte_pipeline.a.p/pipeline_rte_swx_pipeline.c.o
[767/2688] Compiling C object lib/librte_vhost.a.p/vhost_virtio_net.c.o
ninja: build stopped: subcommand failed.
-------------------------------END LOGS------------------------------


       reply	other threads:[~2025-03-26 13:16 UTC|newest]

Thread overview: 4+ messages / expand[flat|nested]  mbox.gz  Atom feed  top
     [not found] <20250326131441.5965-3-pbhagavatula@marvell.com>
2025-03-26 12:40 ` qemudev [this message]
2025-03-26 13:16 ` |SUCCESS| pw152565 " checkpatch
2025-03-26 13:34 ` |FAILURE| pw152564-152565 [PATCH] [RFC, " dpdklab
2025-03-26 13:42 ` |FAILURE| pw152565 [RFC " 0-day Robot

Reply instructions:

You may reply publicly to this message via plain-text email
using any one of the following methods:

* Save the following mbox file, import it into your mail client,
  and reply-to-all from there: mbox

  Avoid top-posting and favor interleaved quoting:
  https://en.wikipedia.org/wiki/Posting_style#Interleaved_style

* Reply using the --to, --cc, and --in-reply-to
  switches of git-send-email(1):

  git send-email \
    --in-reply-to=202503261240.52QCegg52578787@localhost.localdomain \
    --to=qemudev@loongson.cn \
    --cc=pbhagavatula@marvell.com \
    --cc=test-report@dpdk.org \
    --cc=zhoumin@loongson.cn \
    /path/to/YOUR_REPLY

  https://kernel.org/pub/software/scm/git/docs/git-send-email.html

* If your mail client supports setting the In-Reply-To header
  via mailto: links, try the mailto: link
Be sure your reply has a Subject: header at the top and a blank line before the message body.
This is a public inbox, see mirroring instructions
for how to clone and mirror all data and code used for this inbox;
as well as URLs for NNTP newsgroup(s).