* |SUCCESS| pw152699-152700 [PATCH 2/2] node: use node mbuf dynfield in ip4 nodes
[not found] <20250401042053.3518757-3-nsaxena@marvell.com>
@ 2025-04-01 3:51 ` qemudev
2025-04-01 3:55 ` qemudev
` (3 subsequent siblings)
4 siblings, 0 replies; 5+ messages in thread
From: qemudev @ 2025-04-01 3:51 UTC (permalink / raw)
To: test-report
Test-Label: loongarch-compilation
Test-Status: SUCCESS
http://dpdk.org/patch/152700
_Compilation OK_
Submitter: Nitin Saxena <nsaxena@marvell.com>
Date: Tue, 1 Apr 2025 09:50:46 +0530
DPDK git baseline: Repo:dpdk
Branch: main
CommitID: edd3f4b1265e6da707c46ca9b6c39d332647baea
152699-152700 --> meson & ninja build successfully
Test environment and result as below:
+---------------------+----------------+
| Environment | compilation |
+---------------------+----------------+
| Loongnix-Server 8.3 | PASS |
+---------------------+----------------+
Loongnix-Server 8.3
Kernel: 4.19.190+
Compiler: gcc 8.3
^ permalink raw reply [flat|nested] 5+ messages in thread
* |SUCCESS| pw152699-152700 [PATCH 2/2] node: use node mbuf dynfield in ip4 nodes
[not found] <20250401042053.3518757-3-nsaxena@marvell.com>
2025-04-01 3:51 ` |SUCCESS| pw152699-152700 [PATCH 2/2] node: use node mbuf dynfield in ip4 nodes qemudev
@ 2025-04-01 3:55 ` qemudev
2025-04-01 4:22 ` |SUCCESS| pw152700 " checkpatch
` (2 subsequent siblings)
4 siblings, 0 replies; 5+ messages in thread
From: qemudev @ 2025-04-01 3:55 UTC (permalink / raw)
To: test-report
Test-Label: loongarch-unit-testing
Test-Status: SUCCESS
http://dpdk.org/patch/152700
_Unit Testing PASS_
Submitter: Nitin Saxena <nsaxena@marvell.com>
Date: Tue, 1 Apr 2025 09:50:46 +0530
DPDK git baseline: Repo:dpdk
Branch: main
CommitID: edd3f4b1265e6da707c46ca9b6c39d332647baea
152699-152700 --> testing pass
Test environment and result as below:
+---------------------+----------------+
| Environment | dpdk_unit_test |
+---------------------+----------------+
| Loongnix-Server 8.3 | PASS |
+---------------------+----------------+
Loongnix-Server 8.3
Kernel: 4.19.190+
Compiler: gcc 8.3
Test result details:
1/119 DPDK:fast-tests / acl_autotest OK 3.16s
2/119 DPDK:fast-tests / alarm_autotest OK 1.34s
3/119 DPDK:fast-tests / argparse_autotest OK 0.34s
4/119 DPDK:fast-tests / atomic_autotest OK 6.92s
5/119 DPDK:fast-tests / bitcount_autotest OK 0.20s
6/119 DPDK:fast-tests / bitmap_autotest OK 0.19s
7/119 DPDK:fast-tests / bitops_autotest OK 1.70s
8/119 DPDK:fast-tests / bitratestats_autotest OK 0.20s
9/119 DPDK:fast-tests / bitset_autotest OK 2.93s
10/119 DPDK:fast-tests / bpf_autotest OK 0.20s
11/119 DPDK:fast-tests / bpf_convert_autotest OK 0.20s
12/119 DPDK:fast-tests / byteorder_autotest OK 0.19s
13/119 DPDK:fast-tests / cfgfile_autotest OK 0.20s
14/119 DPDK:fast-tests / cksum_autotest OK 0.19s
15/119 DPDK:fast-tests / cmdline_autotest OK 0.19s
16/119 DPDK:fast-tests / common_autotest OK 1.08s
17/119 DPDK:fast-tests / compressdev_autotest SKIP 0.06s exit status 77
18/119 DPDK:fast-tests / cpuflags_autotest OK 0.20s
19/119 DPDK:fast-tests / crc_autotest OK 0.19s
20/119 DPDK:fast-tests / user_delay_us OK 0.20s
21/119 DPDK:fast-tests / debug_autotest OK 24.61s
22/119 DPDK:fast-tests / devargs_autotest OK 0.20s
23/119 DPDK:fast-tests / dispatcher_autotest OK 2.56s
24/119 DPDK:fast-tests / distributor_autotest OK 1.20s
25/119 DPDK:fast-tests / eal_flags_c_opt_autotest OK 0.79s
26/119 DPDK:fast-tests / eal_flags_main_opt_autotest OK 0.22s
27/119 DPDK:fast-tests / eal_flags_n_opt_autotest OK 0.20s
28/119 DPDK:fast-tests / eal_flags_hpet_autotest OK 0.13s
29/119 DPDK:fast-tests / eal_flags_no_huge_autotest OK 0.22s
30/119 DPDK:fast-tests / eal_flags_a_opt_autotest OK 0.30s
31/119 DPDK:fast-tests / eal_flags_b_opt_autotest OK 0.24s
32/119 DPDK:fast-tests / eal_flags_vdev_opt_autotest OK 0.19s
33/119 DPDK:fast-tests / eal_flags_r_opt_autotest OK 0.18s
34/119 DPDK:fast-tests / eal_flags_mem_autotest OK 0.59s
35/119 DPDK:fast-tests / eal_flags_file_prefix_autotest OK 22.20s
36/119 DPDK:fast-tests / eal_flags_misc_autotest OK 1.05s
37/119 DPDK:fast-tests / eal_fs_autotest OK 0.20s
38/119 DPDK:fast-tests / errno_autotest OK 0.19s
39/119 DPDK:fast-tests / ethdev_link_status OK 0.19s
40/119 DPDK:fast-tests / event_eth_tx_adapter_autotest OK 1.67s
41/119 DPDK:fast-tests / event_ring_autotest OK 0.21s
42/119 DPDK:fast-tests / eventdev_common_autotest OK 0.20s
43/119 DPDK:fast-tests / eventdev_selftest_sw OK 6.97s
44/119 DPDK:fast-tests / fbarray_autotest OK 0.20s
45/119 DPDK:fast-tests / fib_autotest OK 1.10s
46/119 DPDK:fast-tests / fib6_autotest OK 0.88s
47/119 DPDK:fast-tests / func_reentrancy_autotest OK 2.21s
48/119 DPDK:fast-tests / graph_autotest OK 0.21s
49/119 DPDK:fast-tests / node_list_dump OK 0.19s
50/119 DPDK:fast-tests / hash_autotest OK 0.83s
51/119 DPDK:fast-tests / hash_readwrite_func_autotest OK 6.36s
52/119 DPDK:fast-tests / interrupt_autotest OK 1.51s
53/119 DPDK:fast-tests / ipfrag_autotest OK 0.06s
54/119 DPDK:fast-tests / ipsec_autotest SKIP 0.21s exit status 77
55/119 DPDK:fast-tests / kvargs_autotest OK 0.20s
56/119 DPDK:fast-tests / latencystats_autotest OK 0.20s
57/119 DPDK:fast-tests / lcore_var_autotest OK 0.35s
58/119 DPDK:fast-tests / lcores_autotest OK 5.01s
59/119 DPDK:fast-tests / logs_autotest OK 0.19s
60/119 DPDK:fast-tests / lpm_autotest OK 2.29s
61/119 DPDK:fast-tests / lpm6_autotest OK 5.35s
62/119 DPDK:fast-tests / malloc_autotest OK 61.37s
63/119 DPDK:fast-tests / mbuf_autotest OK 5.16s
64/119 DPDK:fast-tests / mcslock_autotest OK 2.67s
65/119 DPDK:fast-tests / member_autotest OK 1.40s
66/119 DPDK:fast-tests / memcpy_autotest OK 6.79s
67/119 DPDK:fast-tests / memory_autotest OK 0.08s
68/119 DPDK:fast-tests / mempool_autotest OK 0.43s
69/119 DPDK:fast-tests / memzone_autotest OK 0.14s
70/119 DPDK:fast-tests / meter_autotest OK 0.20s
71/119 DPDK:fast-tests / metrics_autotest OK 0.19s
72/119 DPDK:fast-tests / multiprocess_autotest OK 0.17s
73/119 DPDK:fast-tests / net_ether_autotest OK 0.86s
74/119 DPDK:fast-tests / net_ipv6_autotest OK 0.20s
75/119 DPDK:fast-tests / pcapng_autotest OK 6.61s
76/119 DPDK:fast-tests / pdcp_autotest SKIP 0.06s exit status 77
77/119 DPDK:fast-tests / pdump_autotest OK 0.32s
78/119 DPDK:fast-tests / per_lcore_autotest OK 0.30s
79/119 DPDK:fast-tests / pflock_autotest OK 1.01s
80/119 DPDK:fast-tests / pie_autotest OK 0.20s
81/119 DPDK:fast-tests / ring_pmd_autotest OK 0.20s
82/119 DPDK:fast-tests / power_autotest OK 0.20s
83/119 DPDK:fast-tests / power_cpufreq_autotest SKIP 0.06s exit status 77
84/119 DPDK:fast-tests / power_intel_uncore_autotest SKIP 0.20s exit status 77
85/119 DPDK:fast-tests / power_kvm_vm_autotest SKIP 0.06s exit status 77
86/119 DPDK:fast-tests / prefetch_autotest OK 0.20s
87/119 DPDK:fast-tests / ptr_compress_autotest OK 0.20s
88/119 DPDK:fast-tests / rawdev_autotest OK 0.20s
89/119 DPDK:fast-tests / rcu_qsbr_autotest OK 0.72s
90/119 DPDK:fast-tests / reorder_autotest OK 0.25s
91/119 DPDK:fast-tests / rib_autotest OK 8.84s
92/119 DPDK:fast-tests / rib6_autotest OK 8.84s
93/119 DPDK:fast-tests / ring_autotest OK 0.23s
94/119 DPDK:fast-tests / rwlock_test1_autotest OK 0.94s
95/119 DPDK:fast-tests / rwlock_rda_autotest OK 5.20s
96/119 DPDK:fast-tests / rwlock_rds_wrm_autotest OK 5.20s
97/119 DPDK:fast-tests / rwlock_rde_wro_autotest OK 5.32s
98/119 DPDK:fast-tests / sched_autotest OK 0.31s
99/119 DPDK:fast-tests / security_autotest OK 0.06s
100/119 DPDK:fast-tests / seqlock_autotest OK 2.31s
101/119 DPDK:fast-tests / service_autotest OK 3.01s
102/119 DPDK:fast-tests / soring_autotest OK 0.31s
103/119 DPDK:fast-tests / spinlock_autotest OK 0.38s
104/119 DPDK:fast-tests / stack_autotest OK 0.86s
105/119 DPDK:fast-tests / stack_lf_autotest SKIP 0.05s exit status 77
106/119 DPDK:fast-tests / string_autotest OK 0.30s
107/119 DPDK:fast-tests / table_autotest OK 7.65s
108/119 DPDK:fast-tests / tailq_autotest OK 0.30s
109/119 DPDK:fast-tests / telemetry_data_autotest OK 0.31s
110/119 DPDK:fast-tests / telemetry_json_autotest OK 0.31s
111/119 DPDK:fast-tests / thash_autotest OK 0.32s
112/119 DPDK:fast-tests / threads_autotest OK 0.48s
113/119 DPDK:fast-tests / ticketlock_autotest OK 0.45s
114/119 DPDK:fast-tests / timer_autotest OK 3.86s
115/119 DPDK:fast-tests / trace_autotest OK 0.30s
116/119 DPDK:fast-tests / trace_autotest_with_traces OK 0.31s
117/119 DPDK:fast-tests / vdev_autotest OK 0.30s
118/119 DPDK:fast-tests / version_autotest OK 0.31s
119/119 DPDK:fast-tests / telemetry_all OK 1.24s
Ok: 112
Expected Fail: 0
Fail: 0
Unexpected Pass: 0
Skipped: 7
Timeout: 0
^ permalink raw reply [flat|nested] 5+ messages in thread
* |SUCCESS| pw152700 [PATCH 2/2] node: use node mbuf dynfield in ip4 nodes
[not found] <20250401042053.3518757-3-nsaxena@marvell.com>
2025-04-01 3:51 ` |SUCCESS| pw152699-152700 [PATCH 2/2] node: use node mbuf dynfield in ip4 nodes qemudev
2025-04-01 3:55 ` qemudev
@ 2025-04-01 4:22 ` checkpatch
2025-04-01 5:18 ` |FAILURE| pw152699-152700 [PATCH] [2/2] " dpdklab
2025-04-01 5:23 ` |FAILURE| pw152700 [PATCH 2/2] " 0-day Robot
4 siblings, 0 replies; 5+ messages in thread
From: checkpatch @ 2025-04-01 4:22 UTC (permalink / raw)
To: test-report
Test-Label: checkpatch
Test-Status: SUCCESS
http://dpdk.org/patch/152700
_coding style OK_
^ permalink raw reply [flat|nested] 5+ messages in thread
* |FAILURE| pw152699-152700 [PATCH] [2/2] node: use node mbuf dynfield in ip4 nodes
[not found] <20250401042053.3518757-3-nsaxena@marvell.com>
` (2 preceding siblings ...)
2025-04-01 4:22 ` |SUCCESS| pw152700 " checkpatch
@ 2025-04-01 5:18 ` dpdklab
2025-04-01 5:23 ` |FAILURE| pw152700 [PATCH 2/2] " 0-day Robot
4 siblings, 0 replies; 5+ messages in thread
From: dpdklab @ 2025-04-01 5:18 UTC (permalink / raw)
To: test-report; +Cc: dpdk-test-reports
Test-Label: iol-testing
Test-Status: FAILURE
http://dpdk.org/patch/152700
_build patch failure_
Submitter: Nitin Saxena <nsaxena@marvell.com>
Date: Tuesday, April 01 2025 04:20:47
Applied on: CommitID:edd3f4b1265e6da707c46ca9b6c39d332647baea
Apply patch set 152699-152700 failed:
Cloning the DPDK mirror at: https://github.com/DPDK/dpdk.git (Attempt 1 of 3)
Trying to checkout branch: origin/main
Checked out to main (edd3f4b1265e6da707c46ca9b6c39d332647baea)
Done: main commit edd3f4b1265e6da707c46ca9b6c39d332647baea
Trying to checkout branch: origin/main
Checked out to main (edd3f4b1265e6da707c46ca9b6c39d332647baea)
Applying patch...
Applying: node: add global node mbuf dynfield
Applying: node: use node mbuf dynfield in ip4 nodes
Running Check Meson
Processing meson.build
Processing buildtools/meson.build
Processing buildtools/chkincs/meson.build
Processing buildtools/pkg-config/meson.build
Processing buildtools/subproject/meson.build
Processing usertools/meson.build
Processing lib/meson.build
Processing lib/fib/meson.build
Processing lib/mbuf/meson.build
Processing lib/pcapng/meson.build
Processing lib/graph/meson.build
Processing lib/pci/meson.build
Processing lib/reorder/meson.build
Processing lib/power/meson.build
Processing lib/pdump/meson.build
Processing lib/stack/meson.build
Processing lib/eventdev/meson.build
Processing lib/rib/meson.build
Processing lib/net/meson.build
Processing lib/dmadev/meson.build
Processing lib/distributor/meson.build
Processing lib/rcu/meson.build
Processing lib/table/meson.build
Processing lib/member/meson.build
Processing lib/latencystats/meson.build
Processing lib/ring/meson.build
Processing lib/ethdev/meson.build
Processing lib/gro/meson.build
Processing lib/kvargs/meson.build
Processing lib/hash/meson.build
Processing lib/sched/meson.build
Processing lib/argparse/meson.build
Processing lib/compressdev/meson.build
Processing lib/rawdev/meson.build
Processing lib/vhost/meson.build
Processing lib/acl/meson.build
Processing lib/ip_frag/meson.build
Processing lib/cryptodev/meson.build
Processing lib/lpm/meson.build
Processing lib/cmdline/meson.build
Processing lib/dispatcher/meson.build
Processing lib/efd/meson.build
Processing lib/metrics/meson.build
Processing lib/pipeline/meson.build
Processing lib/ptr_compress/meson.build
Processing lib/regexdev/meson.build
Processing lib/bitratestats/meson.build
Processing lib/timer/meson.build
Processing lib/bbdev/meson.build
Processing lib/meter/meson.build
Processing lib/ipsec/meson.build
Processing lib/mldev/meson.build
Processing lib/gso/meson.build
Processing lib/pdcp/meson.build
Processing lib/jobstats/meson.build
Processing lib/cfgfile/meson.build
Processing lib/mempool/meson.build
Processing lib/port/meson.build
Processing lib/gpudev/meson.build
Processing lib/log/meson.build
Processing lib/telemetry/meson.build
Processing lib/security/meson.build
Processing lib/eal/meson.build
Processing lib/eal/riscv/meson.build
Processing lib/eal/riscv/include/meson.build
Processing lib/eal/x86/meson.build
Processing lib/eal/x86/include/meson.build
Processing lib/eal/ppc/meson.build
Processing lib/eal/ppc/include/meson.build
Processing lib/eal/arm/meson.build
Processing lib/eal/arm/include/meson.build
Processing lib/eal/loongarch/meson.build
Processing lib/eal/loongarch/include/meson.build
Processing lib/eal/freebsd/meson.build
Processing lib/eal/freebsd/include/meson.build
Processing lib/eal/windows/meson.build
Processing lib/eal/windows/include/meson.build
Processing lib/eal/linux/meson.build
Processing lib/eal/linux/include/meson.build
Processing lib/eal/common/meson.build
Processing lib/eal/unix/meson.build
Processing lib/eal/include/meson.build
Processing lib/node/meson.build
Error: Missing trailing "," in list at lib/node/meson.build:34
Processing lib/bpf/meson.build
Processing app/meson.build
Processing app/graph/meson.build
Processing app/test-regex/meson.build
Processing app/pdump/meson.build
Processing app/test-flow-perf/meson.build
Processing app/test-crypto-perf/meson.build
Processing app/test-sad/meson.build
Processing app/test-cmdline/meson.build
Processing app/test-fib/meson.build
Processing app/test-acl/meson.build
Processing app/test-bbdev/meson.build
Processing app/test-eventdev/meson.build
Processing app/test-security-perf/meson.build
Processing app/test-gpudev/meson.build
Processing app/test/meson.build
Processing app/test/suites/meson.build
Processing app/test/test_cfgfiles/meson.build
Processing app/test-compress-perf/meson.build
Processing app/test-mldev/meson.build
Processing app/proc-info/meson.build
Processing app/test-pmd/meson.build
Processing app/dumpcap/meson.build
Processing app/test-dma-perf/meson.build
Processing app/test-pipeline/meson.build
Processing drivers/meson.build
Processing drivers/power/meson.build
Processing drivers/power/amd_uncore/meson.build
Processing drivers/power/intel_uncore/meson.build
Processing drivers/power/kvm_vm/meson.build
Processing drivers/power/intel_pstate/meson.build
Processing drivers/power/amd_pstate/meson.build
Processing drivers/power/acpi/meson.build
Processing drivers/power/cppc/meson.build
Processing drivers/net/meson.build
Processing drivers/net/hinic/meson.build
Processing drivers/net/hinic/base/meson.build
Processing drivers/net/hns3/meson.build
Processing drivers/net/ark/meson.build
Processing drivers/net/avp/meson.build
Processing drivers/net/bnxt/meson.build
Processing drivers/net/bnxt/tf_ulp/meson.build
Processing drivers/net/bnxt/tf_ulp/generic_templates/meson.build
Processing drivers/net/bnxt/tf_core/meson.build
Processing drivers/net/bnxt/tf_core/v3/meson.build
Processing drivers/net/bnxt/hcapi/cfa/meson.build
Processing drivers/net/bnxt/hcapi/cfa_v3/meson.build
Processing drivers/net/ntnic/meson.build
Processing drivers/net/cxgbe/meson.build
Processing drivers/net/bonding/meson.build
Processing drivers/net/dpaa/meson.build
Processing drivers/net/octeon_ep/meson.build
Processing drivers/net/mlx5/meson.build
Processing drivers/net/mlx5/hws/meson.build
Processing drivers/net/mlx5/windows/meson.build
Processing drivers/net/mlx5/linux/meson.build
Processing drivers/net/vdev_netvsc/meson.build
Processing drivers/net/null/meson.build
Processing drivers/net/netvsc/meson.build
Processing drivers/net/ring/meson.build
Processing drivers/net/ena/meson.build
Processing drivers/net/enic/meson.build
Processing drivers/net/xsc/meson.build
Processing drivers/net/softnic/meson.build
Processing drivers/net/mana/meson.build
Processing drivers/net/thunderx/meson.build
Processing drivers/net/thunderx/base/meson.build
Processing drivers/net/failsafe/meson.build
Processing drivers/net/vhost/meson.build
Processing drivers/net/atlantic/meson.build
Processing drivers/net/vmxnet3/meson.build
Processing drivers/net/ionic/meson.build
Processing drivers/net/intel/i40e/meson.build
Processing drivers/net/intel/i40e/base/meson.build
Processing drivers/net/intel/idpf/meson.build
Processing drivers/net/intel/idpf/base/meson.build
Processing drivers/net/intel/ixgbe/meson.build
Processing drivers/net/intel/ixgbe/base/meson.build
Processing drivers/net/intel/e1000/meson.build
Processing drivers/net/intel/e1000/base/meson.build
Processing drivers/net/intel/iavf/meson.build
Processing drivers/net/intel/iavf/base/meson.build
Processing drivers/net/intel/fm10k/meson.build
Processing drivers/net/intel/fm10k/base/meson.build
Processing drivers/net/intel/ipn3ke/meson.build
Processing drivers/net/intel/ice/meson.build
Processing drivers/net/intel/ice/base/meson.build
Processing drivers/net/intel/cpfl/meson.build
Processing drivers/net/bnx2x/meson.build
Processing drivers/net/af_packet/meson.build
Processing drivers/net/octeontx/meson.build
Processing drivers/net/octeontx/base/meson.build
Processing drivers/net/mvneta/meson.build
Processing drivers/net/r8169/meson.build
Processing drivers/net/txgbe/meson.build
Processing drivers/net/txgbe/base/meson.build
Processing drivers/net/tap/meson.build
Processing drivers/net/tap/bpf/meson.build
Processing drivers/net/nfb/meson.build
Processing drivers/net/sfc/meson.build
Processing drivers/net/enetc/meson.build
Processing drivers/net/pcap/meson.build
Processing drivers/net/mlx4/meson.build
Processing drivers/net/memif/meson.build
Processing drivers/net/nfp/meson.build
Processing drivers/net/enetfec/meson.build
Processing drivers/net/zxdh/meson.build
Processing drivers/net/ngbe/meson.build
Processing drivers/net/ngbe/base/meson.build
Processing drivers/net/dpaa2/meson.build
Processing drivers/net/cnxk/meson.build
Processing drivers/net/qede/meson.build
Processing drivers/net/qede/base/meson.build
Processing drivers/net/virtio/meson.build
Processing drivers/net/gve/meson.build
Processing drivers/net/af_xdp/meson.build
Processing drivers/net/axgbe/meson.build
Processing drivers/net/mvpp2/meson.build
Processing drivers/net/pfe/meson.build
Processing drivers/bus/meson.build
Processing drivers/bus/auxiliary/meson.build
Processing drivers/bus/pci/meson.build
Processing drivers/bus/vmbus/meson.build
Processing drivers/bus/dpaa/meson.build
Processing drivers/bus/cdx/meson.build
Processing drivers/bus/vdev/meson.build
Processing drivers/bus/uacce/meson.build
Processing drivers/bus/platform/meson.build
Processing drivers/bus/fslmc/meson.build
Processing drivers/bus/ifpga/meson.build
Processing drivers/vdpa/meson.build
Processing drivers/vdpa/mlx5/meson.build
Processing drivers/vdpa/sfc/meson.build
Processing drivers/vdpa/nfp/meson.build
Processing drivers/vdpa/ifc/meson.build
Processing drivers/gpu/meson.build
Processing drivers/gpu/cuda/meson.build
Processing drivers/regex/meson.build
Processing drivers/regex/mlx5/meson.build
Processing drivers/regex/cn9k/meson.build
Processing drivers/common/meson.build
Processing drivers/common/dpaax/meson.build
Processing drivers/common/zsda/meson.build
Processing drivers/common/nitrox/meson.build
Processing drivers/common/mlx5/meson.build
Processing drivers/common/mlx5/windows/meson.build
Processing drivers/common/mlx5/linux/meson.build
Processing drivers/common/sfc_efx/meson.build
Processing drivers/common/sfc_efx/base/meson.build
Processing drivers/common/cpt/meson.build
Processing drivers/common/qat/meson.build
Processing drivers/common/ionic/meson.build
Processing drivers/common/mvep/meson.build
Processing drivers/common/octeontx/meson.build
Processing drivers/common/nfp/meson.build
Processing drivers/common/cnxk/meson.build
Processing drivers/crypto/meson.build
Processing drivers/crypto/nitrox/meson.build
Processing drivers/crypto/mlx5/meson.build
Processing drivers/crypto/dpaa_sec/meson.build
Processing drivers/crypto/bcmfs/meson.build
Processing drivers/crypto/null/meson.build
Processing drivers/crypto/dpaa2_sec/meson.build
Processing drivers/crypto/ipsec_mb/meson.build
Processing drivers/crypto/caam_jr/meson.build
Processing drivers/crypto/openssl/meson.build
Processing drivers/crypto/ionic/meson.build
Processing drivers/crypto/octeontx/meson.build
Processing drivers/crypto/ccp/meson.build
Processing drivers/crypto/uadk/meson.build
Processing drivers/crypto/cnxk/meson.build
Processing drivers/crypto/scheduler/meson.build
Processing drivers/crypto/virtio/meson.build
Processing drivers/crypto/armv8/meson.build
Processing drivers/crypto/mvsam/meson.build
Processing drivers/baseband/meson.build
Processing drivers/baseband/la12xx/meson.build
Processing drivers/baseband/null/meson.build
Processing drivers/baseband/fpga_5gnr_fec/meson.build
Processing drivers/baseband/acc/meson.build
Processing drivers/baseband/turbo_sw/meson.build
Processing drivers/baseband/fpga_lte_fec/meson.build
Processing drivers/event/meson.build
Processing drivers/event/dlb2/meson.build
Processing drivers/event/dpaa/meson.build
Processing drivers/event/skeleton/meson.build
Processing drivers/event/sw/meson.build
Processing drivers/event/octeontx/meson.build
Processing drivers/event/dpaa2/meson.build
Processing drivers/event/cnxk/meson.build
Processing drivers/event/dsw/meson.build
Processing drivers/event/opdl/meson.build
Processing drivers/dma/meson.build
Processing drivers/dma/dpaa/meson.build
Processing drivers/dma/skeleton/meson.build
Processing drivers/dma/odm/meson.build
Processing drivers/dma/ioat/meson.build
Processing drivers/dma/idxd/meson.build
Processing drivers/dma/hisilicon/meson.build
Processing drivers/dma/dpaa2/meson.build
Processing drivers/dma/cnxk/meson.build
Processing drivers/raw/meson.build
Processing drivers/raw/cnxk_rvu_lf/meson.build
Processing drivers/raw/skeleton/meson.build
Processing drivers/raw/ntb/meson.build
Processing drivers/raw/cnxk_gpio/meson.build
Processing drivers/raw/cnxk_bphy/meson.build
Processing drivers/raw/ifpga/meson.build
Processing drivers/raw/ifpga/base/meson.build
Processing drivers/raw/gdtc/meson.build
Processing drivers/raw/dpaa2_cmdif/meson.build
Processing drivers/ml/meson.build
Processing drivers/ml/cnxk/meson.build
Processing drivers/compress/meson.build
Processing drivers/compress/nitrox/meson.build
Processing drivers/compress/mlx5/meson.build
Processing drivers/compress/zlib/meson.build
Processing drivers/compress/octeontx/meson.build
Processing drivers/compress/uadk/meson.build
Processing drivers/compress/isal/meson.build
Processing drivers/mempool/meson.build
Processing drivers/mempool/stack/meson.build
Processing drivers/mempool/dpaa/meson.build
Processing drivers/mempool/ring/meson.build
Processing drivers/mempool/bucket/meson.build
Processing drivers/mempool/octeontx/meson.build
Processing drivers/mempool/dpaa2/meson.build
Processing drivers/mempool/cnxk/meson.build
Processing kernel/meson.build
Processing kernel/freebsd/meson.build
Processing kernel/freebsd/contigmem/meson.build
Processing kernel/freebsd/nic_uio/meson.build
Processing doc/meson.build
Processing doc/guides/meson.build
Processing doc/api/meson.build
Processing doc/api/dts/meson.build
Processing config/meson.build
Processing config/riscv/meson.build
Processing config/x86/meson.build
Processing config/ppc/meson.build
Processing config/arm/meson.build
Processing config/loongarch/meson.build
Processing examples/meson.build
Processing examples/l2fwd-crypto/meson.build
Processing examples/bbdev_app/meson.build
Processing examples/l2fwd/meson.build
Processing examples/vmdq/meson.build
Processing examples/qos_meter/meson.build
Processing examples/distributor/meson.build
Processing examples/skeleton/meson.build
Processing examples/link_status_interrupt/meson.build
Processing examples/l2fwd-cat/meson.build
Processing examples/l2fwd-keepalive/meson.build
Processing examples/ipv4_multicast/meson.build
Processing examples/l2fwd-jobstats/meson.build
Processing examples/vdpa/meson.build
Processing examples/vm_power_manager/meson.build
Processing examples/vm_power_manager/guest_cli/meson.build
Processing examples/helloworld/meson.build
Processing examples/flow_filtering/meson.build
Processing examples/eventdev_pipeline/meson.build
Processing examples/fips_validation/meson.build
Processing examples/l3fwd-graph/meson.build
Processing examples/ntb/meson.build
Processing examples/vhost/meson.build
Processing examples/ipsec-secgw/meson.build
Processing examples/ethtool/meson.build
Processing examples/vhost_blk/meson.build
Processing examples/vmdq_dcb/meson.build
Processing examples/l2fwd-macsec/meson.build
Processing examples/cmdline/meson.build
Processing examples/l2fwd-event/meson.build
Processing examples/server_node_efd/efd_server/meson.build
Processing examples/server_node_efd/efd_node/meson.build
Processing examples/bond/meson.build
Processing examples/l3fwd/meson.build
Processing examples/ptpclient/meson.build
Processing examples/ip_pipeline/meson.build
Processing examples/service_cores/meson.build
Processing examples/pipeline/meson.build
Processing examples/ip_fragmentation/meson.build
Processing examples/dma/meson.build
Processing examples/l3fwd-power/meson.build
Processing examples/qos_sched/meson.build
Processing examples/rxtx_callbacks/meson.build
Processing examples/timer/meson.build
Processing examples/multi_process/symmetric_mp/meson.build
Processing examples/multi_process/simple_mp/meson.build
Processing examples/multi_process/hotplug_mp/meson.build
Processing examples/multi_process/client_server_mp/mp_client/meson.build
Processing examples/multi_process/client_server_mp/mp_server/meson.build
Processing examples/packet_ordering/meson.build
Processing examples/ip_reassembly/meson.build
Processing examples/vhost_crypto/meson.build
https://lab.dpdk.org/results/dashboard/patchsets/32917/
UNH-IOL DPDK Community Lab
^ permalink raw reply [flat|nested] 5+ messages in thread
* |FAILURE| pw152700 [PATCH 2/2] node: use node mbuf dynfield in ip4 nodes
[not found] <20250401042053.3518757-3-nsaxena@marvell.com>
` (3 preceding siblings ...)
2025-04-01 5:18 ` |FAILURE| pw152699-152700 [PATCH] [2/2] " dpdklab
@ 2025-04-01 5:23 ` 0-day Robot
4 siblings, 0 replies; 5+ messages in thread
From: 0-day Robot @ 2025-04-01 5:23 UTC (permalink / raw)
To: test-report; +Cc: nsaxena, robot
From: robot@bytheb.org
Test-Label: github-robot: build
Test-Status: FAILURE
http://patchwork.dpdk.org/patch/152700/
_github build: failed_
Build URL: https://github.com/ovsrobot/dpdk/actions/runs/14187402737
Build Logs:
-----------------------Summary of failed steps-----------------------
"ubuntu-22.04-gcc-static-i386" failed at step Build and test
"ubuntu-22.04-gcc-abi+debug+doc+examples+tests" failed at step Build and test
"ubuntu-22.04-clang-asan+doc+tests" failed at step Build and test
"ubuntu-22.04-gcc-shared-aarch64" failed at step Build and test
"ubuntu-22.04-gcc-riscv64" failed at step Build and test
"ubuntu-22.04-gcc-ppc64le" failed at step Build and test
"fedora:39-gcc" failed at step Build
"fedora:39-clang" failed at step Build
----------------------End summary of failed steps--------------------
-------------------------------BEGIN LOGS----------------------------
####################################################################################
#### [Begin job log] "ubuntu-22.04-gcc-static-i386" at step Build and test
####################################################################################
| ;
106 | static __rte_always_inline rte_node_mbuf_overload_fields_t *
| ~~~~~~
/home/runner/work/dpdk/dpdk/lib/node/rte_node_mbuf_dynfield.h:107:42: error: ‘struct rte_mbuf’ declared inside parameter list will not be visible outside of this definition or declaration [-Werror]
107 | rte_node_mbuf_overload_fields_get(struct rte_mbuf *m, const int offset)
| ^~~~~~~~
/home/runner/work/dpdk/dpdk/lib/node/rte_node_mbuf_dynfield.h: In function ‘rte_node_mbuf_overload_fields_get’:
/home/runner/work/dpdk/dpdk/lib/node/rte_node_mbuf_dynfield.h:111:42: error: expected expression before ‘struct’
111 | f = RTE_MBUF_DYNFIELD(m, offset, struct rte_node_mbuf_dynfield *);
| ^~~~~~
/home/runner/work/dpdk/dpdk/lib/node/rte_node_mbuf_dynfield.h: At top level:
/home/runner/work/dpdk/dpdk/lib/node/rte_node_mbuf_dynfield.h:132:19: error: expected ‘;’ before ‘int’
132 | __rte_experimental
| ^
| ;
133 | int rte_node_mbuf_dynfield_register(void);
| ~~~
cc1: all warnings being treated as errors
[4129/5641] Compiling C object buildtools/chkincs/chkincs-exp.p/meson-generated_rte_eal_memconfig.c.o
[4130/5641] Compiling C object buildtools/chkincs/chkincs-exp.p/meson-generated_rte_epoll.c.o
[4131/5641] Compiling C object buildtools/chkincs/chkincs-exp.p/meson-generated_rte_eal_trace.c.o
[4132/5641] Compiling C object buildtools/chkincs/chkincs-exp.p/meson-generated_rte_hexdump.c.o
[4133/5641] Compiling C object buildtools/chkincs/chkincs-exp.p/meson-generated_rte_fbarray.c.o
ninja: build stopped: subcommand failed.
##[error]Process completed with exit code 1.
####################################################################################
#### [End job log] "ubuntu-22.04-gcc-static-i386" at step Build and test
####################################################################################
####################################################################################
#### [Begin job log] "ubuntu-22.04-gcc-abi+debug+doc+examples+tests" at step Build and test
####################################################################################
| ;
106 | static __rte_always_inline rte_node_mbuf_overload_fields_t *
| ~~~~~~
/home/runner/work/dpdk/dpdk/lib/node/rte_node_mbuf_dynfield.h:107:42: error: ‘struct rte_mbuf’ declared inside parameter list will not be visible outside of this definition or declaration [-Werror]
107 | rte_node_mbuf_overload_fields_get(struct rte_mbuf *m, const int offset)
| ^~~~~~~~
/home/runner/work/dpdk/dpdk/lib/node/rte_node_mbuf_dynfield.h: In function ‘rte_node_mbuf_overload_fields_get’:
/home/runner/work/dpdk/dpdk/lib/node/rte_node_mbuf_dynfield.h:111:42: error: expected expression before ‘struct’
111 | f = RTE_MBUF_DYNFIELD(m, offset, struct rte_node_mbuf_dynfield *);
| ^~~~~~
/home/runner/work/dpdk/dpdk/lib/node/rte_node_mbuf_dynfield.h: At top level:
/home/runner/work/dpdk/dpdk/lib/node/rte_node_mbuf_dynfield.h:132:19: error: expected ‘;’ before ‘int’
132 | __rte_experimental
| ^
| ;
133 | int rte_node_mbuf_dynfield_register(void);
| ~~~
cc1: all warnings being treated as errors
[5096/6727] Compiling C object buildtools/chkincs/chkincs.p/meson-generated_bus_auxiliary_driver.c.o
[5097/6727] Compiling C object buildtools/chkincs/chkincs.p/meson-generated_rte_table_action.c.o
[5098/6727] Compiling C object buildtools/chkincs/chkincs.p/meson-generated_rte_node_eth_api.c.o
[5099/6727] Compiling C object buildtools/chkincs/chkincs.p/meson-generated_rte_graph_worker.c.o
[5100/6727] Compiling C object buildtools/chkincs/chkincs.p/meson-generated_rte_node_ip6_api.c.o
ninja: build stopped: subcommand failed.
##[error]Process completed with exit code 1.
####################################################################################
#### [End job log] "ubuntu-22.04-gcc-abi+debug+doc+examples+tests" at step Build and test
####################################################################################
####################################################################################
#### [Begin job log] "ubuntu-22.04-clang-asan+doc+tests" at step Build and test
####################################################################################
^
/home/runner/work/dpdk/dpdk/lib/node/rte_node_mbuf_dynfield.h:90:8: error: 'inline' can only appear on functions
static __rte_always_inline rte_node_mbuf_dynfield_t *
^
../lib/eal/include/rte_common.h:456:29: note: expanded from macro '__rte_always_inline'
#define __rte_always_inline inline __attribute__((always_inline))
^
In file included from buildtools/chkincs/chkincs.p/rte_node_mbuf_dynfield.c:1:
/home/runner/work/dpdk/dpdk/lib/node/rte_node_mbuf_dynfield.h:90:8: error: 'always_inline' attribute only applies to functions [-Werror,-Wignored-attributes]
../lib/eal/include/rte_common.h:456:51: note: expanded from macro '__rte_always_inline'
#define __rte_always_inline inline __attribute__((always_inline))
^
In file included from buildtools/chkincs/chkincs.p/rte_node_mbuf_dynfield.c:1:
/home/runner/work/dpdk/dpdk/lib/node/rte_node_mbuf_dynfield.h:90:52: error: expected ';' after top level declarator
static __rte_always_inline rte_node_mbuf_dynfield_t *
^
;
4 errors generated.
[5096/6727] Compiling C object buildtools/chkincs/chkincs.p/meson-generated_bus_auxiliary_driver.c.o
[5097/6727] Compiling C object buildtools/chkincs/chkincs.p/meson-generated_rte_swx_ipsec.c.o
[5098/6727] Compiling C object buildtools/chkincs/chkincs.p/meson-generated_rte_node_eth_api.c.o
[5099/6727] Compiling C object buildtools/chkincs/chkincs.p/meson-generated_rte_node_ip6_api.c.o
[5100/6727] Compiling C object buildtools/chkincs/chkincs.p/meson-generated_rte_graph_worker.c.o
ninja: build stopped: subcommand failed.
##[error]Process completed with exit code 1.
####################################################################################
#### [End job log] "ubuntu-22.04-clang-asan+doc+tests" at step Build and test
####################################################################################
####################################################################################
#### [Begin job log] "ubuntu-22.04-gcc-shared-aarch64" at step Build and test
####################################################################################
| ;
106 | static __rte_always_inline rte_node_mbuf_overload_fields_t *
| ~~~~~~
/home/runner/work/dpdk/dpdk/lib/node/rte_node_mbuf_dynfield.h:107:42: error: ‘struct rte_mbuf’ declared inside parameter list will not be visible outside of this definition or declaration [-Werror]
107 | rte_node_mbuf_overload_fields_get(struct rte_mbuf *m, const int offset)
| ^~~~~~~~
/home/runner/work/dpdk/dpdk/lib/node/rte_node_mbuf_dynfield.h: In function ‘rte_node_mbuf_overload_fields_get’:
/home/runner/work/dpdk/dpdk/lib/node/rte_node_mbuf_dynfield.h:111:42: error: expected expression before ‘struct’
111 | f = RTE_MBUF_DYNFIELD(m, offset, struct rte_node_mbuf_dynfield *);
| ^~~~~~
/home/runner/work/dpdk/dpdk/lib/node/rte_node_mbuf_dynfield.h: At top level:
/home/runner/work/dpdk/dpdk/lib/node/rte_node_mbuf_dynfield.h:132:19: error: expected ‘;’ before ‘int’
132 | __rte_experimental
| ^
| ;
133 | int rte_node_mbuf_dynfield_register(void);
| ~~~
cc1: all warnings being treated as errors
[5095/6675] Compiling C object buildtools/chkincs/chkincs-exp.p/meson-generated_rte_ticketlock.c.o
[5096/6675] Compiling C object buildtools/chkincs/chkincs-exp.p/meson-generated_rte_time.c.o
[5097/6675] Compiling C object buildtools/chkincs/chkincs-exp.p/meson-generated_rte_trace.c.o
[5098/6675] Compiling C object buildtools/chkincs/chkincs-exp.p/meson-generated_rte_trace_point.c.o
[5099/6675] Compiling C object buildtools/chkincs/chkincs-exp.p/meson-generated_rte_trace_point_register.c.o
ninja: build stopped: subcommand failed.
##[error]Process completed with exit code 1.
####################################################################################
#### [End job log] "ubuntu-22.04-gcc-shared-aarch64" at step Build and test
####################################################################################
####################################################################################
#### [Begin job log] "ubuntu-22.04-gcc-riscv64" at step Build and test
####################################################################################
| ;
106 | static __rte_always_inline rte_node_mbuf_overload_fields_t *
| ~~~~~~
/home/runner/work/dpdk/dpdk/lib/node/rte_node_mbuf_dynfield.h:107:42: error: ‘struct rte_mbuf’ declared inside parameter list will not be visible outside of this definition or declaration [-Werror]
107 | rte_node_mbuf_overload_fields_get(struct rte_mbuf *m, const int offset)
| ^~~~~~~~
/home/runner/work/dpdk/dpdk/lib/node/rte_node_mbuf_dynfield.h: In function ‘rte_node_mbuf_overload_fields_get’:
/home/runner/work/dpdk/dpdk/lib/node/rte_node_mbuf_dynfield.h:111:42: error: expected expression before ‘struct’
111 | f = RTE_MBUF_DYNFIELD(m, offset, struct rte_node_mbuf_dynfield *);
| ^~~~~~
/home/runner/work/dpdk/dpdk/lib/node/rte_node_mbuf_dynfield.h: At top level:
/home/runner/work/dpdk/dpdk/lib/node/rte_node_mbuf_dynfield.h:132:19: error: expected ‘;’ before ‘int’
132 | __rte_experimental
| ^
| ;
133 | int rte_node_mbuf_dynfield_register(void);
| ~~~
cc1: all warnings being treated as errors
[4451/5918] Compiling C object buildtools/chkincs/chkincs-exp.p/meson-generated_rte_seqcount.c.o
[4452/5918] Compiling C object buildtools/chkincs/chkincs-exp.p/meson-generated_rte_seqlock.c.o
[4453/5918] Compiling C object buildtools/chkincs/chkincs-exp.p/meson-generated_rte_stdatomic.c.o
[4454/5918] Compiling C object buildtools/chkincs/chkincs-exp.p/meson-generated_rte_service.c.o
[4455/5918] Compiling C object buildtools/chkincs/chkincs-exp.p/meson-generated_rte_service_component.c.o
ninja: build stopped: subcommand failed.
##[error]Process completed with exit code 1.
####################################################################################
#### [End job log] "ubuntu-22.04-gcc-riscv64" at step Build and test
####################################################################################
####################################################################################
#### [Begin job log] "ubuntu-22.04-gcc-ppc64le" at step Build and test
####################################################################################
| ;
106 | static __rte_always_inline rte_node_mbuf_overload_fields_t *
| ~~~~~~
/home/runner/work/dpdk/dpdk/lib/node/rte_node_mbuf_dynfield.h:107:42: error: ‘struct rte_mbuf’ declared inside parameter list will not be visible outside of this definition or declaration [-Werror]
107 | rte_node_mbuf_overload_fields_get(struct rte_mbuf *m, const int offset)
| ^~~~~~~~
/home/runner/work/dpdk/dpdk/lib/node/rte_node_mbuf_dynfield.h: In function ‘rte_node_mbuf_overload_fields_get’:
/home/runner/work/dpdk/dpdk/lib/node/rte_node_mbuf_dynfield.h:111:42: error: expected expression before ‘struct’
111 | f = RTE_MBUF_DYNFIELD(m, offset, struct rte_node_mbuf_dynfield *);
| ^~~~~~
/home/runner/work/dpdk/dpdk/lib/node/rte_node_mbuf_dynfield.h: At top level:
/home/runner/work/dpdk/dpdk/lib/node/rte_node_mbuf_dynfield.h:132:19: error: expected ‘;’ before ‘int’
132 | __rte_experimental
| ^
| ;
133 | int rte_node_mbuf_dynfield_register(void);
| ~~~
cc1: all warnings being treated as errors
[4471/5947] Compiling C object buildtools/chkincs/chkincs-exp.p/meson-generated_rte_memzone.c.o
[4472/5947] Compiling C object buildtools/chkincs/chkincs-exp.p/meson-generated_rte_pci_dev_feature_defs.c.o
[4473/5947] Compiling C object buildtools/chkincs/chkincs-exp.p/meson-generated_rte_pci_dev_features.c.o
[4474/5947] Compiling C object buildtools/chkincs/chkincs-exp.p/meson-generated_rte_per_lcore.c.o
[4475/5947] Compiling C object buildtools/chkincs/chkincs-exp.p/meson-generated_rte_pflock.c.o
ninja: build stopped: subcommand failed.
##[error]Process completed with exit code 1.
####################################################################################
#### [End job log] "ubuntu-22.04-gcc-ppc64le" at step Build and test
####################################################################################
####################################################################################
#### [Begin job log] "fedora:39-gcc" at step Build
####################################################################################
####################################################################################
#### [End job log] "fedora:39-gcc" at step Build
####################################################################################
####################################################################################
#### [Begin job log] "fedora:39-clang" at step Build
####################################################################################
####################################################################################
#### [End job log] "fedora:39-clang" at step Build
####################################################################################
--------------------------------END LOGS-----------------------------
^ permalink raw reply [flat|nested] 5+ messages in thread
end of thread, other threads:[~2025-04-01 5:23 UTC | newest]
Thread overview: 5+ messages (download: mbox.gz / follow: Atom feed)
-- links below jump to the message on this page --
[not found] <20250401042053.3518757-3-nsaxena@marvell.com>
2025-04-01 3:51 ` |SUCCESS| pw152699-152700 [PATCH 2/2] node: use node mbuf dynfield in ip4 nodes qemudev
2025-04-01 3:55 ` qemudev
2025-04-01 4:22 ` |SUCCESS| pw152700 " checkpatch
2025-04-01 5:18 ` |FAILURE| pw152699-152700 [PATCH] [2/2] " dpdklab
2025-04-01 5:23 ` |FAILURE| pw152700 [PATCH 2/2] " 0-day Robot
This is a public inbox, see mirroring instructions
for how to clone and mirror all data and code used for this inbox;
as well as URLs for NNTP newsgroup(s).