* |SUCCESS| pw152750-152753 [RFC PATCH 4/4] net/cnxk: report link type along with link status
[not found] <20250403070837.926292-4-ndabilpuram@marvell.com>
@ 2025-04-03 6:35 ` qemudev
2025-04-03 6:41 ` |FAILURE| " qemudev
` (28 subsequent siblings)
29 siblings, 0 replies; 30+ messages in thread
From: qemudev @ 2025-04-03 6:35 UTC (permalink / raw)
To: test-report
Test-Label: loongarch-compilation
Test-Status: SUCCESS
http://dpdk.org/patch/152753
_Compilation OK_
Submitter: Nithin Dabilpuram <ndabilpuram@marvell.com>
Date: Thu, 3 Apr 2025 12:38:34 +0530
DPDK git baseline: Repo:dpdk-next-net
Branch: main
CommitID: b40c403777e93242a377c07ff51964480d40b51d
152750-152753 --> meson & ninja build successfully
Test environment and result as below:
+---------------------+----------------+
| Environment | compilation |
+---------------------+----------------+
| Loongnix-Server 8.3 | PASS |
+---------------------+----------------+
Loongnix-Server 8.3
Kernel: 4.19.190+
Compiler: gcc 8.3
^ permalink raw reply [flat|nested] 30+ messages in thread
* |FAILURE| pw152750-152753 [RFC PATCH 4/4] net/cnxk: report link type along with link status
[not found] <20250403070837.926292-4-ndabilpuram@marvell.com>
2025-04-03 6:35 ` |SUCCESS| pw152750-152753 [RFC PATCH 4/4] net/cnxk: report link type along with link status qemudev
@ 2025-04-03 6:41 ` qemudev
2025-04-03 7:09 ` |SUCCESS| pw152753 " checkpatch
` (27 subsequent siblings)
29 siblings, 0 replies; 30+ messages in thread
From: qemudev @ 2025-04-03 6:41 UTC (permalink / raw)
To: test-report; +Cc: Nithin Dabilpuram, zhoumin
Test-Label: loongarch-unit-testing
Test-Status: FAILURE
http://dpdk.org/patch/152753
_Unit Testing FAIL_
Submitter: Nithin Dabilpuram <ndabilpuram@marvell.com>
Date: Thu, 3 Apr 2025 12:38:34 +0530
DPDK git baseline: Repo:dpdk-next-net
Branch: main
CommitID: b40c403777e93242a377c07ff51964480d40b51d
152750-152753 --> testing fail
Test environment and result as below:
+---------------------+----------------+
| Environment | dpdk_unit_test |
+---------------------+----------------+
| Loongnix-Server 8.3 | FAIL |
+---------------------+----------------+
Loongnix-Server 8.3
Kernel: 4.19.190+
Compiler: gcc 8.3
Test result details:
1/119 DPDK:fast-tests / acl_autotest OK 3.31s
2/119 DPDK:fast-tests / alarm_autotest OK 1.70s
3/119 DPDK:fast-tests / argparse_autotest OK 0.48s
4/119 DPDK:fast-tests / atomic_autotest OK 6.91s
5/119 DPDK:fast-tests / bitcount_autotest OK 0.48s
6/119 DPDK:fast-tests / bitmap_autotest OK 0.47s
7/119 DPDK:fast-tests / bitops_autotest OK 1.98s
8/119 DPDK:fast-tests / bitratestats_autotest OK 0.48s
9/119 DPDK:fast-tests / bitset_autotest OK 3.21s
10/119 DPDK:fast-tests / bpf_autotest OK 0.48s
11/119 DPDK:fast-tests / bpf_convert_autotest OK 0.49s
12/119 DPDK:fast-tests / byteorder_autotest OK 0.48s
13/119 DPDK:fast-tests / cfgfile_autotest OK 0.48s
14/119 DPDK:fast-tests / cksum_autotest OK 0.48s
15/119 DPDK:fast-tests / cmdline_autotest OK 0.48s
16/119 DPDK:fast-tests / common_autotest OK 1.36s
17/119 DPDK:fast-tests / compressdev_autotest SKIP 0.07s exit status 77
18/119 DPDK:fast-tests / cpuflags_autotest OK 0.48s
19/119 DPDK:fast-tests / crc_autotest OK 0.48s
20/119 DPDK:fast-tests / user_delay_us OK 0.48s
21/119 DPDK:fast-tests / debug_autotest OK 21.29s
22/119 DPDK:fast-tests / devargs_autotest OK 0.48s
23/119 DPDK:fast-tests / dispatcher_autotest TIMEOUT 80.09s exit status -15
24/119 DPDK:fast-tests / distributor_autotest OK 1.20s
25/119 DPDK:fast-tests / eal_flags_c_opt_autotest OK 0.79s
26/119 DPDK:fast-tests / eal_flags_main_opt_autotest OK 0.22s
27/119 DPDK:fast-tests / eal_flags_n_opt_autotest OK 0.20s
28/119 DPDK:fast-tests / eal_flags_hpet_autotest OK 0.14s
29/119 DPDK:fast-tests / eal_flags_no_huge_autotest OK 0.22s
30/119 DPDK:fast-tests / eal_flags_a_opt_autotest OK 0.31s
31/119 DPDK:fast-tests / eal_flags_b_opt_autotest OK 0.25s
32/119 DPDK:fast-tests / eal_flags_vdev_opt_autotest OK 0.20s
33/119 DPDK:fast-tests / eal_flags_r_opt_autotest OK 0.19s
34/119 DPDK:fast-tests / eal_flags_mem_autotest OK 0.60s
35/119 DPDK:fast-tests / eal_flags_file_prefix_autotest OK 22.24s
36/119 DPDK:fast-tests / eal_flags_misc_autotest OK 1.06s
37/119 DPDK:fast-tests / eal_fs_autotest OK 0.48s
38/119 DPDK:fast-tests / errno_autotest OK 0.48s
39/119 DPDK:fast-tests / ethdev_link_status FAIL 0.48s exit status 255
40/119 DPDK:fast-tests / event_eth_tx_adapter_autotest OK 1.69s
41/119 DPDK:fast-tests / event_ring_autotest OK 0.48s
42/119 DPDK:fast-tests / eventdev_common_autotest OK 0.48s
43/119 DPDK:fast-tests / eventdev_selftest_sw OK 7.39s
44/119 DPDK:fast-tests / fbarray_autotest OK 0.48s
45/119 DPDK:fast-tests / fib_autotest OK 1.33s
46/119 DPDK:fast-tests / fib6_autotest OK 1.12s
47/119 DPDK:fast-tests / func_reentrancy_autotest OK 2.40s
48/119 DPDK:fast-tests / graph_autotest OK 0.48s
49/119 DPDK:fast-tests / node_list_dump OK 0.48s
50/119 DPDK:fast-tests / hash_autotest OK 1.10s
51/119 DPDK:fast-tests / hash_readwrite_func_autotest OK 6.40s
52/119 DPDK:fast-tests / interrupt_autotest OK 1.78s
53/119 DPDK:fast-tests / ipfrag_autotest OK 0.08s
54/119 DPDK:fast-tests / ipsec_autotest SKIP 0.48s exit status 77
55/119 DPDK:fast-tests / kvargs_autotest OK 0.49s
56/119 DPDK:fast-tests / latencystats_autotest OK 0.49s
57/119 DPDK:fast-tests / lcore_var_autotest OK 0.62s
58/119 DPDK:fast-tests / lcores_autotest OK 5.29s
59/119 DPDK:fast-tests / logs_autotest OK 0.48s
60/119 DPDK:fast-tests / lpm_autotest OK 2.54s
61/119 DPDK:fast-tests / lpm6_autotest OK 5.64s
62/119 DPDK:fast-tests / malloc_autotest OK 61.76s
63/119 DPDK:fast-tests / mbuf_autotest OK 4.87s
64/119 DPDK:fast-tests / mcslock_autotest OK 3.16s
65/119 DPDK:fast-tests / member_autotest OK 1.68s
66/119 DPDK:fast-tests / memcpy_autotest OK 7.18s
67/119 DPDK:fast-tests / memory_autotest OK 0.08s
68/119 DPDK:fast-tests / mempool_autotest OK 0.43s
69/119 DPDK:fast-tests / memzone_autotest OK 0.14s
70/119 DPDK:fast-tests / meter_autotest OK 0.30s
71/119 DPDK:fast-tests / metrics_autotest OK 0.31s
72/119 DPDK:fast-tests / multiprocess_autotest OK 0.18s
73/119 DPDK:fast-tests / net_ether_autotest OK 0.97s
74/119 DPDK:fast-tests / net_ipv6_autotest OK 0.31s
75/119 DPDK:fast-tests / pcapng_autotest OK 6.25s
76/119 DPDK:fast-tests / pdcp_autotest SKIP 0.06s exit status 77
77/119 DPDK:fast-tests / pdump_autotest OK 0.42s
78/119 DPDK:fast-tests / per_lcore_autotest OK 0.41s
79/119 DPDK:fast-tests / pflock_autotest OK 1.12s
80/119 DPDK:fast-tests / pie_autotest OK 0.31s
81/119 DPDK:fast-tests / ring_pmd_autotest OK 0.31s
82/119 DPDK:fast-tests / power_autotest OK 0.31s
83/119 DPDK:fast-tests / power_cpufreq_autotest SKIP 0.06s exit status 77
84/119 DPDK:fast-tests / power_intel_uncore_autotest SKIP 0.30s exit status 77
85/119 DPDK:fast-tests / power_kvm_vm_autotest SKIP 0.06s exit status 77
86/119 DPDK:fast-tests / prefetch_autotest OK 0.30s
87/119 DPDK:fast-tests / ptr_compress_autotest OK 0.31s
88/119 DPDK:fast-tests / rawdev_autotest OK 0.31s
89/119 DPDK:fast-tests / rcu_qsbr_autotest OK 0.83s
90/119 DPDK:fast-tests / reorder_autotest OK 0.36s
91/119 DPDK:fast-tests / rib_autotest OK 8.96s
92/119 DPDK:fast-tests / rib6_autotest OK 8.95s
93/119 DPDK:fast-tests / ring_autotest OK 0.34s
94/119 DPDK:fast-tests / rwlock_test1_autotest OK 1.05s
95/119 DPDK:fast-tests / rwlock_rda_autotest OK 5.31s
96/119 DPDK:fast-tests / rwlock_rds_wrm_autotest OK 5.31s
97/119 DPDK:fast-tests / rwlock_rde_wro_autotest OK 5.31s
98/119 DPDK:fast-tests / sched_autotest OK 0.31s
99/119 DPDK:fast-tests / security_autotest OK 0.06s
100/119 DPDK:fast-tests / seqlock_autotest OK 2.31s
101/119 DPDK:fast-tests / service_autotest OK 3.01s
102/119 DPDK:fast-tests / soring_autotest OK 0.31s
103/119 DPDK:fast-tests / spinlock_autotest OK 0.38s
104/119 DPDK:fast-tests / stack_autotest OK 0.86s
105/119 DPDK:fast-tests / stack_lf_autotest SKIP 0.05s exit status 77
106/119 DPDK:fast-tests / string_autotest OK 0.30s
107/119 DPDK:fast-tests / table_autotest OK 7.71s
108/119 DPDK:fast-tests / tailq_autotest OK 0.30s
109/119 DPDK:fast-tests / telemetry_data_autotest OK 0.31s
110/119 DPDK:fast-tests / telemetry_json_autotest OK 0.31s
111/119 DPDK:fast-tests / thash_autotest OK 0.32s
112/119 DPDK:fast-tests / threads_autotest OK 0.48s
113/119 DPDK:fast-tests / ticketlock_autotest OK 0.45s
114/119 DPDK:fast-tests / timer_autotest OK 3.86s
115/119 DPDK:fast-tests / trace_autotest OK 0.30s
116/119 DPDK:fast-tests / trace_autotest_with_traces OK 0.31s
117/119 DPDK:fast-tests / vdev_autotest OK 0.30s
118/119 DPDK:fast-tests / version_autotest OK 0.31s
119/119 DPDK:fast-tests / telemetry_all OK 1.30s
Ok: 110
Expected Fail: 0
Fail: 1
Unexpected Pass: 0
Skipped: 7
Timeout: 1
Test logs for failed test cases:
================================================================================
DPDK:fast-tests / dispatcher_autotest: TIMEOUT
================================================================================
-------------------------------------stdout-------------------------------------
RTE>>dispatcher_autotest
-------------------------------------stderr-------------------------------------
EAL: Detected CPU lcores: 32
EAL: Detected NUMA nodes: 8
EAL: Detected static linkage of DPDK
EAL: Multi-process socket /var/run/dpdk/rte/mp_socket
EAL: Selected IOVA mode 'PA'
APP: HPET is not enabled, using TSC as default timer
================================================================================
DPDK:fast-tests / ethdev_link_status: FAIL
================================================================================
-------------------------------------stdout-------------------------------------
RTE>>ethdev_link_status
+ ------------------------------------------------------- +
+ Test Suite : link status formatting
+ ------------------------------------------------------- +
Default link up #1: Link up at 2.5 Gbps FDX Autoneg None
TestCase test_link_status_up_default() line 28 failed: Invalid default link status string
+ TestCase [ 0] : test_link_status_up_default failed
+ TestCase [ 1] : test_link_status_down_default succeeded
+ TestCase [ 2] : test_link_speed_all_values succeeded
invalid link up #1: len=35 Link up at Invalid FDX Autoneg None
TestCase test_link_status_invalid() line 104 failed: Incorrect invalid link status string
+ TestCase [ 3] : test_link_status_invalid failed
+ ------------------------------------------------------- +
+ Test Suite Summary : link status formatting
+ ------------------------------------------------------- +
+ Tests Total : 4
+ Tests Skipped : 0
+ Tests Executed : 4
+ Tests Unsupported: 0
+ Tests Passed : 2
+ Tests Failed : 2
+ ------------------------------------------------------- +
Test Failed
RTE>>
-------------------------------------stderr-------------------------------------
EAL: Detected CPU lcores: 32
EAL: Detected NUMA nodes: 8
EAL: Detected static linkage of DPDK
EAL: Multi-process socket /var/run/dpdk/rte/mp_socket
EAL: Selected IOVA mode 'VA'
APP: HPET is not enabled, using TSC as default timer
EAL: lib.eal log level changed from info to debug
^ permalink raw reply [flat|nested] 30+ messages in thread
* |SUCCESS| pw152753 [RFC PATCH 4/4] net/cnxk: report link type along with link status
[not found] <20250403070837.926292-4-ndabilpuram@marvell.com>
2025-04-03 6:35 ` |SUCCESS| pw152750-152753 [RFC PATCH 4/4] net/cnxk: report link type along with link status qemudev
2025-04-03 6:41 ` |FAILURE| " qemudev
@ 2025-04-03 7:09 ` checkpatch
2025-04-03 8:02 ` |FAILURE| " 0-day Robot
` (26 subsequent siblings)
29 siblings, 0 replies; 30+ messages in thread
From: checkpatch @ 2025-04-03 7:09 UTC (permalink / raw)
To: test-report
Test-Label: checkpatch
Test-Status: SUCCESS
http://dpdk.org/patch/152753
_coding style OK_
^ permalink raw reply [flat|nested] 30+ messages in thread
* |FAILURE| pw152753 [RFC PATCH 4/4] net/cnxk: report link type along with link status
[not found] <20250403070837.926292-4-ndabilpuram@marvell.com>
` (2 preceding siblings ...)
2025-04-03 7:09 ` |SUCCESS| pw152753 " checkpatch
@ 2025-04-03 8:02 ` 0-day Robot
2025-04-03 8:33 ` |SUCCESS| pw152750-152753 [PATCH] [RFC,4/4] net/cnxk: report link ty dpdklab
` (25 subsequent siblings)
29 siblings, 0 replies; 30+ messages in thread
From: 0-day Robot @ 2025-04-03 8:02 UTC (permalink / raw)
To: test-report; +Cc: ndabilpuram, robot
From: robot@bytheb.org
Test-Label: github-robot: build
Test-Status: FAILURE
http://patchwork.dpdk.org/patch/152753/
_github build: failed_
Build URL: https://github.com/ovsrobot/dpdk/actions/runs/14237301574
Build Logs:
-----------------------Summary of failed steps-----------------------
"ubuntu-22.04-gcc-abi+debug+doc+examples+tests" failed at step Build and test
"ubuntu-22.04-clang-asan+doc+tests" failed at step Build and test
----------------------End summary of failed steps--------------------
-------------------------------BEGIN LOGS----------------------------
####################################################################################
#### [Begin job log] "ubuntu-22.04-gcc-abi+debug+doc+examples+tests" at step Build and test
####################################################################################
Functions changes summary: 0 Removed, 1 Changed (17 filtered out), 0 Added (1 filtered out) functions
Variables changes summary: 0 Removed, 0 Changed (2 filtered out), 0 Added variables
1 function with some indirect sub-type change:
[C] 'function int rte_eth_link_get(uint16_t, rte_eth_link*)' at rte_ethdev.c:3082:1 has some indirect sub-type changes:
parameter 2 of type 'rte_eth_link*' has sub-type changes:
in pointed to type 'struct rte_eth_link' at rte_ethdev.h:348:1:
type size hasn't changed
1 data member change:
anonymous data member at offset 0 (in bits) changed from:
union {uint64_t val64; struct {uint32_t link_speed; uint16_t link_duplex; uint16_t link_autoneg; uint16_t link_status;};}
to:
union {uint64_t val64; struct {uint32_t link_speed; uint16_t link_duplex; uint16_t link_autoneg; uint16_t link_status; uint16_t link_type;};}
Error: ABI issue reported for abidiff --suppr /home/runner/work/dpdk/dpdk/devtools/libabigail.abignore --no-added-syms --headers-dir1 reference/usr/local/include --headers-dir2 install/usr/local/include reference/usr/local/lib/librte_ethdev.so.25.1 install/usr/local/lib/librte_ethdev.so.25.2
ABIDIFF_ABI_CHANGE, this change requires a review (abidiff flagged this as a potential issue).
Functions changes summary: 0 Removed, 0 Changed (282 filtered out), 0 Added (1 filtered out) functions
Variables changes summary: 0 Removed, 0 Changed, 0 Added variable
Functions changes summary: 0 Removed, 0 Changed (1 filtered out), 0 Added function
Variables changes summary: 0 Removed, 0 Changed, 0 Added variable
##[error]Process completed with exit code 1.
####################################################################################
#### [End job log] "ubuntu-22.04-gcc-abi+debug+doc+examples+tests" at step Build and test
####################################################################################
####################################################################################
#### [Begin job log] "ubuntu-22.04-clang-asan+doc+tests" at step Build and test
####################################################################################
102/104 DPDK:fast-tests / vdev_autotest OK 0.34s
103/104 DPDK:fast-tests / version_autotest OK 0.35s
104/104 DPDK:fast-tests / telemetry_all OK 1.10s
Ok: 97
Expected Fail: 0
Fail: 1
Unexpected Pass: 0
Skipped: 6
Timeout: 0
Full log written to /home/runner/work/dpdk/dpdk/build/meson-logs/testlog.txt
+ failed=true
+ catch_coredump
+ ls /tmp/dpdk-core.*.*
+ return 0
+ check_traces
+ which babeltrace
+ sudo find /home/runner -name metadata
+ dirname /home/runner/work/dpdk/dpdk/build/app/test/suites/rte-2025-04-03-AM-08-00-42/metadata
+ sudo babeltrace /home/runner/work/dpdk/dpdk/build/app/test/suites/rte-2025-04-03-AM-08-00-42
+ continue
+ [ true != true ]
##[error]Process completed with exit code 1.
####################################################################################
#### [End job log] "ubuntu-22.04-clang-asan+doc+tests" at step Build and test
####################################################################################
--------------------------------END LOGS-----------------------------
^ permalink raw reply [flat|nested] 30+ messages in thread
* |SUCCESS| pw152750-152753 [PATCH] [RFC,4/4] net/cnxk: report link ty
[not found] <20250403070837.926292-4-ndabilpuram@marvell.com>
` (3 preceding siblings ...)
2025-04-03 8:02 ` |FAILURE| " 0-day Robot
@ 2025-04-03 8:33 ` dpdklab
2025-04-03 8:39 ` dpdklab
` (24 subsequent siblings)
29 siblings, 0 replies; 30+ messages in thread
From: dpdklab @ 2025-04-03 8:33 UTC (permalink / raw)
To: Test Report; +Cc: dpdk-test-reports
Test-Label: iol-intel-Functional
Test-Status: SUCCESS
http://dpdk.org/patch/152753
_Functional Testing PASS_
Submitter: Nithin Dabilpuram <ndabilpuram@marvell.com>
Date: Thursday, April 03 2025 07:08:37
DPDK git baseline: Repo:dpdk
Branch: master
CommitID:b40c403777e93242a377c07ff51964480d40b51d
152750-152753 --> functional testing pass
Upstream job id: Template-DTS-Pipeline#220185
Test environment and result as below:
Ubuntu 24.04 LTS
Kernel: 6.8.0-44-generic
Compiler: gcc 13.2.0
NIC: Intel Corporation Ethernet Controller XL710 for 40GbE QSFP+ 40 Mbps
Aggregate Results by Test Suite
+----------------------+--------+
| Test Suite | Result |
+======================+========+
| TestBlocklist | PASS |
+----------------------+--------+
| TestMacFilter | PASS |
+----------------------+--------+
| TestDynamicConfig | PASS |
+----------------------+--------+
| TestDynamicQueueConf | PASS |
+----------------------+--------+
| TestPMDBufferScatter | PASS |
+----------------------+--------+
| TestPromiscSupport | PASS |
+----------------------+--------+
| TestUniPkt | PASS |
+----------------------+--------+
Ubuntu 20.04
Kernel: 5.4.0-122-generic
Compiler: gcc 9.4.0
NIC: Intel Corporation Ethernet Converged Network Adapter XL710-QDA2 40000 Mbps
Aggregate Results by Test Suite
+-----------------------------+--------+
| Test Suite | Result |
+=============================+========+
| unit_tests_mbuf | PASS |
+-----------------------------+--------+
| vhost_virtio_user_interrupt | PASS |
+-----------------------------+--------+
| virtio_smoke | PASS |
+-----------------------------+--------+
To view detailed results, visit:
https://lab.dpdk.org/results/dashboard/patchsets/32939/
UNH-IOL DPDK Community Lab
To manage your email subscriptions, visit:
https://lab.dpdk.org/results/dashboard/preferences/subscriptions/
^ permalink raw reply [flat|nested] 30+ messages in thread
* |SUCCESS| pw152750-152753 [PATCH] [RFC,4/4] net/cnxk: report link ty
[not found] <20250403070837.926292-4-ndabilpuram@marvell.com>
` (4 preceding siblings ...)
2025-04-03 8:33 ` |SUCCESS| pw152750-152753 [PATCH] [RFC,4/4] net/cnxk: report link ty dpdklab
@ 2025-04-03 8:39 ` dpdklab
2025-04-03 8:41 ` dpdklab
` (23 subsequent siblings)
29 siblings, 0 replies; 30+ messages in thread
From: dpdklab @ 2025-04-03 8:39 UTC (permalink / raw)
To: Test Report; +Cc: dpdk-test-reports
Test-Label: iol-intel-Performance
Test-Status: SUCCESS
http://dpdk.org/patch/152753
_Performance Testing PASS_
Submitter: Nithin Dabilpuram <ndabilpuram@marvell.com>
Date: Thursday, April 03 2025 07:08:37
DPDK git baseline: Repo:dpdk
Branch: master
CommitID:b40c403777e93242a377c07ff51964480d40b51d
152750-152753 --> performance testing pass
Upstream job id: Template-DTS-Pipeline#220181
Test environment and result as below:
Ubuntu 22.04
Kernel: 5.15.0-131-generic
Compiler: gcc (Ubuntu 11.4.0-1ubuntu1~22.04) 11.4.0
NIC: Intel Corporation Ethernet Converged Network Adapter 82599ES 10000 Mbps
Fail/Total: 0/6
Detail performance results:
+----------+-------------+---------+------------+------------------------------+
| num_cpus | num_threads | txd/rxd | frame_size | throughput difference from |
| | | | | expected |
+==========+=============+=========+============+==============================+
| 1 | 2 | 128 | 64 | 1.4% |
+----------+-------------+---------+------------+------------------------------+
| 1 | 2 | 512 | 64 | 0.0% |
+----------+-------------+---------+------------+------------------------------+
| 1 | 2 | 2048 | 64 | -0.3% |
+----------+-------------+---------+------------+------------------------------+
| 1 | 1 | 128 | 64 | 1.0% |
+----------+-------------+---------+------------+------------------------------+
| 1 | 1 | 512 | 64 | 0.6% |
+----------+-------------+---------+------------+------------------------------+
| 1 | 1 | 2048 | 64 | -0.7% |
+----------+-------------+---------+------------+------------------------------+
Ubuntu 24.04
Kernel: 6.8.0-52-generic
Compiler: gcc 13.3.0
NIC: Intel E810 (Arm Grace Server) 100000 Mbps
Fail/Total: 0/2
Detail performance results:
+------------+---------+----------+-------------+------------------------------+
| frame_size | txd/rxd | num_cpus | num_threads | throughput difference from |
| | | | | expected |
+============+=========+==========+=============+==============================+
| 64 | 512 | 1 | 1 | -0.2% |
+------------+---------+----------+-------------+------------------------------+
| 64 | 2048 | 1 | 1 | 0.1% |
+------------+---------+----------+-------------+------------------------------+
To view detailed results, visit:
https://lab.dpdk.org/results/dashboard/patchsets/32939/
UNH-IOL DPDK Community Lab
To manage your email subscriptions, visit:
https://lab.dpdk.org/results/dashboard/preferences/subscriptions/
^ permalink raw reply [flat|nested] 30+ messages in thread
* |SUCCESS| pw152750-152753 [PATCH] [RFC,4/4] net/cnxk: report link ty
[not found] <20250403070837.926292-4-ndabilpuram@marvell.com>
` (5 preceding siblings ...)
2025-04-03 8:39 ` dpdklab
@ 2025-04-03 8:41 ` dpdklab
2025-04-03 8:55 ` dpdklab
` (22 subsequent siblings)
29 siblings, 0 replies; 30+ messages in thread
From: dpdklab @ 2025-04-03 8:41 UTC (permalink / raw)
To: Ali Alnubani, Test Report; +Cc: dpdk-test-reports
Test-Label: iol-mellanox-Performance
Test-Status: SUCCESS
http://dpdk.org/patch/152753
_Performance Testing PASS_
Submitter: Nithin Dabilpuram <ndabilpuram@marvell.com>
Date: Thursday, April 03 2025 07:08:37
DPDK git baseline: Repo:dpdk
Branch: master
CommitID:b40c403777e93242a377c07ff51964480d40b51d
152750-152753 --> performance testing pass
Upstream job id: Template-DTS-Pipeline#220179
Test environment and result as below:
Ubuntu 24.04
Kernel: 6.8.0-45-generic
Compiler: gcc 13.2.0
NIC: NVIDIA Mellanox ConnectX-7 100000 Mbps
Fail/Total: 0/6
Detail performance results:
+------------+---------+----------+-------------+------------------------------+
| frame_size | txd/rxd | num_cpus | num_threads | throughput difference from |
| | | | | expected |
+============+=========+==========+=============+==============================+
| 64 | 1024 | 1 | 1 | -0.6% |
+------------+---------+----------+-------------+------------------------------+
| 128 | 1024 | 1 | 1 | 0.4% |
+------------+---------+----------+-------------+------------------------------+
| 256 | 1024 | 1 | 1 | -0.7% |
+------------+---------+----------+-------------+------------------------------+
| 512 | 1024 | 1 | 1 | 0.0% |
+------------+---------+----------+-------------+------------------------------+
| 1024 | 1024 | 1 | 1 | -0.0% |
+------------+---------+----------+-------------+------------------------------+
| 1518 | 1024 | 1 | 1 | 0.1% |
+------------+---------+----------+-------------+------------------------------+
Ubuntu 24.04
Kernel: 6.8.0-45-generic
Compiler: gcc 13.2.0
NIC: Mellanox ConnectX-6 Lx 25000 Mbps
Fail/Total: 0/6
Detail performance results:
+------------+---------+----------+-------------+------------------------------+
| frame_size | txd/rxd | num_cpus | num_threads | throughput difference from |
| | | | | expected |
+============+=========+==========+=============+==============================+
| 64 | 1024 | 1 | 1 | 0.0% |
+------------+---------+----------+-------------+------------------------------+
| 128 | 1024 | 1 | 1 | -0.0% |
+------------+---------+----------+-------------+------------------------------+
| 256 | 1024 | 1 | 1 | -0.0% |
+------------+---------+----------+-------------+------------------------------+
| 512 | 1024 | 1 | 1 | -0.0% |
+------------+---------+----------+-------------+------------------------------+
| 1024 | 1024 | 1 | 1 | 0.0% |
+------------+---------+----------+-------------+------------------------------+
| 1518 | 1024 | 1 | 1 | 0.0% |
+------------+---------+----------+-------------+------------------------------+
To view detailed results, visit:
https://lab.dpdk.org/results/dashboard/patchsets/32939/
UNH-IOL DPDK Community Lab
To manage your email subscriptions, visit:
https://lab.dpdk.org/results/dashboard/preferences/subscriptions/
^ permalink raw reply [flat|nested] 30+ messages in thread
* |SUCCESS| pw152750-152753 [PATCH] [RFC,4/4] net/cnxk: report link ty
[not found] <20250403070837.926292-4-ndabilpuram@marvell.com>
` (6 preceding siblings ...)
2025-04-03 8:41 ` dpdklab
@ 2025-04-03 8:55 ` dpdklab
2025-04-03 9:01 ` dpdklab
` (21 subsequent siblings)
29 siblings, 0 replies; 30+ messages in thread
From: dpdklab @ 2025-04-03 8:55 UTC (permalink / raw)
To: Test Report; +Cc: dpdk-test-reports
Test-Label: iol-intel-Functional
Test-Status: SUCCESS
http://dpdk.org/patch/152753
_Functional Testing PASS_
Submitter: Nithin Dabilpuram <ndabilpuram@marvell.com>
Date: Thursday, April 03 2025 07:08:37
DPDK git baseline: Repo:dpdk
Branch: master
CommitID:b40c403777e93242a377c07ff51964480d40b51d
152750-152753 --> functional testing pass
Upstream job id: Template-DTS-Pipeline#220186
Test environment and result as below:
Ubuntu 24.04 LTS
Kernel: 6.8.0-44-generic
Compiler: gcc 13.2.0
NIC: Intel Corporation Ethernet Controller XL710 for 40GbE QSFP+ 40 Mbps
Aggregate Results by Test Suite
+----------------------+--------+
| Test Suite | Result |
+======================+========+
| TestBlocklist | PASS |
+----------------------+--------+
| TestMacFilter | PASS |
+----------------------+--------+
| TestDynamicConfig | PASS |
+----------------------+--------+
| TestDynamicQueueConf | PASS |
+----------------------+--------+
| TestPMDBufferScatter | PASS |
+----------------------+--------+
| TestPromiscSupport | PASS |
+----------------------+--------+
| TestUniPkt | PASS |
+----------------------+--------+
Ubuntu 20.04
Kernel: 5.4.0-122-generic
Compiler: gcc 9.4.0
NIC: Intel Corporation Ethernet Converged Network Adapter XL710-QDA2 40000 Mbps
Aggregate Results by Test Suite
+-----------------------------+--------+
| Test Suite | Result |
+=============================+========+
| unit_tests_mbuf | PASS |
+-----------------------------+--------+
| vhost_virtio_user_interrupt | PASS |
+-----------------------------+--------+
| virtio_smoke | PASS |
+-----------------------------+--------+
Ubuntu 22.04
Kernel: 5.15.0-131-generic
Compiler: gcc (Ubuntu 11.4.0-1ubuntu1~22.04) 11.4.0
NIC: Intel Corporation Ethernet Converged Network Adapter 82599ES 10000 Mbps
Aggregate Results by Test Suite
+-----------------------------+--------+
| Test Suite | Result |
+=============================+========+
| unit_tests_mbuf | PASS |
+-----------------------------+--------+
| vhost_virtio_user_interrupt | PASS |
+-----------------------------+--------+
| virtio_smoke | PASS |
+-----------------------------+--------+
To view detailed results, visit:
https://lab.dpdk.org/results/dashboard/patchsets/32939/
UNH-IOL DPDK Community Lab
To manage your email subscriptions, visit:
https://lab.dpdk.org/results/dashboard/preferences/subscriptions/
^ permalink raw reply [flat|nested] 30+ messages in thread
* |SUCCESS| pw152750-152753 [PATCH] [RFC,4/4] net/cnxk: report link ty
[not found] <20250403070837.926292-4-ndabilpuram@marvell.com>
` (7 preceding siblings ...)
2025-04-03 8:55 ` dpdklab
@ 2025-04-03 9:01 ` dpdklab
2025-04-03 9:03 ` dpdklab
` (20 subsequent siblings)
29 siblings, 0 replies; 30+ messages in thread
From: dpdklab @ 2025-04-03 9:01 UTC (permalink / raw)
To: Test Report; +Cc: dpdk-test-reports
Test-Label: iol-intel-Performance
Test-Status: SUCCESS
http://dpdk.org/patch/152753
_Performance Testing PASS_
Submitter: Nithin Dabilpuram <ndabilpuram@marvell.com>
Date: Thursday, April 03 2025 07:08:37
DPDK git baseline: Repo:dpdk
Branch: master
CommitID:b40c403777e93242a377c07ff51964480d40b51d
152750-152753 --> performance testing pass
Upstream job id: Template-DTS-Pipeline#220180
Test environment and result as below:
Ubuntu 22.04
Kernel: 5.15.0-131-generic
Compiler: gcc (Ubuntu 11.4.0-1ubuntu1~22.04) 11.4.0
NIC: Intel Corporation Ethernet Converged Network Adapter 82599ES 10000 Mbps
Fail/Total: 0/6
Detail performance results:
+----------+-------------+---------+------------+------------------------------+
| num_cpus | num_threads | txd/rxd | frame_size | throughput difference from |
| | | | | expected |
+==========+=============+=========+============+==============================+
| 1 | 2 | 128 | 64 | 1.4% |
+----------+-------------+---------+------------+------------------------------+
| 1 | 2 | 512 | 64 | 0.0% |
+----------+-------------+---------+------------+------------------------------+
| 1 | 2 | 2048 | 64 | -0.3% |
+----------+-------------+---------+------------+------------------------------+
| 1 | 1 | 128 | 64 | 1.0% |
+----------+-------------+---------+------------+------------------------------+
| 1 | 1 | 512 | 64 | 0.6% |
+----------+-------------+---------+------------+------------------------------+
| 1 | 1 | 2048 | 64 | -0.7% |
+----------+-------------+---------+------------+------------------------------+
Ubuntu 24.04
Kernel: 6.8.0-52-generic
Compiler: gcc 13.3.0
NIC: Intel E810 (Arm Grace Server) 100000 Mbps
Fail/Total: 0/2
Detail performance results:
+------------+---------+----------+-------------+------------------------------+
| frame_size | txd/rxd | num_cpus | num_threads | throughput difference from |
| | | | | expected |
+============+=========+==========+=============+==============================+
| 64 | 512 | 1 | 1 | -0.2% |
+------------+---------+----------+-------------+------------------------------+
| 64 | 2048 | 1 | 1 | 0.1% |
+------------+---------+----------+-------------+------------------------------+
Ubuntu 20.04
Kernel: 5.4.0-122-generic
Compiler: gcc 9.4.0
NIC: Intel Corporation Ethernet Converged Network Adapter XL710-QDA2 40000 Mbps
Fail/Total: 0/4
Detail performance results:
+----------+-------------+---------+------------+------------------------------+
| num_cpus | num_threads | txd/rxd | frame_size | throughput difference from |
| | | | | expected |
+==========+=============+=========+============+==============================+
| 1 | 2 | 512 | 64 | 1.0% |
+----------+-------------+---------+------------+------------------------------+
| 1 | 2 | 2048 | 64 | -2.6% |
+----------+-------------+---------+------------+------------------------------+
| 1 | 1 | 512 | 64 | -1.6% |
+----------+-------------+---------+------------+------------------------------+
| 1 | 1 | 2048 | 64 | -0.3% |
+----------+-------------+---------+------------+------------------------------+
To view detailed results, visit:
https://lab.dpdk.org/results/dashboard/patchsets/32939/
UNH-IOL DPDK Community Lab
To manage your email subscriptions, visit:
https://lab.dpdk.org/results/dashboard/preferences/subscriptions/
^ permalink raw reply [flat|nested] 30+ messages in thread
* |SUCCESS| pw152750-152753 [PATCH] [RFC,4/4] net/cnxk: report link ty
[not found] <20250403070837.926292-4-ndabilpuram@marvell.com>
` (8 preceding siblings ...)
2025-04-03 9:01 ` dpdklab
@ 2025-04-03 9:03 ` dpdklab
2025-04-03 9:26 ` dpdklab
` (19 subsequent siblings)
29 siblings, 0 replies; 30+ messages in thread
From: dpdklab @ 2025-04-03 9:03 UTC (permalink / raw)
To: Test Report; +Cc: dpdk-test-reports
Test-Label: iol-sample-apps-testing
Test-Status: SUCCESS
http://dpdk.org/patch/152753
_Testing PASS_
Submitter: Nithin Dabilpuram <ndabilpuram@marvell.com>
Date: Thursday, April 03 2025 07:08:37
DPDK git baseline: Repo:dpdk
Branch: master
CommitID:b40c403777e93242a377c07ff51964480d40b51d
152750-152753 --> testing pass
Upstream job id: Template-DTS-Pipeline#220191
Test environment and result as below:
+--------------------+----------------------+
| Environment | compressdev_zlib_pmd |
+====================+======================+
| Ubuntu 22.04 (ARM) | PASS |
+--------------------+----------------------+
Ubuntu 22.04 (ARM)
Kernel: 5.15.0-97-generic
Compiler: gcc gcc (Ubuntu 11.4.0-1ubuntu1~22.04) 11.4.0
To view detailed results, visit:
https://lab.dpdk.org/results/dashboard/patchsets/32939/
UNH-IOL DPDK Community Lab
To manage your email subscriptions, visit:
https://lab.dpdk.org/results/dashboard/preferences/subscriptions/
^ permalink raw reply [flat|nested] 30+ messages in thread
* |SUCCESS| pw152750-152753 [PATCH] [RFC,4/4] net/cnxk: report link ty
[not found] <20250403070837.926292-4-ndabilpuram@marvell.com>
` (9 preceding siblings ...)
2025-04-03 9:03 ` dpdklab
@ 2025-04-03 9:26 ` dpdklab
2025-04-03 9:37 ` |PENDING| " dpdklab
` (18 subsequent siblings)
29 siblings, 0 replies; 30+ messages in thread
From: dpdklab @ 2025-04-03 9:26 UTC (permalink / raw)
To: Test Report; +Cc: dpdk-test-reports
Test-Label: iol-sample-apps-testing
Test-Status: SUCCESS
http://dpdk.org/patch/152753
_Testing PASS_
Submitter: Nithin Dabilpuram <ndabilpuram@marvell.com>
Date: Thursday, April 03 2025 07:08:37
DPDK git baseline: Repo:dpdk
Branch: master
CommitID:b40c403777e93242a377c07ff51964480d40b51d
152750-152753 --> testing pass
Upstream job id: Template-DTS-Pipeline#220190
Test environment and result as below:
+--------------------+----------------------+
| Environment | compressdev_zlib_pmd |
+====================+======================+
| Ubuntu 22.04 (ARM) | PASS |
+--------------------+----------------------+
| Ubuntu 22.04 | PASS |
+--------------------+----------------------+
Ubuntu 22.04 (ARM)
Kernel: 5.15.0-97-generic
Compiler: gcc gcc (Ubuntu 11.4.0-1ubuntu1~22.04) 11.4.0
Ubuntu 22.04
Kernel: 5.15.0-100-generic
Compiler: gcc gcc (Ubuntu 11.4.0-1ubuntu1~22.04) 11.4.0
To view detailed results, visit:
https://lab.dpdk.org/results/dashboard/patchsets/32939/
UNH-IOL DPDK Community Lab
To manage your email subscriptions, visit:
https://lab.dpdk.org/results/dashboard/preferences/subscriptions/
^ permalink raw reply [flat|nested] 30+ messages in thread
* |PENDING| pw152750-152753 [PATCH] [RFC,4/4] net/cnxk: report link ty
[not found] <20250403070837.926292-4-ndabilpuram@marvell.com>
` (10 preceding siblings ...)
2025-04-03 9:26 ` dpdklab
@ 2025-04-03 9:37 ` dpdklab
2025-04-03 9:48 ` |FAILURE| " dpdklab
` (17 subsequent siblings)
29 siblings, 0 replies; 30+ messages in thread
From: dpdklab @ 2025-04-03 9:37 UTC (permalink / raw)
To: Test Report; +Cc: dpdk-test-reports
Test-Label: iol-unit-arm64-testing
Test-Status: PENDING
http://dpdk.org/patch/152753
_Testing pending_
Submitter: Nithin Dabilpuram <ndabilpuram@marvell.com>
Date: Thursday, April 03 2025 07:08:37
DPDK git baseline: Repo:dpdk
Branch: master
CommitID:b40c403777e93242a377c07ff51964480d40b51d
152750-152753 --> testing pending
Upstream job id: Aarch32-Unit-Test#5834
Test environment and result as below:
+-----------------------------+----------------+--------------+------------------------------+---------------------------+
| Environment | dpdk_unit_test | lpm_autotest | cryptodev_sw_snow3g_autotest | cryptodev_sw_zuc_autotest |
+=============================+================+==============+==============================+===========================+
| CentOS Stream 9 (ARM) | PEND | SKIPPED | SKIPPED | SKIPPED |
+-----------------------------+----------------+--------------+------------------------------+---------------------------+
| Fedora 40 (ARM) | PEND | SKIPPED | SKIPPED | SKIPPED |
+-----------------------------+----------------+--------------+------------------------------+---------------------------+
| 32-bit Ubuntu 22.04.4 (ARM) | PASS | SKIPPED | SKIPPED | SKIPPED |
+-----------------------------+----------------+--------------+------------------------------+---------------------------+
| CentOS Stream 10 (ARM) | PEND | SKIPPED | SKIPPED | SKIPPED |
+-----------------------------+----------------+--------------+------------------------------+---------------------------+
| Debian 12 (arm) | PEND | SKIPPED | PEND | PEND |
+-----------------------------+----------------+--------------+------------------------------+---------------------------+
| Fedora 40 (ARM Clang) | PEND | SKIPPED | SKIPPED | SKIPPED |
+-----------------------------+----------------+--------------+------------------------------+---------------------------+
| Fedora 41 (ARM) | PEND | SKIPPED | SKIPPED | SKIPPED |
+-----------------------------+----------------+--------------+------------------------------+---------------------------+
| Fedora 41 (ARM Clang) | PEND | SKIPPED | SKIPPED | SKIPPED |
+-----------------------------+----------------+--------------+------------------------------+---------------------------+
| Ubuntu 20.04 (ARM) | PEND | SKIPPED | SKIPPED | SKIPPED |
+-----------------------------+----------------+--------------+------------------------------+---------------------------+
| Ubuntu 22.04 (ARM) | PEND | SKIPPED | SKIPPED | SKIPPED |
+-----------------------------+----------------+--------------+------------------------------+---------------------------+
| RHEL9 (ARM) | PEND | SKIPPED | SKIPPED | SKIPPED |
+-----------------------------+----------------+--------------+------------------------------+---------------------------+
| Ubuntu 24.04 (ARM) | PEND | SKIPPED | SKIPPED | SKIPPED |
+-----------------------------+----------------+--------------+------------------------------+---------------------------+
| Ubuntu 20.04 ARM SVE | SKIPPED | PEND | SKIPPED | SKIPPED |
+-----------------------------+----------------+--------------+------------------------------+---------------------------+
CentOS Stream 9 (ARM)
Kernel: Depends on container host
Compiler: gcc 11.5.0 20240719 (Red Hat 11.5.0-2)
Fedora 40 (ARM)
Kernel: Depends on container host
Compiler: gcc 14.2.1 20240912 (Red Hat 14.2.1-3)
32-bit Ubuntu 22.04.4 (ARM)
Kernel: 5.15.83+ aarch64
Compiler: gcc (Ubuntu 11.4.0-1ubuntu1~22.04) 11.4.0
CentOS Stream 10 (ARM)
Kernel: Depends on container host
Compiler: gcc 14.2.1 20241104 (Red Hat 14.2.1-6)
Debian 12 (arm)
Kernel: Depends on container host
Compiler: gcc (Debian 12.2.0-14) 12.2.0
Fedora 40 (ARM Clang)
Kernel: Depends on container host
Compiler: clang 18.1.8 (Fedora 18.1.8-1.fc40)
Fedora 41 (ARM)
Kernel: Depends on container host
Compiler: gcc 14.2.1 20240912 (Red Hat 14.2.1-3)
Fedora 41 (ARM Clang)
Kernel: Depends on container host
Compiler: clang 19.1.5 (Fedora 19.1.5-1.fc41)
Ubuntu 20.04 (ARM)
Kernel: Depends on container host
Compiler: gcc (Ubuntu 9.4.0-1ubuntu1~20.04.2) 9.4.0
Ubuntu 22.04 (ARM)
Kernel: Depends on container host
Compiler: gcc (Ubuntu 11.4.0-1ubuntu1~22.04) 11.4.0
RHEL9 (ARM)
Kernel: Depends on container host
Compiler: gcc 11.5.0 20240719 (Red Hat 11.5.0-2)
Ubuntu 24.04 (ARM)
Kernel: Depends on container host
Compiler: gcc (Ubuntu 13.3.0-6ubuntu2~24.04) 13.3.0
Ubuntu 20.04 ARM SVE
Kernel: Depends on container host
Compiler: gcc (Ubuntu 10.5.0-1ubuntu1~20.04) 10.5.0
To view detailed results, visit:
https://lab.dpdk.org/results/dashboard/patchsets/32939/
UNH-IOL DPDK Community Lab
To manage your email subscriptions, visit:
https://lab.dpdk.org/results/dashboard/preferences/subscriptions/
^ permalink raw reply [flat|nested] 30+ messages in thread
* |FAILURE| pw152750-152753 [PATCH] [RFC,4/4] net/cnxk: report link ty
[not found] <20250403070837.926292-4-ndabilpuram@marvell.com>
` (11 preceding siblings ...)
2025-04-03 9:37 ` |PENDING| " dpdklab
@ 2025-04-03 9:48 ` dpdklab
2025-04-03 9:52 ` dpdklab
` (16 subsequent siblings)
29 siblings, 0 replies; 30+ messages in thread
From: dpdklab @ 2025-04-03 9:48 UTC (permalink / raw)
To: Test Report; +Cc: dpdk-test-reports, Nithin Dabilpuram
Test-Label: iol-unit-arm64-testing
Test-Status: FAILURE
http://dpdk.org/patch/152753
_Testing issues_
Submitter: Nithin Dabilpuram <ndabilpuram@marvell.com>
Date: Thursday, April 03 2025 07:08:37
DPDK git baseline: Repo:dpdk
Branch: master
CommitID:b40c403777e93242a377c07ff51964480d40b51d
152750-152753 --> testing issues
Upstream job id: Generic-Unit-Test-DPDK#328594
Test environment and result as below:
+-----------------------------+----------------+--------------+------------------------------+---------------------------+
| Environment | dpdk_unit_test | lpm_autotest | cryptodev_sw_snow3g_autotest | cryptodev_sw_zuc_autotest |
+=============================+================+==============+==============================+===========================+
| CentOS Stream 9 (ARM) | FAIL | SKIPPED | SKIPPED | SKIPPED |
+-----------------------------+----------------+--------------+------------------------------+---------------------------+
| Fedora 40 (ARM) | PEND | SKIPPED | SKIPPED | SKIPPED |
+-----------------------------+----------------+--------------+------------------------------+---------------------------+
| 32-bit Ubuntu 22.04.4 (ARM) | PASS | SKIPPED | SKIPPED | SKIPPED |
+-----------------------------+----------------+--------------+------------------------------+---------------------------+
| CentOS Stream 10 (ARM) | PEND | SKIPPED | SKIPPED | SKIPPED |
+-----------------------------+----------------+--------------+------------------------------+---------------------------+
| Debian 12 (arm) | PEND | SKIPPED | PEND | PEND |
+-----------------------------+----------------+--------------+------------------------------+---------------------------+
| Fedora 40 (ARM Clang) | PEND | SKIPPED | SKIPPED | SKIPPED |
+-----------------------------+----------------+--------------+------------------------------+---------------------------+
| Fedora 41 (ARM) | PEND | SKIPPED | SKIPPED | SKIPPED |
+-----------------------------+----------------+--------------+------------------------------+---------------------------+
| Fedora 41 (ARM Clang) | PEND | SKIPPED | SKIPPED | SKIPPED |
+-----------------------------+----------------+--------------+------------------------------+---------------------------+
| Ubuntu 20.04 (ARM) | PEND | SKIPPED | SKIPPED | SKIPPED |
+-----------------------------+----------------+--------------+------------------------------+---------------------------+
| Ubuntu 22.04 (ARM) | PEND | SKIPPED | SKIPPED | SKIPPED |
+-----------------------------+----------------+--------------+------------------------------+---------------------------+
| RHEL9 (ARM) | PEND | SKIPPED | SKIPPED | SKIPPED |
+-----------------------------+----------------+--------------+------------------------------+---------------------------+
| Ubuntu 24.04 (ARM) | PEND | SKIPPED | SKIPPED | SKIPPED |
+-----------------------------+----------------+--------------+------------------------------+---------------------------+
| Ubuntu 20.04 ARM SVE | SKIPPED | PEND | SKIPPED | SKIPPED |
+-----------------------------+----------------+--------------+------------------------------+---------------------------+
==== Unit test summary for CentOS Stream 9 (ARM) (dpdk_unit_test): ====
ninja: Entering directory `/home-local/jenkins-local/jenkins-agent/workspace/Generic-Unit-Test-DPDK/dpdk/build'
ninja: no work to do.
1/119 DPDK:fast-tests / acl_autotest OK 5.39s
2/119 DPDK:fast-tests / alarm_autotest OK 1.15s
3/119 DPDK:fast-tests / argparse_autotest OK 0.15s
4/119 DPDK:fast-tests / atomic_autotest OK 4.20s
5/119 DPDK:fast-tests / bitcount_autotest OK 0.17s
6/119 DPDK:fast-tests / bitmap_autotest OK 0.15s
7/119 DPDK:fast-tests / bitops_autotest OK 1.65s
8/119 DPDK:fast-tests / bitratestats_autotest OK 0.16s
9/119 DPDK:fast-tests / bitset_autotest OK 2.57s
10/119 DPDK:fast-tests / bpf_autotest OK 0.16s
11/119 DPDK:fast-tests / bpf_convert_autotest OK 0.16s
12/119 DPDK:fast-tests / byteorder_autotest OK 0.15s
13/119 DPDK:fast-tests / cfgfile_autotest OK 0.15s
14/119 DPDK:fast-tests / cksum_autotest OK 0.15s
15/119 DPDK:fast-tests / cmdline_autotest OK 0.15s
16/119 DPDK:fast-tests / common_autotest OK 0.90s
17/119 DPDK:fast-tests / compressdev_autotest SKIP 0.08s exit status 77
18/119 DPDK:fast-tests / cpuflags_autotest OK 0.17s
19/119 DPDK:fast-tests / crc_autotest OK 0.15s
20/119 DPDK:fast-tests / user_delay_us OK 0.15s
21/119 DPDK:fast-tests / debug_autotest OK 0.88s
22/119 DPDK:fast-tests / devargs_autotest OK 0.16s
23/119 DPDK:fast-tests / dispatcher_autotest OK 2.40s
24/119 DPDK:fast-tests / distributor_autotest OK 0.80s
25/119 DPDK:fast-tests / eal_flags_c_opt_autotest OK 1.64s
26/119 DPDK:fast-tests / eal_flags_main_opt_autotest OK 0.42s
27/119 DPDK:fast-tests / eal_flags_n_opt_autotest OK 0.38s
28/119 DPDK:fast-tests / eal_flags_hpet_autotest OK 0.22s
29/119 DPDK:fast-tests / eal_flags_no_huge_autotest OK 0.43s
30/119 DPDK:fast-tests / eal_flags_a_opt_autotest OK 0.60s
31/119 DPDK:fast-tests / eal_flags_b_opt_autotest OK 0.48s
32/119 DPDK:fast-tests / eal_flags_vdev_opt_autotest OK 0.35s
33/119 DPDK:fast-tests / eal_flags_r_opt_autotest OK 0.35s
34/119 DPDK:fast-tests / eal_flags_mem_autotest OK 0.53s
35/119 DPDK:fast-tests / eal_flags_file_prefix_autotest OK 1.52s
36/119 DPDK:fast-tests / eal_flags_misc_autotest OK 1.95s
37/119 DPDK:fast-tests / eal_fs_autotest OK 0.17s
38/119 DPDK:fast-tests / errno_autotest OK 0.15s
39/119 DPDK:fast-tests / ethdev_link_status FAIL 0.15s (exit status 255 or signal 127 SIGinvalid)
>>> DPDK_TEST=ethdev_link_status MALLOC_PERTURB_=178 /home-local/jenkins-local/jenkins-agent/workspace/Generic-Unit-Test-DPDK/dpdk/build/app/dpdk-test --no-huge -m 2048
40/119 DPDK:fast-tests / event_eth_tx_adapter_autotest OK 1.18s
41/119 DPDK:fast-tests / event_ring_autotest OK 0.17s
42/119 DPDK:fast-tests / eventdev_common_autotest OK 0.16s
43/119 DPDK:fast-tests / eventdev_selftest_sw OK 6.99s
44/119 DPDK:fast-tests / fbarray_autotest OK 0.16s
45/119 DPDK:fast-tests / fib_autotest OK 0.87s
46/119 DPDK:fast-tests / fib6_autotest OK 0.80s
47/119 DPDK:fast-tests / func_reentrancy_autotest OK 0.74s
48/119 DPDK:fast-tests / graph_autotest OK 0.17s
49/119 DPDK:fast-tests / node_list_dump OK 0.15s
50/119 DPDK:fast-tests / hash_autotest OK 0.51s
51/119 DPDK:fast-tests / hash_readwrite_func_autotest OK 7.09s
52/119 DPDK:fast-tests / interrupt_autotest OK 1.20s
53/119 DPDK:fast-tests / ipfrag_autotest OK 0.09s
54/119 DPDK:fast-tests / ipsec_autotest SKIP 0.17s exit status 77
55/119 DPDK:fast-tests / kvargs_autotest OK 0.15s
56/119 DPDK:fast-tests / latencystats_autotest OK 0.16s
57/119 DPDK:fast-tests / lcore_var_autotest OK 0.75s
58/119 DPDK:fast-tests / lcores_autotest OK 3.26s
59/119 DPDK:fast-tests / logs_autotest OK 0.15s
60/119 DPDK:fast-tests / lpm_autotest OK 1.57s
61/119 DPDK:fast-tests / lpm6_autotest OK 4.75s
62/119 DPDK:fast-tests / malloc_autotest OK 0.43s
63/119 DPDK:fast-tests / mbuf_autotest OK 5.11s
64/119 DPDK:fast-tests / mcslock_autotest OK 0.88s
65/119 DPDK:fast-tests / member_autotest OK 1.39s
66/119 DPDK:fast-tests / memcpy_autotest OK 5.64s
67/119 DPDK:fast-tests / memory_autotest OK 0.09s
68/119 DPDK:fast-tests / mempool_autotest OK 0.43s
69/119 DPDK:fast-tests / memzone_autotest OK 0.10s
70/119 DPDK:fast-tests / meter_autotest OK 0.17s
71/119 DPDK:fast-tests / metrics_autotest OK 0.15s
72/119 DPDK:fast-tests / multiprocess_autotest OK 0.33s
73/119 DPDK:fast-tests / net_ether_autotest OK 0.99s
74/119 DPDK:fast-tests / net_ipv6_autotest OK 0.15s
75/119 DPDK:fast-tests / pcapng_autotest OK 6.49s
76/119 DPDK:fast-tests / pdcp_autotest SKIP 0.08s exit status 77
77/119 DPDK:fast-tests / pdump_autotest OK 0.44s
78/119 DPDK:fast-tests / per_lcore_autotest OK 0.25s
79/119 DPDK:fast-tests / pflock_autotest OK 0.48s
80/119 DPDK:fast-tests / pie_autotest OK 0.15s
81/119 DPDK:fast-tests / ring_pmd_autotest OK 0.16s
82/119 DPDK:fast-tests / power_autotest OK 0.15s
83/119 DPDK:fast-tests / power_cpufreq_autotest SKIP 0.09s exit status 77
84/119 DPDK:fast-tests / power_intel_uncore_autotest SKIP 0.17s exit status 77
85/119 DPDK:fast-tests / power_kvm_vm_autotest SKIP 0.09s exit status 77
86/119 DPDK:fast-tests / prefetch_autotest OK 0.17s
87/119 DPDK:fast-tests / ptr_compress_autotest OK 0.15s
88/119 DPDK:fast-tests / rawdev_autotest OK 0.15s
89/119 DPDK:fast-tests / rcu_qsbr_autotest OK 0.63s
90/119 DPDK:fast-tests / reorder_autotest OK 0.41s
91/119 DPDK:fast-tests / rib_autotest OK 3.94s
92/119 DPDK:fast-tests / rib6_autotest OK 3.87s
93/119 DPDK:fast-tests / ring_autotest OK 0.18s
94/119 DPDK:fast-tests / rwlock_test1_autotest OK 0.47s
95/119 DPDK:fast-tests / rwlock_rda_autotest OK 5.15s
96/119 DPDK:fast-tests / rwlock_rds_wrm_autotest OK 5.19s
97/119 DPDK:fast-tests / rwlock_rde_wro_autotest OK 5.15s
98/119 DPDK:fast-tests / sched_autotest OK 0.16s
99/119 DPDK:fast-tests / security_autotest OK 0.09s
100/119 DPDK:fast-tests / seqlock_autotest OK 2.17s
101/119 DPDK:fast-tests / service_autotest OK 2.86s
102/119 DPDK:fast-tests / soring_autotest OK 0.16s
103/119 DPDK:fast-tests / spinlock_autotest OK 0.19s
104/119 DPDK:fast-tests / stack_autotest OK 0.34s
105/119 DPDK:fast-tests / stack_lf_autotest OK 0.33s
106/119 DPDK:fast-tests / string_autotest OK 0.17s
107/119 DPDK:fast-tests / table_autotest OK 7.05s
108/119 DPDK:fast-tests / tailq_autotest OK 0.19s
109/119 DPDK:fast-tests / telemetry_data_autotest OK 0.16s
110/119 DPDK:fast-tests / telemetry_json_autotest OK 0.15s
111/119 DPDK:fast-tests / thash_autotest OK 0.17s
112/119 DPDK:fast-tests / threads_autotest OK 0.34s
113/119 DPDK:fast-tests / ticketlock_autotest OK 0.20s
114/119 DPDK:fast-tests / timer_autotest OK 2.81s
115/119 DPDK:fast-tests / trace_autotest OK 0.18s
116/119 DPDK:fast-tests / trace_autotest_with_traces OK 0.17s
117/119 DPDK:fast-tests / vdev_autotest OK 0.16s
118/119 DPDK:fast-tests / version_autotest OK 0.15s
119/119 DPDK:fast-tests / telemetry_all SKIP 0.01s exit status 77
Ok: 111
Expected Fail: 0
Fail: 1
Unexpected Pass: 0
Skipped: 7
Timeout: 0
Full log written to /home-local/jenkins-local/jenkins-agent/workspace/Generic-Unit-Test-DPDK/dpdk/build/meson-logs/testlog.txt
Test log output from the failed test ethdev_link_status:
Sorry, we were not able to find the logs for this test.
Download the log output from the CI site for this test run.
==== End log output ====
CentOS Stream 9 (ARM)
Kernel: Depends on container host
Compiler: gcc 11.5.0 20240719 (Red Hat 11.5.0-2)
Fedora 40 (ARM)
Kernel: Depends on container host
Compiler: gcc 14.2.1 20240912 (Red Hat 14.2.1-3)
32-bit Ubuntu 22.04.4 (ARM)
Kernel: 5.15.83+ aarch64
Compiler: gcc (Ubuntu 11.4.0-1ubuntu1~22.04) 11.4.0
CentOS Stream 10 (ARM)
Kernel: Depends on container host
Compiler: gcc 14.2.1 20241104 (Red Hat 14.2.1-6)
Debian 12 (arm)
Kernel: Depends on container host
Compiler: gcc (Debian 12.2.0-14) 12.2.0
Fedora 40 (ARM Clang)
Kernel: Depends on container host
Compiler: clang 18.1.8 (Fedora 18.1.8-1.fc40)
Fedora 41 (ARM)
Kernel: Depends on container host
Compiler: gcc 14.2.1 20240912 (Red Hat 14.2.1-3)
Fedora 41 (ARM Clang)
Kernel: Depends on container host
Compiler: clang 19.1.5 (Fedora 19.1.5-1.fc41)
Ubuntu 20.04 (ARM)
Kernel: Depends on container host
Compiler: gcc (Ubuntu 9.4.0-1ubuntu1~20.04.2) 9.4.0
Ubuntu 22.04 (ARM)
Kernel: Depends on container host
Compiler: gcc (Ubuntu 11.4.0-1ubuntu1~22.04) 11.4.0
RHEL9 (ARM)
Kernel: Depends on container host
Compiler: gcc 11.5.0 20240719 (Red Hat 11.5.0-2)
Ubuntu 24.04 (ARM)
Kernel: Depends on container host
Compiler: gcc (Ubuntu 13.3.0-6ubuntu2~24.04) 13.3.0
Ubuntu 20.04 ARM SVE
Kernel: Depends on container host
Compiler: gcc (Ubuntu 10.5.0-1ubuntu1~20.04) 10.5.0
To view detailed results, visit:
https://lab.dpdk.org/results/dashboard/patchsets/32939/
UNH-IOL DPDK Community Lab
To manage your email subscriptions, visit:
https://lab.dpdk.org/results/dashboard/preferences/subscriptions/
^ permalink raw reply [flat|nested] 30+ messages in thread
* |FAILURE| pw152750-152753 [PATCH] [RFC,4/4] net/cnxk: report link ty
[not found] <20250403070837.926292-4-ndabilpuram@marvell.com>
` (12 preceding siblings ...)
2025-04-03 9:48 ` |FAILURE| " dpdklab
@ 2025-04-03 9:52 ` dpdklab
2025-04-03 9:53 ` dpdklab
` (15 subsequent siblings)
29 siblings, 0 replies; 30+ messages in thread
From: dpdklab @ 2025-04-03 9:52 UTC (permalink / raw)
To: Test Report; +Cc: dpdk-test-reports, Nithin Dabilpuram
Test-Label: iol-unit-arm64-testing
Test-Status: FAILURE
http://dpdk.org/patch/152753
_Testing issues_
Submitter: Nithin Dabilpuram <ndabilpuram@marvell.com>
Date: Thursday, April 03 2025 07:08:37
DPDK git baseline: Repo:dpdk
Branch: master
CommitID:b40c403777e93242a377c07ff51964480d40b51d
152750-152753 --> testing issues
Upstream job id: Generic-Unit-Test-DPDK#328600
Test environment and result as below:
+-----------------------------+----------------+--------------+------------------------------+---------------------------+
| Environment | dpdk_unit_test | lpm_autotest | cryptodev_sw_snow3g_autotest | cryptodev_sw_zuc_autotest |
+=============================+================+==============+==============================+===========================+
| CentOS Stream 9 (ARM) | FAIL | SKIPPED | SKIPPED | SKIPPED |
+-----------------------------+----------------+--------------+------------------------------+---------------------------+
| Fedora 40 (ARM) | FAIL | SKIPPED | SKIPPED | SKIPPED |
+-----------------------------+----------------+--------------+------------------------------+---------------------------+
| 32-bit Ubuntu 22.04.4 (ARM) | PASS | SKIPPED | SKIPPED | SKIPPED |
+-----------------------------+----------------+--------------+------------------------------+---------------------------+
| CentOS Stream 10 (ARM) | PEND | SKIPPED | SKIPPED | SKIPPED |
+-----------------------------+----------------+--------------+------------------------------+---------------------------+
| Debian 12 (arm) | PEND | SKIPPED | PEND | PEND |
+-----------------------------+----------------+--------------+------------------------------+---------------------------+
| Fedora 40 (ARM Clang) | PEND | SKIPPED | SKIPPED | SKIPPED |
+-----------------------------+----------------+--------------+------------------------------+---------------------------+
| Fedora 41 (ARM) | PEND | SKIPPED | SKIPPED | SKIPPED |
+-----------------------------+----------------+--------------+------------------------------+---------------------------+
| Fedora 41 (ARM Clang) | PEND | SKIPPED | SKIPPED | SKIPPED |
+-----------------------------+----------------+--------------+------------------------------+---------------------------+
| Ubuntu 20.04 (ARM) | PEND | SKIPPED | SKIPPED | SKIPPED |
+-----------------------------+----------------+--------------+------------------------------+---------------------------+
| Ubuntu 22.04 (ARM) | PEND | SKIPPED | SKIPPED | SKIPPED |
+-----------------------------+----------------+--------------+------------------------------+---------------------------+
| RHEL9 (ARM) | PEND | SKIPPED | SKIPPED | SKIPPED |
+-----------------------------+----------------+--------------+------------------------------+---------------------------+
| Ubuntu 24.04 (ARM) | PEND | SKIPPED | SKIPPED | SKIPPED |
+-----------------------------+----------------+--------------+------------------------------+---------------------------+
| Ubuntu 20.04 ARM SVE | SKIPPED | PEND | SKIPPED | SKIPPED |
+-----------------------------+----------------+--------------+------------------------------+---------------------------+
==== Unit test summary for Fedora 40 (ARM) (dpdk_unit_test): ====
ninja: Entering directory `/home-local/jenkins-local/jenkins-agent/workspace/Generic-Unit-Test-DPDK/dpdk/build'
ninja: no work to do.
1/119 DPDK:fast-tests / acl_autotest OK 4.02s
2/119 DPDK:fast-tests / alarm_autotest OK 1.16s
3/119 DPDK:fast-tests / argparse_autotest OK 0.15s
4/119 DPDK:fast-tests / atomic_autotest OK 4.07s
5/119 DPDK:fast-tests / bitcount_autotest OK 0.17s
6/119 DPDK:fast-tests / bitmap_autotest OK 0.15s
7/119 DPDK:fast-tests / bitops_autotest OK 1.65s
8/119 DPDK:fast-tests / bitratestats_autotest OK 0.17s
9/119 DPDK:fast-tests / bitset_autotest OK 2.49s
10/119 DPDK:fast-tests / bpf_autotest OK 0.16s
11/119 DPDK:fast-tests / bpf_convert_autotest OK 0.16s
12/119 DPDK:fast-tests / byteorder_autotest OK 0.15s
13/119 DPDK:fast-tests / cfgfile_autotest OK 0.16s
14/119 DPDK:fast-tests / cksum_autotest OK 0.16s
15/119 DPDK:fast-tests / cmdline_autotest OK 0.16s
16/119 DPDK:fast-tests / common_autotest OK 1.03s
17/119 DPDK:fast-tests / compressdev_autotest SKIP 0.08s exit status 77
18/119 DPDK:fast-tests / cpuflags_autotest OK 0.17s
19/119 DPDK:fast-tests / crc_autotest OK 0.15s
20/119 DPDK:fast-tests / user_delay_us OK 0.15s
21/119 DPDK:fast-tests / debug_autotest OK 0.87s
22/119 DPDK:fast-tests / devargs_autotest OK 0.15s
23/119 DPDK:fast-tests / dispatcher_autotest OK 2.24s
24/119 DPDK:fast-tests / distributor_autotest OK 0.80s
25/119 DPDK:fast-tests / eal_flags_c_opt_autotest OK 1.57s
26/119 DPDK:fast-tests / eal_flags_main_opt_autotest OK 0.42s
27/119 DPDK:fast-tests / eal_flags_n_opt_autotest OK 0.38s
28/119 DPDK:fast-tests / eal_flags_hpet_autotest OK 0.22s
29/119 DPDK:fast-tests / eal_flags_no_huge_autotest OK 0.43s
30/119 DPDK:fast-tests / eal_flags_a_opt_autotest OK 0.60s
31/119 DPDK:fast-tests / eal_flags_b_opt_autotest OK 0.48s
32/119 DPDK:fast-tests / eal_flags_vdev_opt_autotest OK 0.36s
33/119 DPDK:fast-tests / eal_flags_r_opt_autotest OK 0.35s
34/119 DPDK:fast-tests / eal_flags_mem_autotest OK 0.53s
35/119 DPDK:fast-tests / eal_flags_file_prefix_autotest OK 1.54s
36/119 DPDK:fast-tests / eal_flags_misc_autotest OK 1.96s
37/119 DPDK:fast-tests / eal_fs_autotest OK 0.18s
38/119 DPDK:fast-tests / errno_autotest OK 0.19s
39/119 DPDK:fast-tests / ethdev_link_status FAIL 0.16s (exit status 255 or signal 127 SIGinvalid)
>>> DPDK_TEST=ethdev_link_status MALLOC_PERTURB_=154 /home-local/jenkins-local/jenkins-agent/workspace/Generic-Unit-Test-DPDK/dpdk/build/app/dpdk-test --no-huge -m 2048
40/119 DPDK:fast-tests / event_eth_tx_adapter_autotest OK 1.11s
41/119 DPDK:fast-tests / event_ring_autotest OK 0.18s
42/119 DPDK:fast-tests / eventdev_common_autotest OK 0.16s
43/119 DPDK:fast-tests / eventdev_selftest_sw OK 7.46s
44/119 DPDK:fast-tests / fbarray_autotest OK 0.16s
45/119 DPDK:fast-tests / fib_autotest OK 0.87s
46/119 DPDK:fast-tests / fib6_autotest OK 0.87s
47/119 DPDK:fast-tests / func_reentrancy_autotest OK 0.76s
48/119 DPDK:fast-tests / graph_autotest OK 0.17s
49/119 DPDK:fast-tests / node_list_dump OK 0.16s
50/119 DPDK:fast-tests / hash_autotest OK 0.50s
51/119 DPDK:fast-tests / hash_readwrite_func_autotest OK 7.28s
52/119 DPDK:fast-tests / interrupt_autotest OK 1.19s
53/119 DPDK:fast-tests / ipfrag_autotest OK 0.09s
54/119 DPDK:fast-tests / ipsec_autotest SKIP 0.17s exit status 77
55/119 DPDK:fast-tests / kvargs_autotest OK 0.15s
56/119 DPDK:fast-tests / latencystats_autotest OK 0.16s
57/119 DPDK:fast-tests / lcore_var_autotest OK 0.74s
58/119 DPDK:fast-tests / lcores_autotest OK 3.07s
59/119 DPDK:fast-tests / logs_autotest OK 0.15s
60/119 DPDK:fast-tests / lpm_autotest OK 1.57s
61/119 DPDK:fast-tests / lpm6_autotest OK 4.77s
62/119 DPDK:fast-tests / malloc_autotest OK 0.43s
63/119 DPDK:fast-tests / mbuf_autotest OK 3.51s
64/119 DPDK:fast-tests / mcslock_autotest OK 0.67s
65/119 DPDK:fast-tests / member_autotest OK 1.36s
66/119 DPDK:fast-tests / memcpy_autotest OK 5.28s
67/119 DPDK:fast-tests / memory_autotest OK 0.09s
68/119 DPDK:fast-tests / mempool_autotest OK 0.43s
69/119 DPDK:fast-tests / memzone_autotest OK 0.10s
70/119 DPDK:fast-tests / meter_autotest OK 0.18s
71/119 DPDK:fast-tests / metrics_autotest OK 0.16s
72/119 DPDK:fast-tests / multiprocess_autotest OK 0.34s
73/119 DPDK:fast-tests / net_ether_autotest OK 0.91s
74/119 DPDK:fast-tests / net_ipv6_autotest OK 0.16s
75/119 DPDK:fast-tests / pcapng_autotest OK 6.13s
76/119 DPDK:fast-tests / pdcp_autotest SKIP 0.08s exit status 77
77/119 DPDK:fast-tests / pdump_autotest OK 0.43s
78/119 DPDK:fast-tests / per_lcore_autotest OK 0.25s
79/119 DPDK:fast-tests / pflock_autotest OK 0.48s
80/119 DPDK:fast-tests / pie_autotest OK 0.16s
81/119 DPDK:fast-tests / ring_pmd_autotest OK 0.16s
82/119 DPDK:fast-tests / power_autotest OK 0.15s
83/119 DPDK:fast-tests / power_cpufreq_autotest SKIP 0.09s exit status 77
84/119 DPDK:fast-tests / power_intel_uncore_autotest SKIP 0.18s exit status 77
85/119 DPDK:fast-tests / power_kvm_vm_autotest SKIP 0.09s exit status 77
86/119 DPDK:fast-tests / prefetch_autotest OK 0.17s
87/119 DPDK:fast-tests / ptr_compress_autotest OK 0.15s
88/119 DPDK:fast-tests / rawdev_autotest OK 0.15s
89/119 DPDK:fast-tests / rcu_qsbr_autotest OK 0.63s
90/119 DPDK:fast-tests / reorder_autotest OK 0.41s
91/119 DPDK:fast-tests / rib_autotest OK 3.87s
92/119 DPDK:fast-tests / rib6_autotest OK 3.87s
93/119 DPDK:fast-tests / ring_autotest OK 0.18s
94/119 DPDK:fast-tests / rwlock_test1_autotest OK 0.48s
95/119 DPDK:fast-tests / rwlock_rda_autotest OK 5.15s
96/119 DPDK:fast-tests / rwlock_rds_wrm_autotest OK 5.15s
97/119 DPDK:fast-tests / rwlock_rde_wro_autotest OK 5.16s
98/119 DPDK:fast-tests / sched_autotest OK 0.17s
99/119 DPDK:fast-tests / security_autotest OK 0.09s
100/119 DPDK:fast-tests / seqlock_autotest OK 2.18s
101/119 DPDK:fast-tests / service_autotest OK 2.86s
102/119 DPDK:fast-tests / soring_autotest OK 0.16s
103/119 DPDK:fast-tests / spinlock_autotest OK 0.19s
104/119 DPDK:fast-tests / stack_autotest OK 0.31s
105/119 DPDK:fast-tests / stack_lf_autotest OK 0.33s
106/119 DPDK:fast-tests / string_autotest OK 0.18s
107/119 DPDK:fast-tests / table_autotest OK 7.02s
108/119 DPDK:fast-tests / tailq_autotest OK 0.16s
109/119 DPDK:fast-tests / telemetry_data_autotest OK 0.16s
110/119 DPDK:fast-tests / telemetry_json_autotest OK 0.15s
111/119 DPDK:fast-tests / thash_autotest OK 0.17s
112/119 DPDK:fast-tests / threads_autotest OK 0.33s
113/119 DPDK:fast-tests / ticketlock_autotest OK 0.20s
114/119 DPDK:fast-tests / timer_autotest OK 2.79s
115/119 DPDK:fast-tests / trace_autotest OK 0.21s
116/119 DPDK:fast-tests / trace_autotest_with_traces OK 0.20s
117/119 DPDK:fast-tests / vdev_autotest OK 0.15s
118/119 DPDK:fast-tests / version_autotest OK 0.15s
119/119 DPDK:fast-tests / telemetry_all SKIP 0.01s exit status 77
Ok: 111
Expected Fail: 0
Fail: 1
Unexpected Pass: 0
Skipped: 7
Timeout: 0
Full log written to /home-local/jenkins-local/jenkins-agent/workspace/Generic-Unit-Test-DPDK/dpdk/build/meson-logs/testlog.txt
Test log output from the failed test ethdev_link_status:
Sorry, we were not able to find the logs for this test.
Download the log output from the CI site for this test run.
==== End log output ====
CentOS Stream 9 (ARM)
Kernel: Depends on container host
Compiler: gcc 11.5.0 20240719 (Red Hat 11.5.0-2)
Fedora 40 (ARM)
Kernel: Depends on container host
Compiler: gcc 14.2.1 20240912 (Red Hat 14.2.1-3)
32-bit Ubuntu 22.04.4 (ARM)
Kernel: 5.15.83+ aarch64
Compiler: gcc (Ubuntu 11.4.0-1ubuntu1~22.04) 11.4.0
CentOS Stream 10 (ARM)
Kernel: Depends on container host
Compiler: gcc 14.2.1 20241104 (Red Hat 14.2.1-6)
Debian 12 (arm)
Kernel: Depends on container host
Compiler: gcc (Debian 12.2.0-14) 12.2.0
Fedora 40 (ARM Clang)
Kernel: Depends on container host
Compiler: clang 18.1.8 (Fedora 18.1.8-1.fc40)
Fedora 41 (ARM)
Kernel: Depends on container host
Compiler: gcc 14.2.1 20240912 (Red Hat 14.2.1-3)
Fedora 41 (ARM Clang)
Kernel: Depends on container host
Compiler: clang 19.1.5 (Fedora 19.1.5-1.fc41)
Ubuntu 20.04 (ARM)
Kernel: Depends on container host
Compiler: gcc (Ubuntu 9.4.0-1ubuntu1~20.04.2) 9.4.0
Ubuntu 22.04 (ARM)
Kernel: Depends on container host
Compiler: gcc (Ubuntu 11.4.0-1ubuntu1~22.04) 11.4.0
RHEL9 (ARM)
Kernel: Depends on container host
Compiler: gcc 11.5.0 20240719 (Red Hat 11.5.0-2)
Ubuntu 24.04 (ARM)
Kernel: Depends on container host
Compiler: gcc (Ubuntu 13.3.0-6ubuntu2~24.04) 13.3.0
Ubuntu 20.04 ARM SVE
Kernel: Depends on container host
Compiler: gcc (Ubuntu 10.5.0-1ubuntu1~20.04) 10.5.0
To view detailed results, visit:
https://lab.dpdk.org/results/dashboard/patchsets/32939/
UNH-IOL DPDK Community Lab
To manage your email subscriptions, visit:
https://lab.dpdk.org/results/dashboard/preferences/subscriptions/
^ permalink raw reply [flat|nested] 30+ messages in thread
* |FAILURE| pw152750-152753 [PATCH] [RFC,4/4] net/cnxk: report link ty
[not found] <20250403070837.926292-4-ndabilpuram@marvell.com>
` (13 preceding siblings ...)
2025-04-03 9:52 ` dpdklab
@ 2025-04-03 9:53 ` dpdklab
2025-04-03 9:53 ` dpdklab
` (14 subsequent siblings)
29 siblings, 0 replies; 30+ messages in thread
From: dpdklab @ 2025-04-03 9:53 UTC (permalink / raw)
To: Test Report; +Cc: dpdk-test-reports, Nithin Dabilpuram
Test-Label: iol-unit-arm64-testing
Test-Status: FAILURE
http://dpdk.org/patch/152753
_Testing issues_
Submitter: Nithin Dabilpuram <ndabilpuram@marvell.com>
Date: Thursday, April 03 2025 07:08:37
DPDK git baseline: Repo:dpdk
Branch: master
CommitID:b40c403777e93242a377c07ff51964480d40b51d
152750-152753 --> testing issues
Upstream job id: Generic-Unit-Test-DPDK#328598
Test environment and result as below:
+-----------------------------+----------------+--------------+------------------------------+---------------------------+
| Environment | dpdk_unit_test | lpm_autotest | cryptodev_sw_snow3g_autotest | cryptodev_sw_zuc_autotest |
+=============================+================+==============+==============================+===========================+
| CentOS Stream 9 (ARM) | FAIL | SKIPPED | SKIPPED | SKIPPED |
+-----------------------------+----------------+--------------+------------------------------+---------------------------+
| Fedora 40 (ARM) | FAIL | SKIPPED | SKIPPED | SKIPPED |
+-----------------------------+----------------+--------------+------------------------------+---------------------------+
| 32-bit Ubuntu 22.04.4 (ARM) | PASS | SKIPPED | SKIPPED | SKIPPED |
+-----------------------------+----------------+--------------+------------------------------+---------------------------+
| CentOS Stream 10 (ARM) | FAIL | SKIPPED | SKIPPED | SKIPPED |
+-----------------------------+----------------+--------------+------------------------------+---------------------------+
| Debian 12 (arm) | FAIL | SKIPPED | PEND | PEND |
+-----------------------------+----------------+--------------+------------------------------+---------------------------+
| Fedora 40 (ARM Clang) | PEND | SKIPPED | SKIPPED | SKIPPED |
+-----------------------------+----------------+--------------+------------------------------+---------------------------+
| Fedora 41 (ARM) | PEND | SKIPPED | SKIPPED | SKIPPED |
+-----------------------------+----------------+--------------+------------------------------+---------------------------+
| Fedora 41 (ARM Clang) | PEND | SKIPPED | SKIPPED | SKIPPED |
+-----------------------------+----------------+--------------+------------------------------+---------------------------+
| Ubuntu 20.04 (ARM) | PEND | SKIPPED | SKIPPED | SKIPPED |
+-----------------------------+----------------+--------------+------------------------------+---------------------------+
| Ubuntu 22.04 (ARM) | PEND | SKIPPED | SKIPPED | SKIPPED |
+-----------------------------+----------------+--------------+------------------------------+---------------------------+
| RHEL9 (ARM) | PEND | SKIPPED | SKIPPED | SKIPPED |
+-----------------------------+----------------+--------------+------------------------------+---------------------------+
| Ubuntu 24.04 (ARM) | PEND | SKIPPED | SKIPPED | SKIPPED |
+-----------------------------+----------------+--------------+------------------------------+---------------------------+
| Ubuntu 20.04 ARM SVE | SKIPPED | PEND | SKIPPED | SKIPPED |
+-----------------------------+----------------+--------------+------------------------------+---------------------------+
==== Unit test summary for Debian 12 (arm) (dpdk_unit_test): ====
ninja: Entering directory `/home-local/jenkins-local/jenkins-agent/workspace/Generic-Unit-Test-DPDK/dpdk/build'
ninja: no work to do.
1/119 DPDK:fast-tests / acl_autotest OK 4.24s
2/119 DPDK:fast-tests / alarm_autotest OK 1.17s
3/119 DPDK:fast-tests / argparse_autotest OK 0.17s
4/119 DPDK:fast-tests / atomic_autotest OK 4.64s
5/119 DPDK:fast-tests / bitcount_autotest OK 0.18s
6/119 DPDK:fast-tests / bitmap_autotest OK 0.16s
7/119 DPDK:fast-tests / bitops_autotest OK 1.66s
8/119 DPDK:fast-tests / bitratestats_autotest OK 0.17s
9/119 DPDK:fast-tests / bitset_autotest OK 2.65s
10/119 DPDK:fast-tests / bpf_autotest OK 0.16s
11/119 DPDK:fast-tests / bpf_convert_autotest OK 0.17s
12/119 DPDK:fast-tests / byteorder_autotest OK 0.16s
13/119 DPDK:fast-tests / cfgfile_autotest OK 0.16s
14/119 DPDK:fast-tests / cksum_autotest OK 0.16s
15/119 DPDK:fast-tests / cmdline_autotest OK 0.16s
16/119 DPDK:fast-tests / common_autotest OK 1.06s
17/119 DPDK:fast-tests / compressdev_autotest SKIP 0.09s exit status 77
18/119 DPDK:fast-tests / cpuflags_autotest OK 0.18s
19/119 DPDK:fast-tests / crc_autotest OK 0.16s
20/119 DPDK:fast-tests / user_delay_us OK 0.16s
21/119 DPDK:fast-tests / debug_autotest OK 1.43s
22/119 DPDK:fast-tests / devargs_autotest OK 0.17s
23/119 DPDK:fast-tests / dispatcher_autotest OK 2.54s
24/119 DPDK:fast-tests / distributor_autotest OK 0.80s
25/119 DPDK:fast-tests / eal_flags_c_opt_autotest OK 2.33s
26/119 DPDK:fast-tests / eal_flags_main_opt_autotest OK 0.47s
27/119 DPDK:fast-tests / eal_flags_n_opt_autotest OK 0.42s
28/119 DPDK:fast-tests / eal_flags_hpet_autotest OK 0.24s
29/119 DPDK:fast-tests / eal_flags_no_huge_autotest OK 0.48s
30/119 DPDK:fast-tests / eal_flags_a_opt_autotest OK 0.68s
31/119 DPDK:fast-tests / eal_flags_b_opt_autotest OK 0.54s
32/119 DPDK:fast-tests / eal_flags_vdev_opt_autotest OK 0.40s
33/119 DPDK:fast-tests / eal_flags_r_opt_autotest OK 0.39s
34/119 DPDK:fast-tests / eal_flags_mem_autotest OK 0.60s
35/119 DPDK:fast-tests / eal_flags_file_prefix_autotest OK 1.65s
36/119 DPDK:fast-tests / eal_flags_misc_autotest OK 2.20s
37/119 DPDK:fast-tests / eal_fs_autotest OK 0.18s
38/119 DPDK:fast-tests / errno_autotest OK 0.16s
39/119 DPDK:fast-tests / ethdev_link_status FAIL 0.16s (exit status 255 or signal 127 SIGinvalid)
>>> DPDK_TEST=ethdev_link_status MALLOC_PERTURB_=143 /home-local/jenkins-local/jenkins-agent/workspace/Generic-Unit-Test-DPDK/dpdk/build/app/dpdk-test --no-huge -m 2048
40/119 DPDK:fast-tests / event_eth_tx_adapter_autotest OK 1.09s
41/119 DPDK:fast-tests / event_ring_autotest OK 0.18s
42/119 DPDK:fast-tests / eventdev_common_autotest OK 0.16s
43/119 DPDK:fast-tests / eventdev_selftest_sw OK 10.20s
44/119 DPDK:fast-tests / fbarray_autotest OK 0.16s
45/119 DPDK:fast-tests / fib_autotest OK 0.95s
46/119 DPDK:fast-tests / fib6_autotest OK 0.84s
47/119 DPDK:fast-tests / func_reentrancy_autotest OK 0.76s
48/119 DPDK:fast-tests / graph_autotest OK 0.18s
49/119 DPDK:fast-tests / node_list_dump OK 0.16s
50/119 DPDK:fast-tests / hash_autotest OK 0.50s
51/119 DPDK:fast-tests / hash_readwrite_func_autotest OK 7.27s
52/119 DPDK:fast-tests / interrupt_autotest OK 1.20s
53/119 DPDK:fast-tests / ipfrag_autotest OK 0.10s
54/119 DPDK:fast-tests / ipsec_autotest SKIP 0.18s exit status 77
55/119 DPDK:fast-tests / kvargs_autotest OK 0.16s
56/119 DPDK:fast-tests / latencystats_autotest OK 0.17s
57/119 DPDK:fast-tests / lcore_var_autotest OK 0.68s
58/119 DPDK:fast-tests / lcores_autotest OK 3.50s
59/119 DPDK:fast-tests / logs_autotest OK 0.16s
60/119 DPDK:fast-tests / lpm_autotest OK 1.68s
61/119 DPDK:fast-tests / lpm6_autotest OK 4.91s
62/119 DPDK:fast-tests / malloc_autotest OK 0.43s
63/119 DPDK:fast-tests / mbuf_autotest OK 4.62s
64/119 DPDK:fast-tests / mcslock_autotest OK 0.85s
65/119 DPDK:fast-tests / member_autotest OK 1.44s
66/119 DPDK:fast-tests / memcpy_autotest OK 6.16s
67/119 DPDK:fast-tests / memory_autotest OK 0.10s
68/119 DPDK:fast-tests / mempool_autotest OK 0.51s
69/119 DPDK:fast-tests / memzone_autotest OK 0.11s
70/119 DPDK:fast-tests / meter_autotest OK 0.18s
71/119 DPDK:fast-tests / metrics_autotest OK 0.17s
72/119 DPDK:fast-tests / multiprocess_autotest OK 0.38s
73/119 DPDK:fast-tests / net_ether_autotest OK 0.97s
74/119 DPDK:fast-tests / net_ipv6_autotest OK 0.16s
75/119 DPDK:fast-tests / pcapng_autotest OK 5.76s
76/119 DPDK:fast-tests / pdcp_autotest SKIP 0.09s exit status 77
77/119 DPDK:fast-tests / pdump_autotest OK 0.55s
78/119 DPDK:fast-tests / per_lcore_autotest OK 0.26s
79/119 DPDK:fast-tests / pflock_autotest OK 0.49s
80/119 DPDK:fast-tests / pie_autotest OK 0.16s
81/119 DPDK:fast-tests / ring_pmd_autotest OK 0.17s
82/119 DPDK:fast-tests / power_autotest OK 0.16s
83/119 DPDK:fast-tests / power_cpufreq_autotest SKIP 0.09s exit status 77
84/119 DPDK:fast-tests / power_intel_uncore_autotest SKIP 0.18s exit status 77
85/119 DPDK:fast-tests / power_kvm_vm_autotest SKIP 0.09s exit status 77
86/119 DPDK:fast-tests / prefetch_autotest OK 0.18s
87/119 DPDK:fast-tests / ptr_compress_autotest OK 0.16s
88/119 DPDK:fast-tests / rawdev_autotest OK 0.16s
89/119 DPDK:fast-tests / rcu_qsbr_autotest OK 0.63s
90/119 DPDK:fast-tests / reorder_autotest OK 0.43s
91/119 DPDK:fast-tests / rib_autotest OK 4.02s
92/119 DPDK:fast-tests / rib6_autotest OK 3.99s
93/119 DPDK:fast-tests / ring_autotest OK 0.19s
94/119 DPDK:fast-tests / rwlock_test1_autotest OK 0.50s
95/119 DPDK:fast-tests / rwlock_rda_autotest OK 5.16s
96/119 DPDK:fast-tests / rwlock_rds_wrm_autotest OK 5.20s
97/119 DPDK:fast-tests / rwlock_rde_wro_autotest OK 5.16s
98/119 DPDK:fast-tests / sched_autotest OK 0.18s
99/119 DPDK:fast-tests / security_autotest OK 0.10s
100/119 DPDK:fast-tests / seqlock_autotest OK 2.19s
101/119 DPDK:fast-tests / service_autotest OK 2.87s
102/119 DPDK:fast-tests / soring_autotest OK 0.17s
103/119 DPDK:fast-tests / spinlock_autotest OK 0.20s
104/119 DPDK:fast-tests / stack_autotest OK 0.37s
105/119 DPDK:fast-tests / stack_lf_autotest OK 0.34s
106/119 DPDK:fast-tests / string_autotest OK 0.19s
107/119 DPDK:fast-tests / table_autotest OK 7.12s
108/119 DPDK:fast-tests / tailq_autotest OK 0.17s
109/119 DPDK:fast-tests / telemetry_data_autotest OK 0.16s
110/119 DPDK:fast-tests / telemetry_json_autotest OK 0.16s
111/119 DPDK:fast-tests / thash_autotest OK 0.18s
112/119 DPDK:fast-tests / threads_autotest OK 0.34s
113/119 DPDK:fast-tests / ticketlock_autotest OK 0.20s
114/119 DPDK:fast-tests / timer_autotest OK 2.86s
115/119 DPDK:fast-tests / trace_autotest OK 0.19s
116/119 DPDK:fast-tests / trace_autotest_with_traces OK 0.18s
117/119 DPDK:fast-tests / vdev_autotest OK 0.16s
118/119 DPDK:fast-tests / version_autotest OK 0.16s
119/119 DPDK:fast-tests / telemetry_all SKIP 0.04s exit status 77
Ok: 111
Expected Fail: 0
Fail: 1
Unexpected Pass: 0
Skipped: 7
Timeout: 0
Full log written to /home-local/jenkins-local/jenkins-agent/workspace/Generic-Unit-Test-DPDK/dpdk/build/meson-logs/testlog.txt
Test log output from the failed test ethdev_link_status:
Sorry, we were not able to find the logs for this test.
Download the log output from the CI site for this test run.
==== End log output ====
CentOS Stream 9 (ARM)
Kernel: Depends on container host
Compiler: gcc 11.5.0 20240719 (Red Hat 11.5.0-2)
Fedora 40 (ARM)
Kernel: Depends on container host
Compiler: gcc 14.2.1 20240912 (Red Hat 14.2.1-3)
32-bit Ubuntu 22.04.4 (ARM)
Kernel: 5.15.83+ aarch64
Compiler: gcc (Ubuntu 11.4.0-1ubuntu1~22.04) 11.4.0
CentOS Stream 10 (ARM)
Kernel: Depends on container host
Compiler: gcc 14.2.1 20241104 (Red Hat 14.2.1-6)
Debian 12 (arm)
Kernel: Depends on container host
Compiler: gcc (Debian 12.2.0-14) 12.2.0
Fedora 40 (ARM Clang)
Kernel: Depends on container host
Compiler: clang 18.1.8 (Fedora 18.1.8-1.fc40)
Fedora 41 (ARM)
Kernel: Depends on container host
Compiler: gcc 14.2.1 20240912 (Red Hat 14.2.1-3)
Fedora 41 (ARM Clang)
Kernel: Depends on container host
Compiler: clang 19.1.5 (Fedora 19.1.5-1.fc41)
Ubuntu 20.04 (ARM)
Kernel: Depends on container host
Compiler: gcc (Ubuntu 9.4.0-1ubuntu1~20.04.2) 9.4.0
Ubuntu 22.04 (ARM)
Kernel: Depends on container host
Compiler: gcc (Ubuntu 11.4.0-1ubuntu1~22.04) 11.4.0
RHEL9 (ARM)
Kernel: Depends on container host
Compiler: gcc 11.5.0 20240719 (Red Hat 11.5.0-2)
Ubuntu 24.04 (ARM)
Kernel: Depends on container host
Compiler: gcc (Ubuntu 13.3.0-6ubuntu2~24.04) 13.3.0
Ubuntu 20.04 ARM SVE
Kernel: Depends on container host
Compiler: gcc (Ubuntu 10.5.0-1ubuntu1~20.04) 10.5.0
To view detailed results, visit:
https://lab.dpdk.org/results/dashboard/patchsets/32939/
UNH-IOL DPDK Community Lab
To manage your email subscriptions, visit:
https://lab.dpdk.org/results/dashboard/preferences/subscriptions/
^ permalink raw reply [flat|nested] 30+ messages in thread
* |FAILURE| pw152750-152753 [PATCH] [RFC,4/4] net/cnxk: report link ty
[not found] <20250403070837.926292-4-ndabilpuram@marvell.com>
` (14 preceding siblings ...)
2025-04-03 9:53 ` dpdklab
@ 2025-04-03 9:53 ` dpdklab
2025-04-03 9:58 ` dpdklab
` (13 subsequent siblings)
29 siblings, 0 replies; 30+ messages in thread
From: dpdklab @ 2025-04-03 9:53 UTC (permalink / raw)
To: Test Report; +Cc: dpdk-test-reports, Nithin Dabilpuram
Test-Label: iol-unit-arm64-testing
Test-Status: FAILURE
http://dpdk.org/patch/152753
_Testing issues_
Submitter: Nithin Dabilpuram <ndabilpuram@marvell.com>
Date: Thursday, April 03 2025 07:08:37
DPDK git baseline: Repo:dpdk
Branch: master
CommitID:b40c403777e93242a377c07ff51964480d40b51d
152750-152753 --> testing issues
Upstream job id: Generic-Unit-Test-DPDK#328596
Test environment and result as below:
+-----------------------------+----------------+--------------+------------------------------+---------------------------+
| Environment | dpdk_unit_test | lpm_autotest | cryptodev_sw_snow3g_autotest | cryptodev_sw_zuc_autotest |
+=============================+================+==============+==============================+===========================+
| CentOS Stream 9 (ARM) | FAIL | SKIPPED | SKIPPED | SKIPPED |
+-----------------------------+----------------+--------------+------------------------------+---------------------------+
| Fedora 40 (ARM) | FAIL | SKIPPED | SKIPPED | SKIPPED |
+-----------------------------+----------------+--------------+------------------------------+---------------------------+
| 32-bit Ubuntu 22.04.4 (ARM) | PASS | SKIPPED | SKIPPED | SKIPPED |
+-----------------------------+----------------+--------------+------------------------------+---------------------------+
| CentOS Stream 10 (ARM) | FAIL | SKIPPED | SKIPPED | SKIPPED |
+-----------------------------+----------------+--------------+------------------------------+---------------------------+
| Debian 12 (arm) | FAIL | SKIPPED | PEND | PEND |
+-----------------------------+----------------+--------------+------------------------------+---------------------------+
| Fedora 40 (ARM Clang) | PEND | SKIPPED | SKIPPED | SKIPPED |
+-----------------------------+----------------+--------------+------------------------------+---------------------------+
| Fedora 41 (ARM) | PEND | SKIPPED | SKIPPED | SKIPPED |
+-----------------------------+----------------+--------------+------------------------------+---------------------------+
| Fedora 41 (ARM Clang) | PEND | SKIPPED | SKIPPED | SKIPPED |
+-----------------------------+----------------+--------------+------------------------------+---------------------------+
| Ubuntu 20.04 (ARM) | PEND | SKIPPED | SKIPPED | SKIPPED |
+-----------------------------+----------------+--------------+------------------------------+---------------------------+
| Ubuntu 22.04 (ARM) | PEND | SKIPPED | SKIPPED | SKIPPED |
+-----------------------------+----------------+--------------+------------------------------+---------------------------+
| RHEL9 (ARM) | PEND | SKIPPED | SKIPPED | SKIPPED |
+-----------------------------+----------------+--------------+------------------------------+---------------------------+
| Ubuntu 24.04 (ARM) | PEND | SKIPPED | SKIPPED | SKIPPED |
+-----------------------------+----------------+--------------+------------------------------+---------------------------+
| Ubuntu 20.04 ARM SVE | SKIPPED | PEND | SKIPPED | SKIPPED |
+-----------------------------+----------------+--------------+------------------------------+---------------------------+
==== Unit test summary for Debian 12 (arm) (dpdk_unit_test): ====
ninja: Entering directory `/home-local/jenkins-local/jenkins-agent/workspace/Generic-Unit-Test-DPDK/dpdk/build'
ninja: no work to do.
1/119 DPDK:fast-tests / acl_autotest OK 4.24s
2/119 DPDK:fast-tests / alarm_autotest OK 1.17s
3/119 DPDK:fast-tests / argparse_autotest OK 0.17s
4/119 DPDK:fast-tests / atomic_autotest OK 4.64s
5/119 DPDK:fast-tests / bitcount_autotest OK 0.18s
6/119 DPDK:fast-tests / bitmap_autotest OK 0.16s
7/119 DPDK:fast-tests / bitops_autotest OK 1.66s
8/119 DPDK:fast-tests / bitratestats_autotest OK 0.17s
9/119 DPDK:fast-tests / bitset_autotest OK 2.65s
10/119 DPDK:fast-tests / bpf_autotest OK 0.16s
11/119 DPDK:fast-tests / bpf_convert_autotest OK 0.17s
12/119 DPDK:fast-tests / byteorder_autotest OK 0.16s
13/119 DPDK:fast-tests / cfgfile_autotest OK 0.16s
14/119 DPDK:fast-tests / cksum_autotest OK 0.16s
15/119 DPDK:fast-tests / cmdline_autotest OK 0.16s
16/119 DPDK:fast-tests / common_autotest OK 1.06s
17/119 DPDK:fast-tests / compressdev_autotest SKIP 0.09s exit status 77
18/119 DPDK:fast-tests / cpuflags_autotest OK 0.18s
19/119 DPDK:fast-tests / crc_autotest OK 0.16s
20/119 DPDK:fast-tests / user_delay_us OK 0.16s
21/119 DPDK:fast-tests / debug_autotest OK 1.43s
22/119 DPDK:fast-tests / devargs_autotest OK 0.17s
23/119 DPDK:fast-tests / dispatcher_autotest OK 2.54s
24/119 DPDK:fast-tests / distributor_autotest OK 0.80s
25/119 DPDK:fast-tests / eal_flags_c_opt_autotest OK 2.33s
26/119 DPDK:fast-tests / eal_flags_main_opt_autotest OK 0.47s
27/119 DPDK:fast-tests / eal_flags_n_opt_autotest OK 0.42s
28/119 DPDK:fast-tests / eal_flags_hpet_autotest OK 0.24s
29/119 DPDK:fast-tests / eal_flags_no_huge_autotest OK 0.48s
30/119 DPDK:fast-tests / eal_flags_a_opt_autotest OK 0.68s
31/119 DPDK:fast-tests / eal_flags_b_opt_autotest OK 0.54s
32/119 DPDK:fast-tests / eal_flags_vdev_opt_autotest OK 0.40s
33/119 DPDK:fast-tests / eal_flags_r_opt_autotest OK 0.39s
34/119 DPDK:fast-tests / eal_flags_mem_autotest OK 0.60s
35/119 DPDK:fast-tests / eal_flags_file_prefix_autotest OK 1.65s
36/119 DPDK:fast-tests / eal_flags_misc_autotest OK 2.20s
37/119 DPDK:fast-tests / eal_fs_autotest OK 0.18s
38/119 DPDK:fast-tests / errno_autotest OK 0.16s
39/119 DPDK:fast-tests / ethdev_link_status FAIL 0.16s (exit status 255 or signal 127 SIGinvalid)
>>> DPDK_TEST=ethdev_link_status MALLOC_PERTURB_=143 /home-local/jenkins-local/jenkins-agent/workspace/Generic-Unit-Test-DPDK/dpdk/build/app/dpdk-test --no-huge -m 2048
40/119 DPDK:fast-tests / event_eth_tx_adapter_autotest OK 1.09s
41/119 DPDK:fast-tests / event_ring_autotest OK 0.18s
42/119 DPDK:fast-tests / eventdev_common_autotest OK 0.16s
43/119 DPDK:fast-tests / eventdev_selftest_sw OK 10.20s
44/119 DPDK:fast-tests / fbarray_autotest OK 0.16s
45/119 DPDK:fast-tests / fib_autotest OK 0.95s
46/119 DPDK:fast-tests / fib6_autotest OK 0.84s
47/119 DPDK:fast-tests / func_reentrancy_autotest OK 0.76s
48/119 DPDK:fast-tests / graph_autotest OK 0.18s
49/119 DPDK:fast-tests / node_list_dump OK 0.16s
50/119 DPDK:fast-tests / hash_autotest OK 0.50s
51/119 DPDK:fast-tests / hash_readwrite_func_autotest OK 7.27s
52/119 DPDK:fast-tests / interrupt_autotest OK 1.20s
53/119 DPDK:fast-tests / ipfrag_autotest OK 0.10s
54/119 DPDK:fast-tests / ipsec_autotest SKIP 0.18s exit status 77
55/119 DPDK:fast-tests / kvargs_autotest OK 0.16s
56/119 DPDK:fast-tests / latencystats_autotest OK 0.17s
57/119 DPDK:fast-tests / lcore_var_autotest OK 0.68s
58/119 DPDK:fast-tests / lcores_autotest OK 3.50s
59/119 DPDK:fast-tests / logs_autotest OK 0.16s
60/119 DPDK:fast-tests / lpm_autotest OK 1.68s
61/119 DPDK:fast-tests / lpm6_autotest OK 4.91s
62/119 DPDK:fast-tests / malloc_autotest OK 0.43s
63/119 DPDK:fast-tests / mbuf_autotest OK 4.62s
64/119 DPDK:fast-tests / mcslock_autotest OK 0.85s
65/119 DPDK:fast-tests / member_autotest OK 1.44s
66/119 DPDK:fast-tests / memcpy_autotest OK 6.16s
67/119 DPDK:fast-tests / memory_autotest OK 0.10s
68/119 DPDK:fast-tests / mempool_autotest OK 0.51s
69/119 DPDK:fast-tests / memzone_autotest OK 0.11s
70/119 DPDK:fast-tests / meter_autotest OK 0.18s
71/119 DPDK:fast-tests / metrics_autotest OK 0.17s
72/119 DPDK:fast-tests / multiprocess_autotest OK 0.38s
73/119 DPDK:fast-tests / net_ether_autotest OK 0.97s
74/119 DPDK:fast-tests / net_ipv6_autotest OK 0.16s
75/119 DPDK:fast-tests / pcapng_autotest OK 5.76s
76/119 DPDK:fast-tests / pdcp_autotest SKIP 0.09s exit status 77
77/119 DPDK:fast-tests / pdump_autotest OK 0.55s
78/119 DPDK:fast-tests / per_lcore_autotest OK 0.26s
79/119 DPDK:fast-tests / pflock_autotest OK 0.49s
80/119 DPDK:fast-tests / pie_autotest OK 0.16s
81/119 DPDK:fast-tests / ring_pmd_autotest OK 0.17s
82/119 DPDK:fast-tests / power_autotest OK 0.16s
83/119 DPDK:fast-tests / power_cpufreq_autotest SKIP 0.09s exit status 77
84/119 DPDK:fast-tests / power_intel_uncore_autotest SKIP 0.18s exit status 77
85/119 DPDK:fast-tests / power_kvm_vm_autotest SKIP 0.09s exit status 77
86/119 DPDK:fast-tests / prefetch_autotest OK 0.18s
87/119 DPDK:fast-tests / ptr_compress_autotest OK 0.16s
88/119 DPDK:fast-tests / rawdev_autotest OK 0.16s
89/119 DPDK:fast-tests / rcu_qsbr_autotest OK 0.63s
90/119 DPDK:fast-tests / reorder_autotest OK 0.43s
91/119 DPDK:fast-tests / rib_autotest OK 4.02s
92/119 DPDK:fast-tests / rib6_autotest OK 3.99s
93/119 DPDK:fast-tests / ring_autotest OK 0.19s
94/119 DPDK:fast-tests / rwlock_test1_autotest OK 0.50s
95/119 DPDK:fast-tests / rwlock_rda_autotest OK 5.16s
96/119 DPDK:fast-tests / rwlock_rds_wrm_autotest OK 5.20s
97/119 DPDK:fast-tests / rwlock_rde_wro_autotest OK 5.16s
98/119 DPDK:fast-tests / sched_autotest OK 0.18s
99/119 DPDK:fast-tests / security_autotest OK 0.10s
100/119 DPDK:fast-tests / seqlock_autotest OK 2.19s
101/119 DPDK:fast-tests / service_autotest OK 2.87s
102/119 DPDK:fast-tests / soring_autotest OK 0.17s
103/119 DPDK:fast-tests / spinlock_autotest OK 0.20s
104/119 DPDK:fast-tests / stack_autotest OK 0.37s
105/119 DPDK:fast-tests / stack_lf_autotest OK 0.34s
106/119 DPDK:fast-tests / string_autotest OK 0.19s
107/119 DPDK:fast-tests / table_autotest OK 7.12s
108/119 DPDK:fast-tests / tailq_autotest OK 0.17s
109/119 DPDK:fast-tests / telemetry_data_autotest OK 0.16s
110/119 DPDK:fast-tests / telemetry_json_autotest OK 0.16s
111/119 DPDK:fast-tests / thash_autotest OK 0.18s
112/119 DPDK:fast-tests / threads_autotest OK 0.34s
113/119 DPDK:fast-tests / ticketlock_autotest OK 0.20s
114/119 DPDK:fast-tests / timer_autotest OK 2.86s
115/119 DPDK:fast-tests / trace_autotest OK 0.19s
116/119 DPDK:fast-tests / trace_autotest_with_traces OK 0.18s
117/119 DPDK:fast-tests / vdev_autotest OK 0.16s
118/119 DPDK:fast-tests / version_autotest OK 0.16s
119/119 DPDK:fast-tests / telemetry_all SKIP 0.04s exit status 77
Ok: 111
Expected Fail: 0
Fail: 1
Unexpected Pass: 0
Skipped: 7
Timeout: 0
Full log written to /home-local/jenkins-local/jenkins-agent/workspace/Generic-Unit-Test-DPDK/dpdk/build/meson-logs/testlog.txt
Test log output from the failed test ethdev_link_status:
Sorry, we were not able to find the logs for this test.
Download the log output from the CI site for this test run.
==== End log output ====
CentOS Stream 9 (ARM)
Kernel: Depends on container host
Compiler: gcc 11.5.0 20240719 (Red Hat 11.5.0-2)
Fedora 40 (ARM)
Kernel: Depends on container host
Compiler: gcc 14.2.1 20240912 (Red Hat 14.2.1-3)
32-bit Ubuntu 22.04.4 (ARM)
Kernel: 5.15.83+ aarch64
Compiler: gcc (Ubuntu 11.4.0-1ubuntu1~22.04) 11.4.0
CentOS Stream 10 (ARM)
Kernel: Depends on container host
Compiler: gcc 14.2.1 20241104 (Red Hat 14.2.1-6)
Debian 12 (arm)
Kernel: Depends on container host
Compiler: gcc (Debian 12.2.0-14) 12.2.0
Fedora 40 (ARM Clang)
Kernel: Depends on container host
Compiler: clang 18.1.8 (Fedora 18.1.8-1.fc40)
Fedora 41 (ARM)
Kernel: Depends on container host
Compiler: gcc 14.2.1 20240912 (Red Hat 14.2.1-3)
Fedora 41 (ARM Clang)
Kernel: Depends on container host
Compiler: clang 19.1.5 (Fedora 19.1.5-1.fc41)
Ubuntu 20.04 (ARM)
Kernel: Depends on container host
Compiler: gcc (Ubuntu 9.4.0-1ubuntu1~20.04.2) 9.4.0
Ubuntu 22.04 (ARM)
Kernel: Depends on container host
Compiler: gcc (Ubuntu 11.4.0-1ubuntu1~22.04) 11.4.0
RHEL9 (ARM)
Kernel: Depends on container host
Compiler: gcc 11.5.0 20240719 (Red Hat 11.5.0-2)
Ubuntu 24.04 (ARM)
Kernel: Depends on container host
Compiler: gcc (Ubuntu 13.3.0-6ubuntu2~24.04) 13.3.0
Ubuntu 20.04 ARM SVE
Kernel: Depends on container host
Compiler: gcc (Ubuntu 10.5.0-1ubuntu1~20.04) 10.5.0
To view detailed results, visit:
https://lab.dpdk.org/results/dashboard/patchsets/32939/
UNH-IOL DPDK Community Lab
To manage your email subscriptions, visit:
https://lab.dpdk.org/results/dashboard/preferences/subscriptions/
^ permalink raw reply [flat|nested] 30+ messages in thread
* |FAILURE| pw152750-152753 [PATCH] [RFC,4/4] net/cnxk: report link ty
[not found] <20250403070837.926292-4-ndabilpuram@marvell.com>
` (15 preceding siblings ...)
2025-04-03 9:53 ` dpdklab
@ 2025-04-03 9:58 ` dpdklab
2025-04-03 10:18 ` |PENDING| " dpdklab
` (12 subsequent siblings)
29 siblings, 0 replies; 30+ messages in thread
From: dpdklab @ 2025-04-03 9:58 UTC (permalink / raw)
To: Test Report; +Cc: dpdk-test-reports, Nithin Dabilpuram
Test-Label: iol-unit-amd64-testing
Test-Status: FAILURE
http://dpdk.org/patch/152753
_Testing issues_
Submitter: Nithin Dabilpuram <ndabilpuram@marvell.com>
Date: Thursday, April 03 2025 07:08:37
DPDK git baseline: Repo:dpdk
Branch: master
CommitID:b40c403777e93242a377c07ff51964480d40b51d
152750-152753 --> testing issues
Upstream job id: Generic-Unit-Test-DPDK#328593
Test environment and result as below:
+-------------------+----------------+
| Environment | dpdk_unit_test |
+===================+================+
| CentOS Stream 9 | FAIL |
+-------------------+----------------+
| CentOS Stream 10 | PEND |
+-------------------+----------------+
| Fedora 40 | PEND |
+-------------------+----------------+
| Debian 12 | PEND |
+-------------------+----------------+
| Fedora 40 (Clang) | PEND |
+-------------------+----------------+
| Fedora 41 (Clang) | PEND |
+-------------------+----------------+
| Fedora 41 | PEND |
+-------------------+----------------+
| RHEL9 | PEND |
+-------------------+----------------+
| RHEL8 | PEND |
+-------------------+----------------+
| Ubuntu 20.04 | PEND |
+-------------------+----------------+
| Ubuntu 24.04 | PEND |
+-------------------+----------------+
| Ubuntu 22.04 | PEND |
+-------------------+----------------+
==== Unit test summary for CentOS Stream 9 (dpdk_unit_test): ====
ninja: Entering directory `/home-local/jenkins-local/jenkins-agent/workspace/Generic-Unit-Test-DPDK/dpdk/build'
ninja: no work to do.
1/119 DPDK:fast-tests / acl_autotest OK 4.79s
2/119 DPDK:fast-tests / alarm_autotest OK 1.41s
3/119 DPDK:fast-tests / argparse_autotest OK 0.28s
4/119 DPDK:fast-tests / atomic_autotest OK 0.61s
5/119 DPDK:fast-tests / bitcount_autotest OK 0.39s
6/119 DPDK:fast-tests / bitmap_autotest OK 0.24s
7/119 DPDK:fast-tests / bitops_autotest OK 2.28s
8/119 DPDK:fast-tests / bitratestats_autotest OK 0.30s
9/119 DPDK:fast-tests / bitset_autotest OK 2.27s
10/119 DPDK:fast-tests / bpf_autotest OK 0.23s
11/119 DPDK:fast-tests / bpf_convert_autotest OK 0.24s
12/119 DPDK:fast-tests / byteorder_autotest OK 0.19s
13/119 DPDK:fast-tests / cfgfile_autotest OK 0.18s
14/119 DPDK:fast-tests / cksum_autotest OK 0.27s
15/119 DPDK:fast-tests / cmdline_autotest OK 0.33s
16/119 DPDK:fast-tests / common_autotest OK 0.69s
17/119 DPDK:fast-tests / compressdev_autotest SKIP 0.20s exit status 77
18/119 DPDK:fast-tests / cpuflags_autotest OK 0.28s
19/119 DPDK:fast-tests / crc_autotest OK 0.34s
20/119 DPDK:fast-tests / user_delay_us OK 0.29s
21/119 DPDK:fast-tests / debug_autotest OK 19.30s
22/119 DPDK:fast-tests / devargs_autotest OK 0.22s
23/119 DPDK:fast-tests / dispatcher_autotest SKIP 0.23s exit status 77
24/119 DPDK:fast-tests / distributor_autotest OK 1.62s
25/119 DPDK:fast-tests / eal_flags_c_opt_autotest OK 2.00s
26/119 DPDK:fast-tests / eal_flags_main_opt_autotest OK 0.70s
27/119 DPDK:fast-tests / eal_flags_n_opt_autotest OK 0.78s
28/119 DPDK:fast-tests / eal_flags_hpet_autotest OK 0.47s
29/119 DPDK:fast-tests / eal_flags_no_huge_autotest OK 0.80s
30/119 DPDK:fast-tests / eal_flags_a_opt_autotest OK 0.81s
31/119 DPDK:fast-tests / eal_flags_b_opt_autotest OK 0.57s
32/119 DPDK:fast-tests / eal_flags_vdev_opt_autotest OK 0.81s
33/119 DPDK:fast-tests / eal_flags_r_opt_autotest OK 0.43s
34/119 DPDK:fast-tests / eal_flags_mem_autotest OK 1.36s
35/119 DPDK:fast-tests / eal_flags_file_prefix_autotest OK 4.39s
36/119 DPDK:fast-tests / eal_flags_misc_autotest OK 3.58s
37/119 DPDK:fast-tests / eal_fs_autotest OK 0.27s
38/119 DPDK:fast-tests / errno_autotest OK 0.32s
39/119 DPDK:fast-tests / ethdev_link_status FAIL 0.23s (exit status 255 or signal 127 SIGinvalid)
>>> MALLOC_PERTURB_=53 DPDK_TEST=ethdev_link_status /home-local/jenkins-local/jenkins-agent/workspace/Generic-Unit-Test-DPDK/dpdk/build/app/dpdk-test --no-huge -m 2048
40/119 DPDK:fast-tests / event_eth_tx_adapter_autotest OK 0.87s
41/119 DPDK:fast-tests / event_ring_autotest OK 0.26s
42/119 DPDK:fast-tests / eventdev_common_autotest OK 0.31s
43/119 DPDK:fast-tests / eventdev_selftest_sw OK 0.57s
44/119 DPDK:fast-tests / fbarray_autotest OK 0.30s
45/119 DPDK:fast-tests / fib_autotest OK 1.25s
46/119 DPDK:fast-tests / fib6_autotest OK 0.96s
47/119 DPDK:fast-tests / func_reentrancy_autotest OK 0.98s
48/119 DPDK:fast-tests / graph_autotest OK 0.29s
49/119 DPDK:fast-tests / node_list_dump OK 0.33s
50/119 DPDK:fast-tests / hash_autotest OK 0.29s
51/119 DPDK:fast-tests / hash_readwrite_func_autotest SKIP 0.21s exit status 77
52/119 DPDK:fast-tests / interrupt_autotest OK 1.77s
53/119 DPDK:fast-tests / ipfrag_autotest OK 0.25s
54/119 DPDK:fast-tests / ipsec_autotest SKIP 0.34s exit status 77
55/119 DPDK:fast-tests / kvargs_autotest OK 0.18s
56/119 DPDK:fast-tests / latencystats_autotest OK 0.31s
57/119 DPDK:fast-tests / lcore_var_autotest OK 0.53s
58/119 DPDK:fast-tests / lcores_autotest OK 1.59s
59/119 DPDK:fast-tests / logs_autotest OK 0.18s
60/119 DPDK:fast-tests / lpm_autotest OK 2.72s
61/119 DPDK:fast-tests / lpm6_autotest OK 5.07s
62/119 DPDK:fast-tests / malloc_autotest OK 0.72s
63/119 DPDK:fast-tests / mbuf_autotest OK 0.30s
64/119 DPDK:fast-tests / mcslock_autotest OK 0.71s
65/119 DPDK:fast-tests / member_autotest OK 1.28s
66/119 DPDK:fast-tests / memcpy_autotest OK 2.92s
67/119 DPDK:fast-tests / memory_autotest OK 0.39s
68/119 DPDK:fast-tests / mempool_autotest OK 0.83s
69/119 DPDK:fast-tests / memzone_autotest OK 0.23s
70/119 DPDK:fast-tests / meter_autotest OK 0.27s
71/119 DPDK:fast-tests / metrics_autotest OK 0.18s
72/119 DPDK:fast-tests / multiprocess_autotest OK 0.43s
73/119 DPDK:fast-tests / net_ether_autotest OK 0.81s
74/119 DPDK:fast-tests / net_ipv6_autotest OK 0.18s
75/119 DPDK:fast-tests / pcapng_autotest OK 8.65s
76/119 DPDK:fast-tests / pdcp_autotest SKIP 0.15s exit status 77
77/119 DPDK:fast-tests / pdump_autotest OK 0.37s
78/119 DPDK:fast-tests / per_lcore_autotest OK 0.60s
79/119 DPDK:fast-tests / pflock_autotest OK 0.66s
80/119 DPDK:fast-tests / pie_autotest OK 0.31s
81/119 DPDK:fast-tests / ring_pmd_autotest OK 0.27s
82/119 DPDK:fast-tests / power_autotest OK 0.24s
83/119 DPDK:fast-tests / power_cpufreq_autotest SKIP 0.19s exit status 77
84/119 DPDK:fast-tests / power_intel_uncore_autotest SKIP 0.34s exit status 77
85/119 DPDK:fast-tests / power_kvm_vm_autotest SKIP 0.15s exit status 77
86/119 DPDK:fast-tests / prefetch_autotest OK 0.28s
87/119 DPDK:fast-tests / ptr_compress_autotest OK 0.18s
88/119 DPDK:fast-tests / rawdev_autotest OK 0.18s
89/119 DPDK:fast-tests / rcu_qsbr_autotest OK 0.78s
90/119 DPDK:fast-tests / reorder_autotest OK 0.45s
91/119 DPDK:fast-tests / rib_autotest OK 6.56s
92/119 DPDK:fast-tests / rib6_autotest OK 6.49s
93/119 DPDK:fast-tests / ring_autotest OK 0.28s
94/119 DPDK:fast-tests / rwlock_test1_autotest OK 0.55s
95/119 DPDK:fast-tests / rwlock_rda_autotest OK 5.33s
96/119 DPDK:fast-tests / rwlock_rds_wrm_autotest OK 5.36s
97/119 DPDK:fast-tests / rwlock_rde_wro_autotest OK 5.45s
98/119 DPDK:fast-tests / sched_autotest OK 0.31s
99/119 DPDK:fast-tests / security_autotest OK 0.21s
100/119 DPDK:fast-tests / seqlock_autotest SKIP 0.25s exit status 77
101/119 DPDK:fast-tests / service_autotest OK 0.36s
102/119 DPDK:fast-tests / soring_autotest OK 0.29s
103/119 DPDK:fast-tests / spinlock_autotest OK 0.19s
104/119 DPDK:fast-tests / stack_autotest OK 0.41s
105/119 DPDK:fast-tests / stack_lf_autotest OK 0.32s
106/119 DPDK:fast-tests / string_autotest OK 0.37s
107/119 DPDK:fast-tests / table_autotest OK 8.78s
108/119 DPDK:fast-tests / tailq_autotest OK 0.29s
109/119 DPDK:fast-tests / telemetry_data_autotest OK 0.18s
110/119 DPDK:fast-tests / telemetry_json_autotest OK 0.24s
111/119 DPDK:fast-tests / thash_autotest OK 0.27s
112/119 DPDK:fast-tests / threads_autotest OK 0.50s
113/119 DPDK:fast-tests / ticketlock_autotest OK 0.20s
114/119 DPDK:fast-tests / timer_autotest OK 2.96s
115/119 DPDK:fast-tests / trace_autotest OK 0.30s
116/119 DPDK:fast-tests / trace_autotest_with_traces OK 0.25s
117/119 DPDK:fast-tests / vdev_autotest OK 0.20s
118/119 DPDK:fast-tests / version_autotest OK 0.32s
119/119 DPDK:fast-tests / telemetry_all SKIP 0.01s exit status 77
Ok: 108
Expected Fail: 0
Fail: 1
Unexpected Pass: 0
Skipped: 10
Timeout: 0
Full log written to /home-local/jenkins-local/jenkins-agent/workspace/Generic-Unit-Test-DPDK/dpdk/build/meson-logs/testlog.txt
Test log output from the failed test ethdev_link_status:
Sorry, we were not able to find the logs for this test.
Download the log output from the CI site for this test run.
==== End log output ====
CentOS Stream 9
Kernel: Depends on container host
Compiler: gcc 11.5.0 20240719 (Red Hat 11.5.0-2)
CentOS Stream 10
Kernel: Depends on container host
Compiler: gcc 14.2.1 20241104 (Red Hat 14.2.1-6)
Fedora 40
Kernel: Depends on container host
Compiler: gcc 14.2.1 20240912 (Red Hat 14.2.1-3)
Debian 12
Kernel: Depends on container host
Compiler: gcc (Debian 12.2.0-14) 12.2.0
Fedora 40 (Clang)
Kernel: Depends on container host
Compiler: clang 18.1.8 (Fedora 18.1.8-1.fc40)
Fedora 41 (Clang)
Kernel: Depends on container host
Compiler: clang 19.1.5 (Fedora 19.1.5-1.fc41)
Fedora 41
Kernel: Depends on container host
Compiler: gcc 14.2.1 20240912 (Red Hat 14.2.1-3)
RHEL9
Kernel: Depends on container host
Compiler: gcc 11.5.0 20240719 (Red Hat 11.5.0-2)
RHEL8
Kernel: Depends on container host
Compiler: gcc 8.5.0 20210514 (Red Hat 8.5.0-22)
Ubuntu 20.04
Kernel: Depends on container host
Compiler: gcc (Ubuntu 9.4.0-1ubuntu1~20.04.2) 9.4.0
Ubuntu 24.04
Kernel: Depends on container host
Compiler: gcc (Ubuntu 13.3.0-6ubuntu2~24.04) 13.3.0
Ubuntu 22.04
Kernel: Depends on container host
Compiler: gcc (Ubuntu 11.4.0-1ubuntu1~22.04) 11.4.0
To view detailed results, visit:
https://lab.dpdk.org/results/dashboard/patchsets/32939/
UNH-IOL DPDK Community Lab
To manage your email subscriptions, visit:
https://lab.dpdk.org/results/dashboard/preferences/subscriptions/
^ permalink raw reply [flat|nested] 30+ messages in thread
* |PENDING| pw152750-152753 [PATCH] [RFC,4/4] net/cnxk: report link ty
[not found] <20250403070837.926292-4-ndabilpuram@marvell.com>
` (16 preceding siblings ...)
2025-04-03 9:58 ` dpdklab
@ 2025-04-03 10:18 ` dpdklab
2025-04-03 10:41 ` |FAILURE| " dpdklab
` (11 subsequent siblings)
29 siblings, 0 replies; 30+ messages in thread
From: dpdklab @ 2025-04-03 10:18 UTC (permalink / raw)
To: Test Report; +Cc: dpdk-test-reports
Test-Label: iol-compile-arm64-testing
Test-Status: PENDING
http://dpdk.org/patch/152753
_Testing pending_
Submitter: Nithin Dabilpuram <ndabilpuram@marvell.com>
Date: Thursday, April 03 2025 07:08:37
DPDK git baseline: Repo:dpdk
Branch: master
CommitID:b40c403777e93242a377c07ff51964480d40b51d
152750-152753 --> testing pending
Upstream job id: Generic-DPDK-Compile-Meson#377137
Test environment and result as below:
+------------------------------------+--------------------+
| Environment | dpdk_meson_compile |
+====================================+====================+
| RHEL9 (ARM) | PEND |
+------------------------------------+--------------------+
| Ubuntu 20.04 ARM GCC Cross Compile | PEND |
+------------------------------------+--------------------+
| Ubuntu 20.04 ARM SVE | PASS |
+------------------------------------+--------------------+
| Debian 12 with MUSDK | PEND |
+------------------------------------+--------------------+
| Fedora 41 (ARM Clang) | PEND |
+------------------------------------+--------------------+
| Fedora 40 (ARM Clang) | PEND |
+------------------------------------+--------------------+
| Fedora 41 (ARM) | PEND |
+------------------------------------+--------------------+
| Fedora 40 (ARM) | PEND |
+------------------------------------+--------------------+
| Ubuntu 20.04 (ARM) | PEND |
+------------------------------------+--------------------+
RHEL9 (ARM)
Kernel: Depends on container host
Compiler: gcc 11.5.0 20240719 (Red Hat 11.5.0-2)
Ubuntu 20.04 ARM GCC Cross Compile
Kernel: Depends on container host
Compiler: aarch64-linux-gnu-gcc (Ubuntu 9.4.0-1ubuntu1~20.04.2) 9.4.0
Ubuntu 20.04 ARM SVE
Kernel: Depends on container host
Compiler: gcc (Ubuntu 10.5.0-1ubuntu1~20.04) 10.5.0
Debian 12 with MUSDK
Kernel: Depends on container host
Compiler: gcc (Debian 12.2.0-14) 12.2.0
Fedora 41 (ARM Clang)
Kernel: Depends on container host
Compiler: clang 19.1.5 (Fedora 19.1.5-1.fc41)
Fedora 40 (ARM Clang)
Kernel: Depends on container host
Compiler: clang 18.1.8 (Fedora 18.1.8-1.fc40)
Fedora 41 (ARM)
Kernel: Depends on container host
Compiler: gcc 14.2.1 20240912 (Red Hat 14.2.1-3)
Fedora 40 (ARM)
Kernel: Depends on container host
Compiler: gcc 14.2.1 20240912 (Red Hat 14.2.1-3)
Ubuntu 20.04 (ARM)
Kernel: Depends on container host
Compiler: gcc (Ubuntu 9.4.0-1ubuntu1~20.04.2) 9.4.0
To view detailed results, visit:
https://lab.dpdk.org/results/dashboard/patchsets/32939/
UNH-IOL DPDK Community Lab
To manage your email subscriptions, visit:
https://lab.dpdk.org/results/dashboard/preferences/subscriptions/
^ permalink raw reply [flat|nested] 30+ messages in thread
* |FAILURE| pw152750-152753 [PATCH] [RFC,4/4] net/cnxk: report link ty
[not found] <20250403070837.926292-4-ndabilpuram@marvell.com>
` (17 preceding siblings ...)
2025-04-03 10:18 ` |PENDING| " dpdklab
@ 2025-04-03 10:41 ` dpdklab
2025-04-03 10:50 ` |WARNING| " dpdklab
` (10 subsequent siblings)
29 siblings, 0 replies; 30+ messages in thread
From: dpdklab @ 2025-04-03 10:41 UTC (permalink / raw)
To: Test Report; +Cc: dpdk-test-reports, Nithin Dabilpuram
Test-Label: iol-unit-amd64-testing
Test-Status: FAILURE
http://dpdk.org/patch/152753
_Testing issues_
Submitter: Nithin Dabilpuram <ndabilpuram@marvell.com>
Date: Thursday, April 03 2025 07:08:37
DPDK git baseline: Repo:dpdk
Branch: master
CommitID:b40c403777e93242a377c07ff51964480d40b51d
152750-152753 --> testing issues
Upstream job id: Generic-Unit-Test-DPDK#328611
Test environment and result as below:
+-------------------+----------------+
| Environment | dpdk_unit_test |
+===================+================+
| CentOS Stream 9 | FAIL |
+-------------------+----------------+
| CentOS Stream 10 | FAIL |
+-------------------+----------------+
| Fedora 40 | FAIL |
+-------------------+----------------+
| Debian 12 | FAIL |
+-------------------+----------------+
| Fedora 40 (Clang) | FAIL |
+-------------------+----------------+
| Fedora 41 (Clang) | FAIL |
+-------------------+----------------+
| Fedora 41 | FAIL |
+-------------------+----------------+
| RHEL9 | FAIL |
+-------------------+----------------+
| RHEL8 | FAIL |
+-------------------+----------------+
| Ubuntu 20.04 | FAIL |
+-------------------+----------------+
| Ubuntu 24.04 | FAIL |
+-------------------+----------------+
| Ubuntu 22.04 | FAIL |
+-------------------+----------------+
==== Unit test summary for Ubuntu 22.04 (dpdk_unit_test): ====
ninja: Entering directory `/home-local/jenkins-local/jenkins-agent/workspace/Generic-Unit-Test-DPDK/dpdk/build'
ninja: no work to do.
1/119 DPDK:fast-tests / acl_autotest OK 2.51s
2/119 DPDK:fast-tests / alarm_autotest OK 1.19s
3/119 DPDK:fast-tests / argparse_autotest OK 0.19s
4/119 DPDK:fast-tests / atomic_autotest OK 0.37s
5/119 DPDK:fast-tests / bitcount_autotest OK 0.21s
6/119 DPDK:fast-tests / bitmap_autotest OK 0.19s
7/119 DPDK:fast-tests / bitops_autotest OK 1.69s
8/119 DPDK:fast-tests / bitratestats_autotest OK 0.19s
9/119 DPDK:fast-tests / bitset_autotest OK 1.35s
10/119 DPDK:fast-tests / bpf_autotest OK 0.19s
11/119 DPDK:fast-tests / bpf_convert_autotest OK 0.19s
12/119 DPDK:fast-tests / byteorder_autotest OK 0.19s
13/119 DPDK:fast-tests / cfgfile_autotest OK 0.19s
14/119 DPDK:fast-tests / cksum_autotest OK 0.19s
15/119 DPDK:fast-tests / cmdline_autotest OK 0.18s
16/119 DPDK:fast-tests / common_autotest OK 0.48s
17/119 DPDK:fast-tests / compressdev_autotest SKIP 0.15s exit status 77
18/119 DPDK:fast-tests / cpuflags_autotest OK 0.19s
19/119 DPDK:fast-tests / crc_autotest OK 0.19s
20/119 DPDK:fast-tests / user_delay_us OK 0.19s
21/119 DPDK:fast-tests / debug_autotest OK 0.49s
22/119 DPDK:fast-tests / devargs_autotest OK 0.19s
23/119 DPDK:fast-tests / dispatcher_autotest SKIP 0.15s exit status 77
24/119 DPDK:fast-tests / distributor_autotest OK 0.87s
25/119 DPDK:fast-tests / eal_flags_c_opt_autotest OK 1.09s
26/119 DPDK:fast-tests / eal_flags_main_opt_autotest OK 0.38s
27/119 DPDK:fast-tests / eal_flags_n_opt_autotest OK 0.54s
28/119 DPDK:fast-tests / eal_flags_hpet_autotest OK 0.24s
29/119 DPDK:fast-tests / eal_flags_no_huge_autotest OK 0.57s
30/119 DPDK:fast-tests / eal_flags_a_opt_autotest OK 0.49s
31/119 DPDK:fast-tests / eal_flags_b_opt_autotest OK 0.41s
32/119 DPDK:fast-tests / eal_flags_vdev_opt_autotest OK 0.62s
33/119 DPDK:fast-tests / eal_flags_r_opt_autotest OK 0.33s
34/119 DPDK:fast-tests / eal_flags_mem_autotest OK 0.85s
35/119 DPDK:fast-tests / eal_flags_file_prefix_autotest OK 2.25s
36/119 DPDK:fast-tests / eal_flags_misc_autotest OK 2.36s
37/119 DPDK:fast-tests / eal_fs_autotest OK 0.19s
38/119 DPDK:fast-tests / errno_autotest OK 0.18s
39/119 DPDK:fast-tests / ethdev_link_status FAIL 0.18s (exit status 255 or signal 127 SIGinvalid)
>>> MALLOC_PERTURB_=147 DPDK_TEST=ethdev_link_status /home-local/jenkins-local/jenkins-agent/workspace/Generic-Unit-Test-DPDK/dpdk/build/app/dpdk-test --no-huge -m 2048
40/119 DPDK:fast-tests / event_eth_tx_adapter_autotest OK 0.48s
41/119 DPDK:fast-tests / event_ring_autotest OK 0.19s
42/119 DPDK:fast-tests / eventdev_common_autotest OK 0.19s
43/119 DPDK:fast-tests / eventdev_selftest_sw OK 0.23s
44/119 DPDK:fast-tests / fbarray_autotest OK 0.19s
45/119 DPDK:fast-tests / fib_autotest OK 0.76s
46/119 DPDK:fast-tests / fib6_autotest OK 0.65s
47/119 DPDK:fast-tests / func_reentrancy_autotest OK 0.57s
48/119 DPDK:fast-tests / graph_autotest OK 0.20s
49/119 DPDK:fast-tests / node_list_dump OK 0.19s
50/119 DPDK:fast-tests / hash_autotest OK 0.30s
51/119 DPDK:fast-tests / hash_readwrite_func_autotest SKIP 0.16s exit status 77
52/119 DPDK:fast-tests / interrupt_autotest OK 1.31s
53/119 DPDK:fast-tests / ipfrag_autotest OK 0.16s
54/119 DPDK:fast-tests / ipsec_autotest SKIP 0.20s exit status 77
55/119 DPDK:fast-tests / kvargs_autotest OK 0.19s
56/119 DPDK:fast-tests / latencystats_autotest OK 0.19s
57/119 DPDK:fast-tests / lcore_var_autotest OK 0.33s
58/119 DPDK:fast-tests / lcores_autotest OK 0.70s
59/119 DPDK:fast-tests / logs_autotest OK 0.19s
60/119 DPDK:fast-tests / lpm_autotest OK 2.07s
61/119 DPDK:fast-tests / lpm6_autotest OK 3.52s
62/119 DPDK:fast-tests / malloc_autotest OK 0.37s
63/119 DPDK:fast-tests / mbuf_autotest OK 0.28s
64/119 DPDK:fast-tests / mcslock_autotest OK 0.44s
65/119 DPDK:fast-tests / member_autotest OK 0.77s
66/119 DPDK:fast-tests / memcpy_autotest OK 1.74s
67/119 DPDK:fast-tests / memory_autotest OK 0.16s
68/119 DPDK:fast-tests / mempool_autotest OK 0.44s
69/119 DPDK:fast-tests / memzone_autotest OK 0.16s
70/119 DPDK:fast-tests / meter_autotest OK 0.19s
71/119 DPDK:fast-tests / metrics_autotest OK 0.19s
72/119 DPDK:fast-tests / multiprocess_autotest OK 0.31s
73/119 DPDK:fast-tests / net_ether_autotest OK 0.51s
74/119 DPDK:fast-tests / net_ipv6_autotest OK 0.18s
75/119 DPDK:fast-tests / pcapng_autotest OK 7.04s
76/119 DPDK:fast-tests / pdcp_autotest SKIP 0.15s exit status 77
77/119 DPDK:fast-tests / pdump_autotest OK 0.34s
78/119 DPDK:fast-tests / per_lcore_autotest OK 0.29s
79/119 DPDK:fast-tests / pflock_autotest OK 0.29s
80/119 DPDK:fast-tests / pie_autotest OK 0.19s
81/119 DPDK:fast-tests / ring_pmd_autotest OK 0.19s
82/119 DPDK:fast-tests / power_autotest OK 0.18s
83/119 DPDK:fast-tests / power_cpufreq_autotest SKIP 0.15s exit status 77
84/119 DPDK:fast-tests / power_intel_uncore_autotest SKIP 0.19s exit status 77
85/119 DPDK:fast-tests / power_kvm_vm_autotest SKIP 0.15s exit status 77
86/119 DPDK:fast-tests / prefetch_autotest OK 0.19s
87/119 DPDK:fast-tests / ptr_compress_autotest OK 0.19s
88/119 DPDK:fast-tests / rawdev_autotest OK 0.19s
89/119 DPDK:fast-tests / rcu_qsbr_autotest OK 0.29s
90/119 DPDK:fast-tests / reorder_autotest OK 0.37s
91/119 DPDK:fast-tests / rib_autotest OK 4.25s
92/119 DPDK:fast-tests / rib6_autotest OK 4.30s
93/119 DPDK:fast-tests / ring_autotest OK 0.19s
94/119 DPDK:fast-tests / rwlock_test1_autotest OK 0.29s
95/119 DPDK:fast-tests / rwlock_rda_autotest OK 5.29s
96/119 DPDK:fast-tests / rwlock_rds_wrm_autotest OK 5.19s
97/119 DPDK:fast-tests / rwlock_rde_wro_autotest OK 5.19s
98/119 DPDK:fast-tests / sched_autotest OK 0.19s
99/119 DPDK:fast-tests / security_autotest OK 0.16s
100/119 DPDK:fast-tests / seqlock_autotest SKIP 0.19s exit status 77
101/119 DPDK:fast-tests / service_autotest OK 0.29s
102/119 DPDK:fast-tests / soring_autotest OK 0.19s
103/119 DPDK:fast-tests / spinlock_autotest OK 0.20s
104/119 DPDK:fast-tests / stack_autotest OK 0.19s
105/119 DPDK:fast-tests / stack_lf_autotest OK 0.23s
106/119 DPDK:fast-tests / string_autotest OK 0.19s
107/119 DPDK:fast-tests / table_autotest OK 5.81s
108/119 DPDK:fast-tests / tailq_autotest OK 0.19s
109/119 DPDK:fast-tests / telemetry_data_autotest OK 0.19s
110/119 DPDK:fast-tests / telemetry_json_autotest OK 0.19s
111/119 DPDK:fast-tests / thash_autotest OK 0.19s
112/119 DPDK:fast-tests / threads_autotest OK 0.34s
113/119 DPDK:fast-tests / ticketlock_autotest OK 0.20s
114/119 DPDK:fast-tests / timer_autotest OK 2.52s
115/119 DPDK:fast-tests / trace_autotest OK 0.19s
116/119 DPDK:fast-tests / trace_autotest_with_traces OK 0.19s
117/119 DPDK:fast-tests / vdev_autotest OK 0.19s
118/119 DPDK:fast-tests / version_autotest OK 0.18s
119/119 DPDK:fast-tests / telemetry_all OK 1.08s
Ok: 109
Expected Fail: 0
Fail: 1
Unexpected Pass: 0
Skipped: 9
Timeout: 0
Full log written to /home-local/jenkins-local/jenkins-agent/workspace/Generic-Unit-Test-DPDK/dpdk/build/meson-logs/testlog.txt
Test log output from the failed test ethdev_link_status:
Sorry, we were not able to find the logs for this test.
Download the log output from the CI site for this test run.
==== End log output ====
CentOS Stream 9
Kernel: Depends on container host
Compiler: gcc 11.5.0 20240719 (Red Hat 11.5.0-2)
CentOS Stream 10
Kernel: Depends on container host
Compiler: gcc 14.2.1 20241104 (Red Hat 14.2.1-6)
Fedora 40
Kernel: Depends on container host
Compiler: gcc 14.2.1 20240912 (Red Hat 14.2.1-3)
Debian 12
Kernel: Depends on container host
Compiler: gcc (Debian 12.2.0-14) 12.2.0
Fedora 40 (Clang)
Kernel: Depends on container host
Compiler: clang 18.1.8 (Fedora 18.1.8-1.fc40)
Fedora 41 (Clang)
Kernel: Depends on container host
Compiler: clang 19.1.5 (Fedora 19.1.5-1.fc41)
Fedora 41
Kernel: Depends on container host
Compiler: gcc 14.2.1 20240912 (Red Hat 14.2.1-3)
RHEL9
Kernel: Depends on container host
Compiler: gcc 11.5.0 20240719 (Red Hat 11.5.0-2)
RHEL8
Kernel: Depends on container host
Compiler: gcc 8.5.0 20210514 (Red Hat 8.5.0-22)
Ubuntu 20.04
Kernel: Depends on container host
Compiler: gcc (Ubuntu 9.4.0-1ubuntu1~20.04.2) 9.4.0
Ubuntu 24.04
Kernel: Depends on container host
Compiler: gcc (Ubuntu 13.3.0-6ubuntu2~24.04) 13.3.0
Ubuntu 22.04
Kernel: Depends on container host
Compiler: gcc (Ubuntu 11.4.0-1ubuntu1~22.04) 11.4.0
To view detailed results, visit:
https://lab.dpdk.org/results/dashboard/patchsets/32939/
UNH-IOL DPDK Community Lab
To manage your email subscriptions, visit:
https://lab.dpdk.org/results/dashboard/preferences/subscriptions/
^ permalink raw reply [flat|nested] 30+ messages in thread
* |WARNING| pw152750-152753 [PATCH] [RFC,4/4] net/cnxk: report link ty
[not found] <20250403070837.926292-4-ndabilpuram@marvell.com>
` (18 preceding siblings ...)
2025-04-03 10:41 ` |FAILURE| " dpdklab
@ 2025-04-03 10:50 ` dpdklab
2025-04-03 11:41 ` |FAILURE| " dpdklab
` (9 subsequent siblings)
29 siblings, 0 replies; 30+ messages in thread
From: dpdklab @ 2025-04-03 10:50 UTC (permalink / raw)
To: Test Report; +Cc: dpdk-test-reports
Test-Label: iol-abi-testing
Test-Status: WARNING
http://dpdk.org/patch/152753
_Testing issues_
Submitter: Nithin Dabilpuram <ndabilpuram@marvell.com>
Date: Thursday, April 03 2025 07:08:37
DPDK git baseline: Repo:dpdk
Branch: master
CommitID:b40c403777e93242a377c07ff51964480d40b51d
152750-152753 --> testing issues
Upstream job id: Generic-DPDK-Compile-ABI#122214
Test environment and result as below:
+-------------------+----------+
| Environment | abi_test |
+===================+==========+
| CentOS Stream 10 | FAIL |
+-------------------+----------+
| CentOS Stream 9 | FAIL |
+-------------------+----------+
| Debian 12 | FAIL |
+-------------------+----------+
| Fedora 40 | FAIL |
+-------------------+----------+
| Fedora 40 (Clang) | FAIL |
+-------------------+----------+
| Fedora 41 (Clang) | FAIL |
+-------------------+----------+
| Fedora 41 | FAIL |
+-------------------+----------+
| openSUSE Leap 15 | FAIL |
+-------------------+----------+
| RHEL9 | FAIL |
+-------------------+----------+
| RHEL8 | FAIL |
+-------------------+----------+
| Ubuntu 22.04 | FAIL |
+-------------------+----------+
| Ubuntu 24.04 | FAIL |
+-------------------+----------+
==== 20 line log output for Ubuntu 24.04 (abi_test): ====
Functions changes summary: 0 Removed, 0 Changed (295 filtered out), 0 Added (9 filtered out) functions
Variables changes summary: 0 Removed, 0 Changed, 0 Added variable
Functions changes summary: 0 Removed, 1 Changed (17 filtered out), 0 Added (3 filtered out) functions
Variables changes summary: 0 Removed, 0 Changed (2 filtered out), 0 Added variables
1 function with some indirect sub-type change:
[C] 'function int rte_eth_link_get(uint16_t, rte_eth_link*)' at rte_ethdev.c:3065:1 has some indirect sub-type changes:
parameter 2 of type 'rte_eth_link*' has sub-type changes:
in pointed to type 'struct rte_eth_link' at rte_ethdev.h:348:1:
type size hasn't changed
1 data member change:
anonymous data member at offset 0 (in bits) changed from:
union {uint64_t val64; struct {uint32_t link_speed; uint16_t link_duplex; uint16_t link_autoneg; uint16_t link_status;};}
to:
union {uint64_t val64; struct {uint32_t link_speed; uint16_t link_duplex; uint16_t link_autoneg; uint16_t link_status; uint16_t link_type;};}
Error: ABI issue reported for abidiff --suppr /home-local/jenkins-local/jenkins-agent/workspace/Generic-DPDK-Compile-ABI@3/dpdk/devtools/libabigail.abignore --no-added-syms --headers-dir1 reference/usr/local/include --headers-dir2 build_install/usr/local/include reference/usr/local/lib/x86_64-linux-gnu/librte_ethdev.so.25.0 build_install/usr/local/lib/x86_64-linux-gnu/librte_ethdev.so.25.2
ABIDIFF_ABI_CHANGE, this change requires a review (abidiff flagged this as a potential issue).
==== End log output ====
CentOS Stream 10
Kernel: Depends on container host
Compiler: gcc 14.2.1 20241104 (Red Hat 14.2.1-6)
CentOS Stream 9
Kernel: Depends on container host
Compiler: gcc 11.5.0 20240719 (Red Hat 11.5.0-2)
Debian 12
Kernel: Depends on container host
Compiler: gcc (Debian 12.2.0-14) 12.2.0
Fedora 40
Kernel: Depends on container host
Compiler: gcc 14.2.1 20240912 (Red Hat 14.2.1-3)
Fedora 40 (Clang)
Kernel: Depends on container host
Compiler: clang 18.1.8 (Fedora 18.1.8-1.fc40)
Fedora 41 (Clang)
Kernel: Depends on container host
Compiler: clang 19.1.5 (Fedora 19.1.5-1.fc41)
Fedora 41
Kernel: Depends on container host
Compiler: gcc 14.2.1 20240912 (Red Hat 14.2.1-3)
openSUSE Leap 15
Kernel: Depends on container host
Compiler: gcc (SUSE Linux) 7.5.0
RHEL9
Kernel: Depends on container host
Compiler: gcc 11.5.0 20240719 (Red Hat 11.5.0-2)
RHEL8
Kernel: Depends on container host
Compiler: gcc 8.5.0 20210514 (Red Hat 8.5.0-22)
Ubuntu 22.04
Kernel: Depends on container host
Compiler: gcc (Ubuntu 11.4.0-1ubuntu1~22.04) 11.4.0
Ubuntu 24.04
Kernel: Depends on container host
Compiler: gcc (Ubuntu 13.3.0-6ubuntu2~24.04) 13.3.0
To view detailed results, visit:
https://lab.dpdk.org/results/dashboard/patchsets/32939/
UNH-IOL DPDK Community Lab
To manage your email subscriptions, visit:
https://lab.dpdk.org/results/dashboard/preferences/subscriptions/
^ permalink raw reply [flat|nested] 30+ messages in thread
* |FAILURE| pw152750-152753 [PATCH] [RFC,4/4] net/cnxk: report link ty
[not found] <20250403070837.926292-4-ndabilpuram@marvell.com>
` (19 preceding siblings ...)
2025-04-03 10:50 ` |WARNING| " dpdklab
@ 2025-04-03 11:41 ` dpdklab
2025-04-03 11:53 ` |SUCCESS| " dpdklab
` (8 subsequent siblings)
29 siblings, 0 replies; 30+ messages in thread
From: dpdklab @ 2025-04-03 11:41 UTC (permalink / raw)
To: Test Report; +Cc: dpdk-test-reports, Nithin Dabilpuram
Test-Label: iol-unit-arm64-testing
Test-Status: FAILURE
http://dpdk.org/patch/152753
_Testing issues_
Submitter: Nithin Dabilpuram <ndabilpuram@marvell.com>
Date: Thursday, April 03 2025 07:08:37
DPDK git baseline: Repo:dpdk
Branch: master
CommitID:b40c403777e93242a377c07ff51964480d40b51d
152750-152753 --> testing issues
Upstream job id: Generic-Unit-Test-DPDK#328618
Test environment and result as below:
+-----------------------------+----------------+--------------+------------------------------+---------------------------+
| Environment | dpdk_unit_test | lpm_autotest | cryptodev_sw_snow3g_autotest | cryptodev_sw_zuc_autotest |
+=============================+================+==============+==============================+===========================+
| CentOS Stream 9 (ARM) | FAIL | SKIPPED | SKIPPED | SKIPPED |
+-----------------------------+----------------+--------------+------------------------------+---------------------------+
| Fedora 40 (ARM) | FAIL | SKIPPED | SKIPPED | SKIPPED |
+-----------------------------+----------------+--------------+------------------------------+---------------------------+
| 32-bit Ubuntu 22.04.4 (ARM) | PASS | SKIPPED | SKIPPED | SKIPPED |
+-----------------------------+----------------+--------------+------------------------------+---------------------------+
| CentOS Stream 10 (ARM) | FAIL | SKIPPED | SKIPPED | SKIPPED |
+-----------------------------+----------------+--------------+------------------------------+---------------------------+
| Debian 12 (arm) | FAIL | SKIPPED | PASS | PASS |
+-----------------------------+----------------+--------------+------------------------------+---------------------------+
| Fedora 40 (ARM Clang) | FAIL | SKIPPED | SKIPPED | SKIPPED |
+-----------------------------+----------------+--------------+------------------------------+---------------------------+
| Fedora 41 (ARM) | FAIL | SKIPPED | SKIPPED | SKIPPED |
+-----------------------------+----------------+--------------+------------------------------+---------------------------+
| Fedora 41 (ARM Clang) | FAIL | SKIPPED | SKIPPED | SKIPPED |
+-----------------------------+----------------+--------------+------------------------------+---------------------------+
| Ubuntu 20.04 (ARM) | FAIL | SKIPPED | SKIPPED | SKIPPED |
+-----------------------------+----------------+--------------+------------------------------+---------------------------+
| Ubuntu 22.04 (ARM) | FAIL | SKIPPED | SKIPPED | SKIPPED |
+-----------------------------+----------------+--------------+------------------------------+---------------------------+
| RHEL9 (ARM) | FAIL | SKIPPED | SKIPPED | SKIPPED |
+-----------------------------+----------------+--------------+------------------------------+---------------------------+
| Ubuntu 24.04 (ARM) | FAIL | SKIPPED | SKIPPED | SKIPPED |
+-----------------------------+----------------+--------------+------------------------------+---------------------------+
| Ubuntu 20.04 ARM SVE | SKIPPED | PASS | SKIPPED | SKIPPED |
+-----------------------------+----------------+--------------+------------------------------+---------------------------+
==== Unit test summary for Ubuntu 24.04 (ARM) (dpdk_unit_test): ====
ninja: Entering directory `/home-local/jenkins-local/jenkins-agent/workspace/Generic-Unit-Test-DPDK/dpdk/build'
ninja: no work to do.
1/119 DPDK:fast-tests / acl_autotest OK 6.46s
2/119 DPDK:fast-tests / alarm_autotest OK 1.17s
3/119 DPDK:fast-tests / argparse_autotest OK 0.16s
4/119 DPDK:fast-tests / atomic_autotest OK 4.62s
5/119 DPDK:fast-tests / bitcount_autotest OK 0.18s
6/119 DPDK:fast-tests / bitmap_autotest OK 0.17s
7/119 DPDK:fast-tests / bitops_autotest OK 1.67s
8/119 DPDK:fast-tests / bitratestats_autotest OK 0.17s
9/119 DPDK:fast-tests / bitset_autotest OK 2.71s
10/119 DPDK:fast-tests / bpf_autotest OK 0.16s
11/119 DPDK:fast-tests / bpf_convert_autotest OK 0.17s
12/119 DPDK:fast-tests / byteorder_autotest OK 0.17s
13/119 DPDK:fast-tests / cfgfile_autotest OK 0.16s
14/119 DPDK:fast-tests / cksum_autotest OK 0.16s
15/119 DPDK:fast-tests / cmdline_autotest OK 0.17s
16/119 DPDK:fast-tests / common_autotest OK 1.07s
17/119 DPDK:fast-tests / compressdev_autotest SKIP 0.09s exit status 77
18/119 DPDK:fast-tests / cpuflags_autotest OK 0.19s
19/119 DPDK:fast-tests / crc_autotest OK 0.16s
20/119 DPDK:fast-tests / user_delay_us OK 0.16s
21/119 DPDK:fast-tests / debug_autotest OK 0.90s
22/119 DPDK:fast-tests / devargs_autotest OK 0.17s
23/119 DPDK:fast-tests / dispatcher_autotest OK 2.61s
24/119 DPDK:fast-tests / distributor_autotest OK 0.81s
25/119 DPDK:fast-tests / eal_flags_c_opt_autotest OK 1.72s
26/119 DPDK:fast-tests / eal_flags_main_opt_autotest OK 0.55s
27/119 DPDK:fast-tests / eal_flags_n_opt_autotest OK 0.42s
28/119 DPDK:fast-tests / eal_flags_hpet_autotest OK 0.26s
29/119 DPDK:fast-tests / eal_flags_no_huge_autotest OK 0.47s
30/119 DPDK:fast-tests / eal_flags_a_opt_autotest OK 0.67s
31/119 DPDK:fast-tests / eal_flags_b_opt_autotest OK 0.55s
32/119 DPDK:fast-tests / eal_flags_vdev_opt_autotest OK 0.41s
33/119 DPDK:fast-tests / eal_flags_r_opt_autotest OK 0.40s
34/119 DPDK:fast-tests / eal_flags_mem_autotest OK 0.60s
35/119 DPDK:fast-tests / eal_flags_file_prefix_autotest OK 1.63s
36/119 DPDK:fast-tests / eal_flags_misc_autotest OK 2.15s
37/119 DPDK:fast-tests / eal_fs_autotest OK 0.26s
38/119 DPDK:fast-tests / errno_autotest OK 0.20s
39/119 DPDK:fast-tests / ethdev_link_status FAIL 0.16s (exit status 255 or signal 127 SIGinvalid)
>>> DPDK_TEST=ethdev_link_status MALLOC_PERTURB_=181 /home-local/jenkins-local/jenkins-agent/workspace/Generic-Unit-Test-DPDK/dpdk/build/app/dpdk-test --no-huge -m 2048
40/119 DPDK:fast-tests / event_eth_tx_adapter_autotest OK 1.16s
41/119 DPDK:fast-tests / event_ring_autotest OK 0.24s
42/119 DPDK:fast-tests / eventdev_common_autotest OK 0.21s
43/119 DPDK:fast-tests / eventdev_selftest_sw OK 10.78s
44/119 DPDK:fast-tests / fbarray_autotest OK 0.17s
45/119 DPDK:fast-tests / fib_autotest OK 1.18s
46/119 DPDK:fast-tests / fib6_autotest OK 1.08s
47/119 DPDK:fast-tests / func_reentrancy_autotest OK 0.78s
48/119 DPDK:fast-tests / graph_autotest OK 0.19s
49/119 DPDK:fast-tests / node_list_dump OK 0.18s
50/119 DPDK:fast-tests / hash_autotest OK 0.64s
51/119 DPDK:fast-tests / hash_readwrite_func_autotest OK 8.39s
52/119 DPDK:fast-tests / interrupt_autotest OK 1.21s
53/119 DPDK:fast-tests / ipfrag_autotest OK 0.11s
54/119 DPDK:fast-tests / ipsec_autotest SKIP 0.19s exit status 77
55/119 DPDK:fast-tests / kvargs_autotest OK 0.18s
56/119 DPDK:fast-tests / latencystats_autotest OK 0.19s
57/119 DPDK:fast-tests / lcore_var_autotest OK 0.81s
58/119 DPDK:fast-tests / lcores_autotest OK 4.89s
59/119 DPDK:fast-tests / logs_autotest OK 0.22s
60/119 DPDK:fast-tests / lpm_autotest OK 1.84s
61/119 DPDK:fast-tests / lpm6_autotest OK 6.54s
62/119 DPDK:fast-tests / malloc_autotest OK 0.48s
63/119 DPDK:fast-tests / mbuf_autotest OK 1.94s
64/119 DPDK:fast-tests / mcslock_autotest OK 0.91s
65/119 DPDK:fast-tests / member_autotest OK 2.23s
66/119 DPDK:fast-tests / memcpy_autotest OK 9.71s
67/119 DPDK:fast-tests / memory_autotest OK 0.15s
68/119 DPDK:fast-tests / mempool_autotest OK 0.60s
69/119 DPDK:fast-tests / memzone_autotest OK 0.12s
70/119 DPDK:fast-tests / meter_autotest OK 0.22s
71/119 DPDK:fast-tests / metrics_autotest OK 0.19s
72/119 DPDK:fast-tests / multiprocess_autotest OK 0.43s
73/119 DPDK:fast-tests / net_ether_autotest OK 1.37s
74/119 DPDK:fast-tests / net_ipv6_autotest OK 0.17s
75/119 DPDK:fast-tests / pcapng_autotest OK 7.46s
76/119 DPDK:fast-tests / pdcp_autotest SKIP 0.12s exit status 77
77/119 DPDK:fast-tests / pdump_autotest OK 0.51s
78/119 DPDK:fast-tests / per_lcore_autotest OK 0.33s
79/119 DPDK:fast-tests / pflock_autotest OK 0.55s
80/119 DPDK:fast-tests / pie_autotest OK 0.17s
81/119 DPDK:fast-tests / ring_pmd_autotest OK 0.18s
82/119 DPDK:fast-tests / power_autotest OK 0.17s
83/119 DPDK:fast-tests / power_cpufreq_autotest SKIP 0.10s exit status 77
84/119 DPDK:fast-tests / power_intel_uncore_autotest SKIP 0.23s exit status 77
85/119 DPDK:fast-tests / power_kvm_vm_autotest SKIP 0.10s exit status 77
86/119 DPDK:fast-tests / prefetch_autotest OK 0.23s
87/119 DPDK:fast-tests / ptr_compress_autotest OK 0.19s
88/119 DPDK:fast-tests / rawdev_autotest OK 0.18s
89/119 DPDK:fast-tests / rcu_qsbr_autotest OK 0.73s
90/119 DPDK:fast-tests / reorder_autotest OK 0.45s
91/119 DPDK:fast-tests / rib_autotest OK 4.15s
92/119 DPDK:fast-tests / rib6_autotest OK 4.32s
93/119 DPDK:fast-tests / ring_autotest OK 0.22s
94/119 DPDK:fast-tests / rwlock_test1_autotest OK 0.52s
95/119 DPDK:fast-tests / rwlock_rda_autotest OK 5.19s
96/119 DPDK:fast-tests / rwlock_rds_wrm_autotest OK 5.17s
97/119 DPDK:fast-tests / rwlock_rde_wro_autotest OK 5.18s
98/119 DPDK:fast-tests / sched_autotest OK 0.18s
99/119 DPDK:fast-tests / security_autotest OK 0.11s
100/119 DPDK:fast-tests / seqlock_autotest OK 2.25s
101/119 DPDK:fast-tests / service_autotest OK 3.13s
102/119 DPDK:fast-tests / soring_autotest OK 0.17s
103/119 DPDK:fast-tests / spinlock_autotest OK 0.20s
104/119 DPDK:fast-tests / stack_autotest OK 0.37s
105/119 DPDK:fast-tests / stack_lf_autotest OK 0.34s
106/119 DPDK:fast-tests / string_autotest OK 0.19s
107/119 DPDK:fast-tests / table_autotest OK 7.43s
108/119 DPDK:fast-tests / tailq_autotest OK 0.18s
109/119 DPDK:fast-tests / telemetry_data_autotest OK 0.18s
110/119 DPDK:fast-tests / telemetry_json_autotest OK 0.17s
111/119 DPDK:fast-tests / thash_autotest OK 0.20s
112/119 DPDK:fast-tests / threads_autotest OK 0.35s
113/119 DPDK:fast-tests / ticketlock_autotest OK 0.21s
114/119 DPDK:fast-tests / timer_autotest OK 2.87s
115/119 DPDK:fast-tests / trace_autotest OK 0.22s
116/119 DPDK:fast-tests / trace_autotest_with_traces OK 0.19s
117/119 DPDK:fast-tests / vdev_autotest OK 0.20s
118/119 DPDK:fast-tests / version_autotest OK 0.17s
119/119 DPDK:fast-tests / telemetry_all OK 1.55s
Ok: 112
Expected Fail: 0
Fail: 1
Unexpected Pass: 0
Skipped: 6
Timeout: 0
Full log written to /home-local/jenkins-local/jenkins-agent/workspace/Generic-Unit-Test-DPDK/dpdk/build/meson-logs/testlog.txt
Test log output from the failed test ethdev_link_status:
Sorry, we were not able to find the logs for this test.
Download the log output from the CI site for this test run.
==== End log output ====
CentOS Stream 9 (ARM)
Kernel: Depends on container host
Compiler: gcc 11.5.0 20240719 (Red Hat 11.5.0-2)
Fedora 40 (ARM)
Kernel: Depends on container host
Compiler: gcc 14.2.1 20240912 (Red Hat 14.2.1-3)
32-bit Ubuntu 22.04.4 (ARM)
Kernel: 5.15.83+ aarch64
Compiler: gcc (Ubuntu 11.4.0-1ubuntu1~22.04) 11.4.0
CentOS Stream 10 (ARM)
Kernel: Depends on container host
Compiler: gcc 14.2.1 20241104 (Red Hat 14.2.1-6)
Debian 12 (arm)
Kernel: Depends on container host
Compiler: gcc (Debian 12.2.0-14) 12.2.0
Fedora 40 (ARM Clang)
Kernel: Depends on container host
Compiler: clang 18.1.8 (Fedora 18.1.8-1.fc40)
Fedora 41 (ARM)
Kernel: Depends on container host
Compiler: gcc 14.2.1 20240912 (Red Hat 14.2.1-3)
Fedora 41 (ARM Clang)
Kernel: Depends on container host
Compiler: clang 19.1.5 (Fedora 19.1.5-1.fc41)
Ubuntu 20.04 (ARM)
Kernel: Depends on container host
Compiler: gcc (Ubuntu 9.4.0-1ubuntu1~20.04.2) 9.4.0
Ubuntu 22.04 (ARM)
Kernel: Depends on container host
Compiler: gcc (Ubuntu 11.4.0-1ubuntu1~22.04) 11.4.0
RHEL9 (ARM)
Kernel: Depends on container host
Compiler: gcc 11.5.0 20240719 (Red Hat 11.5.0-2)
Ubuntu 24.04 (ARM)
Kernel: Depends on container host
Compiler: gcc (Ubuntu 13.3.0-6ubuntu2~24.04) 13.3.0
Ubuntu 20.04 ARM SVE
Kernel: Depends on container host
Compiler: gcc (Ubuntu 10.5.0-1ubuntu1~20.04) 10.5.0
To view detailed results, visit:
https://lab.dpdk.org/results/dashboard/patchsets/32939/
UNH-IOL DPDK Community Lab
To manage your email subscriptions, visit:
https://lab.dpdk.org/results/dashboard/preferences/subscriptions/
^ permalink raw reply [flat|nested] 30+ messages in thread
* |SUCCESS| pw152750-152753 [PATCH] [RFC,4/4] net/cnxk: report link ty
[not found] <20250403070837.926292-4-ndabilpuram@marvell.com>
` (20 preceding siblings ...)
2025-04-03 11:41 ` |FAILURE| " dpdklab
@ 2025-04-03 11:53 ` dpdklab
2025-04-03 12:12 ` |FAILURE| " dpdklab
` (7 subsequent siblings)
29 siblings, 0 replies; 30+ messages in thread
From: dpdklab @ 2025-04-03 11:53 UTC (permalink / raw)
To: Test Report; +Cc: dpdk-test-reports
Test-Label: iol-compile-amd64-testing
Test-Status: SUCCESS
http://dpdk.org/patch/152753
_Testing PASS_
Submitter: Nithin Dabilpuram <ndabilpuram@marvell.com>
Date: Thursday, April 03 2025 07:08:37
DPDK git baseline: Repo:dpdk
Branch: master
CommitID:b40c403777e93242a377c07ff51964480d40b51d
152750-152753 --> testing pass
Upstream job id: Generic-DPDK-Compile-Meson#377121
Test environment and result as below:
+-----------------------------------+--------------------+-------------------+------------------+-------------------------+-------------------+----------------------+
| Environment | dpdk_meson_compile | dpdk_compile_spdk | dpdk_compile_ovs | dpdk_llvm_clang_compile | dpdk_msvc_compile | dpdk_mingw64_compile |
+===================================+====================+===================+==================+=========================+===================+======================+
| CentOS Stream 9 | PASS | PASS | SKIPPED | SKIPPED | SKIPPED | SKIPPED |
+-----------------------------------+--------------------+-------------------+------------------+-------------------------+-------------------+----------------------+
| Fedora 40 (Clang) | PASS | PASS | SKIPPED | SKIPPED | SKIPPED | SKIPPED |
+-----------------------------------+--------------------+-------------------+------------------+-------------------------+-------------------+----------------------+
| Debian 12 | PASS | PASS | SKIPPED | SKIPPED | SKIPPED | SKIPPED |
+-----------------------------------+--------------------+-------------------+------------------+-------------------------+-------------------+----------------------+
| Fedora 41 (Clang) | PASS | PASS | PASS | SKIPPED | SKIPPED | SKIPPED |
+-----------------------------------+--------------------+-------------------+------------------+-------------------------+-------------------+----------------------+
| Fedora 40 | PASS | PASS | SKIPPED | SKIPPED | SKIPPED | SKIPPED |
+-----------------------------------+--------------------+-------------------+------------------+-------------------------+-------------------+----------------------+
| openSUSE Leap 15 | PASS | SKIPPED | SKIPPED | SKIPPED | SKIPPED | SKIPPED |
+-----------------------------------+--------------------+-------------------+------------------+-------------------------+-------------------+----------------------+
| Fedora 41 | PASS | PASS | PASS | SKIPPED | SKIPPED | SKIPPED |
+-----------------------------------+--------------------+-------------------+------------------+-------------------------+-------------------+----------------------+
| RHEL8 | PASS | SKIPPED | SKIPPED | SKIPPED | SKIPPED | SKIPPED |
+-----------------------------------+--------------------+-------------------+------------------+-------------------------+-------------------+----------------------+
| RHEL9 | PASS | SKIPPED | SKIPPED | SKIPPED | SKIPPED | SKIPPED |
+-----------------------------------+--------------------+-------------------+------------------+-------------------------+-------------------+----------------------+
| Ubuntu 20.04 | PASS | SKIPPED | SKIPPED | SKIPPED | SKIPPED | SKIPPED |
+-----------------------------------+--------------------+-------------------+------------------+-------------------------+-------------------+----------------------+
| Ubuntu 22.04 | PASS | PASS | SKIPPED | SKIPPED | SKIPPED | SKIPPED |
+-----------------------------------+--------------------+-------------------+------------------+-------------------------+-------------------+----------------------+
| Ubuntu 24.04 | PASS | PASS | PASS | SKIPPED | SKIPPED | SKIPPED |
+-----------------------------------+--------------------+-------------------+------------------+-------------------------+-------------------+----------------------+
| Alpine | PASS | SKIPPED | SKIPPED | SKIPPED | SKIPPED | SKIPPED |
+-----------------------------------+--------------------+-------------------+------------------+-------------------------+-------------------+----------------------+
| Ubuntu 24.04 32 Bit Cross Compile | PASS | SKIPPED | SKIPPED | SKIPPED | SKIPPED | SKIPPED |
+-----------------------------------+--------------------+-------------------+------------------+-------------------------+-------------------+----------------------+
| FreeBSD 13.5 | PASS | SKIPPED | SKIPPED | SKIPPED | SKIPPED | SKIPPED |
+-----------------------------------+--------------------+-------------------+------------------+-------------------------+-------------------+----------------------+
| FreeBSD 14.2 | PASS | SKIPPED | SKIPPED | SKIPPED | SKIPPED | SKIPPED |
+-----------------------------------+--------------------+-------------------+------------------+-------------------------+-------------------+----------------------+
| CentOS Stream 10 | PASS | SKIPPED | SKIPPED | SKIPPED | SKIPPED | SKIPPED |
+-----------------------------------+--------------------+-------------------+------------------+-------------------------+-------------------+----------------------+
| Windows Server 2022 | SKIPPED | SKIPPED | SKIPPED | PASS | PASS | PASS |
+-----------------------------------+--------------------+-------------------+------------------+-------------------------+-------------------+----------------------+
CentOS Stream 9
Kernel: Depends on container host
Compiler: gcc 11.5.0 20240719 (Red Hat 11.5.0-2)
Fedora 40 (Clang)
Kernel: Depends on container host
Compiler: clang 18.1.8 (Fedora 18.1.8-1.fc40)
Debian 12
Kernel: Depends on container host
Compiler: gcc (Debian 12.2.0-14) 12.2.0
Fedora 41 (Clang)
Kernel: Depends on container host
Compiler: clang 19.1.5 (Fedora 19.1.5-1.fc41)
Fedora 40
Kernel: Depends on container host
Compiler: gcc 14.2.1 20240912 (Red Hat 14.2.1-3)
openSUSE Leap 15
Kernel: Depends on container host
Compiler: gcc (SUSE Linux) 7.5.0
Fedora 41
Kernel: Depends on container host
Compiler: gcc 14.2.1 20240912 (Red Hat 14.2.1-3)
RHEL8
Kernel: Depends on container host
Compiler: gcc 8.5.0 20210514 (Red Hat 8.5.0-22)
RHEL9
Kernel: Depends on container host
Compiler: gcc 11.5.0 20240719 (Red Hat 11.5.0-2)
Ubuntu 20.04
Kernel: Depends on container host
Compiler: gcc (Ubuntu 9.4.0-1ubuntu1~20.04.2) 9.4.0
Ubuntu 22.04
Kernel: Depends on container host
Compiler: gcc (Ubuntu 11.4.0-1ubuntu1~22.04) 11.4.0
Ubuntu 24.04
Kernel: Depends on container host
Compiler: gcc (Ubuntu 13.3.0-6ubuntu2~24.04) 13.3.0
Alpine
Kernel: Depends on container host
Compiler: gcc (Alpine 14.2.0) 14.2.0
Ubuntu 24.04 32 Bit Cross Compile
Kernel: Depends on container host
Compiler: gcc (Ubuntu 13.3.0-6ubuntu2~24.04) 13.3.0
FreeBSD 13.5
Kernel: 13.5-RELEASE
Compiler: clang 19.1.7
FreeBSD 14.2
Kernel: 14.2-RELEASE
Compiler: clang 18.1.6
CentOS Stream 10
Kernel: Depends on container host
Compiler: gcc 14.2.1 20241104 (Red Hat 14.2.1-6)
Windows Server 2022
Kernel: 10.0.20348.2031
Compiler: clang 15.0.7, gcc 14.1.0 (MinGW), and MSVC VS 19.39.33521
To view detailed results, visit:
https://lab.dpdk.org/results/dashboard/patchsets/32939/
UNH-IOL DPDK Community Lab
To manage your email subscriptions, visit:
https://lab.dpdk.org/results/dashboard/preferences/subscriptions/
^ permalink raw reply [flat|nested] 30+ messages in thread
* |FAILURE| pw152750-152753 [PATCH] [RFC,4/4] net/cnxk: report link ty
[not found] <20250403070837.926292-4-ndabilpuram@marvell.com>
` (21 preceding siblings ...)
2025-04-03 11:53 ` |SUCCESS| " dpdklab
@ 2025-04-03 12:12 ` dpdklab
2025-04-03 12:59 ` dpdklab
` (6 subsequent siblings)
29 siblings, 0 replies; 30+ messages in thread
From: dpdklab @ 2025-04-03 12:12 UTC (permalink / raw)
To: Test Report; +Cc: dpdk-test-reports, Nithin Dabilpuram
Test-Label: iol-unit-amd64-testing
Test-Status: FAILURE
http://dpdk.org/patch/152753
_Testing issues_
Submitter: Nithin Dabilpuram <ndabilpuram@marvell.com>
Date: Thursday, April 03 2025 07:08:37
DPDK git baseline: Repo:dpdk
Branch: master
CommitID:b40c403777e93242a377c07ff51964480d40b51d
152750-152753 --> testing issues
Upstream job id: Generic-VM-Unit-Test-DPDK#27783
Test environment and result as below:
+---------------------+----------------+
| Environment | dpdk_unit_test |
+=====================+================+
| CentOS Stream 9 | FAIL |
+---------------------+----------------+
| CentOS Stream 10 | FAIL |
+---------------------+----------------+
| Fedora 40 | FAIL |
+---------------------+----------------+
| Debian 12 | FAIL |
+---------------------+----------------+
| Fedora 40 (Clang) | FAIL |
+---------------------+----------------+
| Fedora 41 (Clang) | FAIL |
+---------------------+----------------+
| Fedora 41 | FAIL |
+---------------------+----------------+
| RHEL9 | FAIL |
+---------------------+----------------+
| RHEL8 | FAIL |
+---------------------+----------------+
| Ubuntu 20.04 | FAIL |
+---------------------+----------------+
| Ubuntu 24.04 | FAIL |
+---------------------+----------------+
| Ubuntu 22.04 | FAIL |
+---------------------+----------------+
| Windows Server 2022 | FAIL |
+---------------------+----------------+
==== Unit test summary for Windows Server 2022 (dpdk_unit_test): ====
Failed to get the unit test results.
Displaying the unit test results is not supported for some environments,
such as our aarch32 testing, where meson is not used to run the tests.
Download the logs available on our CI site.
==== End log output ====
CentOS Stream 9
Kernel: Depends on container host
Compiler: gcc 11.5.0 20240719 (Red Hat 11.5.0-2)
CentOS Stream 10
Kernel: Depends on container host
Compiler: gcc 14.2.1 20241104 (Red Hat 14.2.1-6)
Fedora 40
Kernel: Depends on container host
Compiler: gcc 14.2.1 20240912 (Red Hat 14.2.1-3)
Debian 12
Kernel: Depends on container host
Compiler: gcc (Debian 12.2.0-14) 12.2.0
Fedora 40 (Clang)
Kernel: Depends on container host
Compiler: clang 18.1.8 (Fedora 18.1.8-1.fc40)
Fedora 41 (Clang)
Kernel: Depends on container host
Compiler: clang 19.1.5 (Fedora 19.1.5-1.fc41)
Fedora 41
Kernel: Depends on container host
Compiler: gcc 14.2.1 20240912 (Red Hat 14.2.1-3)
RHEL9
Kernel: Depends on container host
Compiler: gcc 11.5.0 20240719 (Red Hat 11.5.0-2)
RHEL8
Kernel: Depends on container host
Compiler: gcc 8.5.0 20210514 (Red Hat 8.5.0-22)
Ubuntu 20.04
Kernel: Depends on container host
Compiler: gcc (Ubuntu 9.4.0-1ubuntu1~20.04.2) 9.4.0
Ubuntu 24.04
Kernel: Depends on container host
Compiler: gcc (Ubuntu 13.3.0-6ubuntu2~24.04) 13.3.0
Ubuntu 22.04
Kernel: Depends on container host
Compiler: gcc (Ubuntu 11.4.0-1ubuntu1~22.04) 11.4.0
Windows Server 2022
Kernel: 10.0.20348.2031
Compiler: clang 15.0.7, gcc 14.1.0 (MinGW), and MSVC VS 19.39.33521
To view detailed results, visit:
https://lab.dpdk.org/results/dashboard/patchsets/32939/
UNH-IOL DPDK Community Lab
To manage your email subscriptions, visit:
https://lab.dpdk.org/results/dashboard/preferences/subscriptions/
^ permalink raw reply [flat|nested] 30+ messages in thread
* |FAILURE| pw152750-152753 [PATCH] [RFC,4/4] net/cnxk: report link ty
[not found] <20250403070837.926292-4-ndabilpuram@marvell.com>
` (22 preceding siblings ...)
2025-04-03 12:12 ` |FAILURE| " dpdklab
@ 2025-04-03 12:59 ` dpdklab
2025-04-03 13:29 ` |SUCCESS| " dpdklab
` (5 subsequent siblings)
29 siblings, 0 replies; 30+ messages in thread
From: dpdklab @ 2025-04-03 12:59 UTC (permalink / raw)
To: Test Report; +Cc: dpdk-test-reports, Nithin Dabilpuram
Test-Label: iol-unit-amd64-testing
Test-Status: FAILURE
http://dpdk.org/patch/152753
_Testing issues_
Submitter: Nithin Dabilpuram <ndabilpuram@marvell.com>
Date: Thursday, April 03 2025 07:08:37
DPDK git baseline: Repo:dpdk
Branch: master
CommitID:b40c403777e93242a377c07ff51964480d40b51d
152750-152753 --> testing issues
Upstream job id: Generic-VM-Unit-Test-DPDK#27784
Test environment and result as below:
+---------------------+----------------+
| Environment | dpdk_unit_test |
+=====================+================+
| CentOS Stream 9 | FAIL |
+---------------------+----------------+
| CentOS Stream 10 | FAIL |
+---------------------+----------------+
| Fedora 40 | FAIL |
+---------------------+----------------+
| Debian 12 | FAIL |
+---------------------+----------------+
| Fedora 40 (Clang) | FAIL |
+---------------------+----------------+
| Fedora 41 (Clang) | FAIL |
+---------------------+----------------+
| Fedora 41 | FAIL |
+---------------------+----------------+
| RHEL9 | FAIL |
+---------------------+----------------+
| RHEL8 | FAIL |
+---------------------+----------------+
| Ubuntu 20.04 | PASS |
+---------------------+----------------+
| Ubuntu 24.04 | FAIL |
+---------------------+----------------+
| Ubuntu 22.04 | FAIL |
+---------------------+----------------+
| Windows Server 2022 | FAIL |
+---------------------+----------------+
==== Unit test summary for Windows Server 2022 (dpdk_unit_test): ====
Failed to get the unit test results.
Displaying the unit test results is not supported for some environments,
such as our aarch32 testing, where meson is not used to run the tests.
Download the logs available on our CI site.
==== End log output ====
CentOS Stream 9
Kernel: Depends on container host
Compiler: gcc 11.5.0 20240719 (Red Hat 11.5.0-2)
CentOS Stream 10
Kernel: Depends on container host
Compiler: gcc 14.2.1 20241104 (Red Hat 14.2.1-6)
Fedora 40
Kernel: Depends on container host
Compiler: gcc 14.2.1 20240912 (Red Hat 14.2.1-3)
Debian 12
Kernel: Depends on container host
Compiler: gcc (Debian 12.2.0-14) 12.2.0
Fedora 40 (Clang)
Kernel: Depends on container host
Compiler: clang 18.1.8 (Fedora 18.1.8-1.fc40)
Fedora 41 (Clang)
Kernel: Depends on container host
Compiler: clang 19.1.5 (Fedora 19.1.5-1.fc41)
Fedora 41
Kernel: Depends on container host
Compiler: gcc 14.2.1 20240912 (Red Hat 14.2.1-3)
RHEL9
Kernel: Depends on container host
Compiler: gcc 11.5.0 20240719 (Red Hat 11.5.0-2)
RHEL8
Kernel: Depends on container host
Compiler: gcc 8.5.0 20210514 (Red Hat 8.5.0-22)
Ubuntu 20.04
Kernel: Depends on container host
Compiler: gcc (Ubuntu 9.4.0-1ubuntu1~20.04.2) 9.4.0
Ubuntu 24.04
Kernel: Depends on container host
Compiler: gcc (Ubuntu 13.3.0-6ubuntu2~24.04) 13.3.0
Ubuntu 22.04
Kernel: Depends on container host
Compiler: gcc (Ubuntu 11.4.0-1ubuntu1~22.04) 11.4.0
Windows Server 2022
Kernel: 10.0.20348.2031
Compiler: clang 15.0.7, gcc 14.1.0 (MinGW), and MSVC VS 19.39.33521
To view detailed results, visit:
https://lab.dpdk.org/results/dashboard/patchsets/32939/
UNH-IOL DPDK Community Lab
To manage your email subscriptions, visit:
https://lab.dpdk.org/results/dashboard/preferences/subscriptions/
^ permalink raw reply [flat|nested] 30+ messages in thread
* |SUCCESS| pw152750-152753 [PATCH] [RFC,4/4] net/cnxk: report link ty
[not found] <20250403070837.926292-4-ndabilpuram@marvell.com>
` (23 preceding siblings ...)
2025-04-03 12:59 ` dpdklab
@ 2025-04-03 13:29 ` dpdklab
2025-04-03 15:53 ` dpdklab
` (4 subsequent siblings)
29 siblings, 0 replies; 30+ messages in thread
From: dpdklab @ 2025-04-03 13:29 UTC (permalink / raw)
To: Test Report; +Cc: dpdk-test-reports
Test-Label: iol-compile-arm64-testing
Test-Status: SUCCESS
http://dpdk.org/patch/152753
_Testing PASS_
Submitter: Nithin Dabilpuram <ndabilpuram@marvell.com>
Date: Thursday, April 03 2025 07:08:37
DPDK git baseline: Repo:dpdk
Branch: master
CommitID:b40c403777e93242a377c07ff51964480d40b51d
152750-152753 --> testing pass
Upstream job id: Generic-DPDK-Compile-Meson#377147
Test environment and result as below:
+----------------------------------------+--------------------+
| Environment | dpdk_meson_compile |
+========================================+====================+
| RHEL9 (ARM) | PASS |
+----------------------------------------+--------------------+
| Ubuntu 20.04 ARM GCC Cross Compile | PASS |
+----------------------------------------+--------------------+
| Ubuntu 20.04 ARM SVE | PASS |
+----------------------------------------+--------------------+
| Debian 12 with MUSDK | PASS |
+----------------------------------------+--------------------+
| Fedora 41 (ARM Clang) | PASS |
+----------------------------------------+--------------------+
| Fedora 40 (ARM Clang) | PASS |
+----------------------------------------+--------------------+
| Fedora 41 (ARM) | PASS |
+----------------------------------------+--------------------+
| Fedora 40 (ARM) | PASS |
+----------------------------------------+--------------------+
| Ubuntu 20.04 (ARM) | PASS |
+----------------------------------------+--------------------+
| Ubuntu 22.04 (ARM) | PASS |
+----------------------------------------+--------------------+
| Ubuntu 24.04 (ARM) | PASS |
+----------------------------------------+--------------------+
| CentOS Stream 9 (ARM) | PASS |
+----------------------------------------+--------------------+
| Debian 12 (arm) | PASS |
+----------------------------------------+--------------------+
| CentOS Stream 10 (ARM) | PASS |
+----------------------------------------+--------------------+
| Ubuntu 20.04 ARM Clang Cross Compile | PASS |
+----------------------------------------+--------------------+
| Ubuntu 20.04 aarch32 GCC Cross Compile | PASS |
+----------------------------------------+--------------------+
RHEL9 (ARM)
Kernel: Depends on container host
Compiler: gcc 11.5.0 20240719 (Red Hat 11.5.0-2)
Ubuntu 20.04 ARM GCC Cross Compile
Kernel: Depends on container host
Compiler: aarch64-linux-gnu-gcc (Ubuntu 9.4.0-1ubuntu1~20.04.2) 9.4.0
Ubuntu 20.04 ARM SVE
Kernel: Depends on container host
Compiler: gcc (Ubuntu 10.5.0-1ubuntu1~20.04) 10.5.0
Debian 12 with MUSDK
Kernel: Depends on container host
Compiler: gcc (Debian 12.2.0-14) 12.2.0
Fedora 41 (ARM Clang)
Kernel: Depends on container host
Compiler: clang 19.1.5 (Fedora 19.1.5-1.fc41)
Fedora 40 (ARM Clang)
Kernel: Depends on container host
Compiler: clang 18.1.8 (Fedora 18.1.8-1.fc40)
Fedora 41 (ARM)
Kernel: Depends on container host
Compiler: gcc 14.2.1 20240912 (Red Hat 14.2.1-3)
Fedora 40 (ARM)
Kernel: Depends on container host
Compiler: gcc 14.2.1 20240912 (Red Hat 14.2.1-3)
Ubuntu 20.04 (ARM)
Kernel: Depends on container host
Compiler: gcc (Ubuntu 9.4.0-1ubuntu1~20.04.2) 9.4.0
Ubuntu 22.04 (ARM)
Kernel: Depends on container host
Compiler: gcc (Ubuntu 11.4.0-1ubuntu1~22.04) 11.4.0
Ubuntu 24.04 (ARM)
Kernel: Depends on container host
Compiler: gcc (Ubuntu 13.3.0-6ubuntu2~24.04) 13.3.0
CentOS Stream 9 (ARM)
Kernel: Depends on container host
Compiler: gcc 11.5.0 20240719 (Red Hat 11.5.0-2)
Debian 12 (arm)
Kernel: Depends on container host
Compiler: gcc (Debian 12.2.0-14) 12.2.0
CentOS Stream 10 (ARM)
Kernel: Depends on container host
Compiler: gcc 14.2.1 20241104 (Red Hat 14.2.1-6)
Ubuntu 20.04 ARM Clang Cross Compile
Kernel: Depends on container host
Compiler: clang 10.0.0-4ubuntu1
Ubuntu 20.04 aarch32 GCC Cross Compile
Kernel: Depends on container host
Compiler: gcc 9.4.0
To view detailed results, visit:
https://lab.dpdk.org/results/dashboard/patchsets/32939/
UNH-IOL DPDK Community Lab
To manage your email subscriptions, visit:
https://lab.dpdk.org/results/dashboard/preferences/subscriptions/
^ permalink raw reply [flat|nested] 30+ messages in thread
* |SUCCESS| pw152750-152753 [PATCH] [RFC,4/4] net/cnxk: report link ty
[not found] <20250403070837.926292-4-ndabilpuram@marvell.com>
` (24 preceding siblings ...)
2025-04-03 13:29 ` |SUCCESS| " dpdklab
@ 2025-04-03 15:53 ` dpdklab
2025-04-03 19:32 ` dpdklab
` (3 subsequent siblings)
29 siblings, 0 replies; 30+ messages in thread
From: dpdklab @ 2025-04-03 15:53 UTC (permalink / raw)
To: Test Report; +Cc: dpdk-test-reports
Test-Label: iol-sample-apps-testing
Test-Status: SUCCESS
http://dpdk.org/patch/152753
_Testing PASS_
Submitter: Nithin Dabilpuram <ndabilpuram@marvell.com>
Date: Thursday, April 03 2025 07:08:37
DPDK git baseline: Repo:dpdk
Branch: master
CommitID:b40c403777e93242a377c07ff51964480d40b51d
152750-152753 --> testing pass
Upstream job id: ACVP-FIPS-testing#9442
Test environment and result as below:
+--------------------+----------------------+----------------------+
| Environment | compressdev_zlib_pmd | dpdk_fips_validation |
+====================+======================+======================+
| Ubuntu 22.04 (ARM) | PASS | SKIPPED |
+--------------------+----------------------+----------------------+
| Ubuntu 22.04 | PASS | SKIPPED |
+--------------------+----------------------+----------------------+
| Ubuntu 20.04 | SKIPPED | PASS |
+--------------------+----------------------+----------------------+
Ubuntu 22.04 (ARM)
Kernel: 5.15.0-97-generic
Compiler: gcc gcc (Ubuntu 11.4.0-1ubuntu1~22.04) 11.4.0
Ubuntu 22.04
Kernel: 5.15.0-100-generic
Compiler: gcc gcc (Ubuntu 11.4.0-1ubuntu1~22.04) 11.4.0
Ubuntu 20.04
Kernel: Depends on container host
Compiler: gcc (Ubuntu 9.4.0-1ubuntu1~20.04.2) 9.4.0
To view detailed results, visit:
https://lab.dpdk.org/results/dashboard/patchsets/32939/
UNH-IOL DPDK Community Lab
To manage your email subscriptions, visit:
https://lab.dpdk.org/results/dashboard/preferences/subscriptions/
^ permalink raw reply [flat|nested] 30+ messages in thread
* |SUCCESS| pw152750-152753 [PATCH] [RFC,4/4] net/cnxk: report link ty
[not found] <20250403070837.926292-4-ndabilpuram@marvell.com>
` (25 preceding siblings ...)
2025-04-03 15:53 ` dpdklab
@ 2025-04-03 19:32 ` dpdklab
2025-04-04 0:15 ` dpdklab
` (2 subsequent siblings)
29 siblings, 0 replies; 30+ messages in thread
From: dpdklab @ 2025-04-03 19:32 UTC (permalink / raw)
To: Test Report; +Cc: dpdk-test-reports
Test-Label: iol-mellanox-Functional
Test-Status: SUCCESS
http://dpdk.org/patch/152753
_Functional Testing PASS_
Submitter: Nithin Dabilpuram <ndabilpuram@marvell.com>
Date: Thursday, April 03 2025 07:08:37
DPDK git baseline: Repo:dpdk
Branch: master
CommitID:b40c403777e93242a377c07ff51964480d40b51d
152750-152753 --> functional testing pass
Upstream job id: Template-DPDK-DTS-Pipeline#62
Test environment and result as below:
Ubuntu 24.04
Kernel: 6.8.0-55-generic
Compiler: gcc 13.3.0
NIC: Mellanox ConnectX-5 100000 Mbps
Aggregate Results by Test Suite
+----------------------------------+--------+
| Test Suite | Result |
+==================================+========+
| TestBlocklist | PASS |
+----------------------------------+--------+
| TestPMDBufferScatter | PASS |
+----------------------------------+--------+
| TestPromiscSupport | PASS |
+----------------------------------+--------+
| TestUniPkt | PASS |
+----------------------------------+--------+
| TestDynamicConfig | PASS |
+----------------------------------+--------+
| TestHelloWorld | PASS |
+----------------------------------+--------+
| TestL2fwd | PASS |
+----------------------------------+--------+
| TestMacFilter | PASS |
+----------------------------------+--------+
| TestMTU | PASS |
+----------------------------------+--------+
| TestPortRestartConfigPersistency | PASS |
+----------------------------------+--------+
| TestSoftNIC | PASS |
+----------------------------------+--------+
| TestVLAN | PASS |
+----------------------------------+--------+
To view detailed results, visit:
https://lab.dpdk.org/results/dashboard/patchsets/32939/
UNH-IOL DPDK Community Lab
To manage your email subscriptions, visit:
https://lab.dpdk.org/results/dashboard/preferences/subscriptions/
^ permalink raw reply [flat|nested] 30+ messages in thread
* |SUCCESS| pw152750-152753 [PATCH] [RFC,4/4] net/cnxk: report link ty
[not found] <20250403070837.926292-4-ndabilpuram@marvell.com>
` (26 preceding siblings ...)
2025-04-03 19:32 ` dpdklab
@ 2025-04-04 0:15 ` dpdklab
2025-04-04 0:41 ` dpdklab
2025-04-04 16:43 ` dpdklab
29 siblings, 0 replies; 30+ messages in thread
From: dpdklab @ 2025-04-04 0:15 UTC (permalink / raw)
To: Test Report; +Cc: dpdk-test-reports
Test-Label: iol-broadcom-Performance
Test-Status: SUCCESS
http://dpdk.org/patch/152753
_Performance Testing PASS_
Submitter: Nithin Dabilpuram <ndabilpuram@marvell.com>
Date: Thursday, April 03 2025 07:08:37
DPDK git baseline: Repo:dpdk
Branch: master
CommitID:b40c403777e93242a377c07ff51964480d40b51d
152750-152753 --> performance testing pass
Upstream job id: Template-DTS-Pipeline#220183
Test environment and result as below:
Ubuntu 22.04
Kernel: 5.15.0-100-generic
Compiler: gcc (Ubuntu 11.4.0-1ubuntu1~22.04) 11.4.0
NIC: Broadcom Inc. and subsidiaries BCM57414 NetXtreme-E 10Gb/25Gb RDMA Ethernet Controller 16d7 25 Mbps
Fail/Total: 0/3
Detail performance results:
+------------+---------+----------+-------------+------------------------------+
| frame_size | txd/rxd | num_cpus | num_threads | throughput difference from |
| | | | | expected |
+============+=========+==========+=============+==============================+
| 64 | 128 | 1 | 1 | 0.3% |
+------------+---------+----------+-------------+------------------------------+
| 64 | 512 | 1 | 1 | 1.9% |
+------------+---------+----------+-------------+------------------------------+
| 64 | 2048 | 1 | 1 | 4.2% |
+------------+---------+----------+-------------+------------------------------+
Ubuntu 22.04 ARM
Kernel: 5.15.83+
Compiler: gcc 11.4.0
NIC: Arm Broadcom Inc. brcm_57414 25000 Mbps
Fail/Total: 0/2
Detail performance results:
+------------+---------+----------+-------------+------------------------------+
| frame_size | txd/rxd | num_cpus | num_threads | throughput difference from |
| | | | | expected |
+============+=========+==========+=============+==============================+
| 64 | 512 | 1 | 1 | -0.2% |
+------------+---------+----------+-------------+------------------------------+
| 64 | 2048 | 1 | 1 | 0.3% |
+------------+---------+----------+-------------+------------------------------+
To view detailed results, visit:
https://lab.dpdk.org/results/dashboard/patchsets/32939/
UNH-IOL DPDK Community Lab
To manage your email subscriptions, visit:
https://lab.dpdk.org/results/dashboard/preferences/subscriptions/
^ permalink raw reply [flat|nested] 30+ messages in thread
* |SUCCESS| pw152750-152753 [PATCH] [RFC,4/4] net/cnxk: report link ty
[not found] <20250403070837.926292-4-ndabilpuram@marvell.com>
` (27 preceding siblings ...)
2025-04-04 0:15 ` dpdklab
@ 2025-04-04 0:41 ` dpdklab
2025-04-04 16:43 ` dpdklab
29 siblings, 0 replies; 30+ messages in thread
From: dpdklab @ 2025-04-04 0:41 UTC (permalink / raw)
To: Test Report; +Cc: dpdk-test-reports
Test-Label: iol-intel-Functional
Test-Status: SUCCESS
http://dpdk.org/patch/152753
_Functional Testing PASS_
Submitter: Nithin Dabilpuram <ndabilpuram@marvell.com>
Date: Thursday, April 03 2025 07:08:37
DPDK git baseline: Repo:dpdk
Branch: master
CommitID:b40c403777e93242a377c07ff51964480d40b51d
152750-152753 --> functional testing pass
Upstream job id: Template-DTS-Pipeline#220188
Test environment and result as below:
Ubuntu 24.04 LTS
Kernel: 6.8.0-44-generic
Compiler: gcc 13.2.0
NIC: Intel Corporation Ethernet Controller XL710 for 40GbE QSFP+ 40 Mbps
Aggregate Results by Test Suite
+----------------------+--------+
| Test Suite | Result |
+======================+========+
| TestBlocklist | PASS |
+----------------------+--------+
| TestMacFilter | PASS |
+----------------------+--------+
| TestDynamicConfig | PASS |
+----------------------+--------+
| TestDynamicQueueConf | PASS |
+----------------------+--------+
| TestPMDBufferScatter | PASS |
+----------------------+--------+
| TestPromiscSupport | PASS |
+----------------------+--------+
| TestUniPkt | PASS |
+----------------------+--------+
Ubuntu 20.04
Kernel: 5.4.0-122-generic
Compiler: gcc 9.4.0
NIC: Intel Corporation Ethernet Converged Network Adapter XL710-QDA2 40000 Mbps
Aggregate Results by Test Suite
+-----------------------------+--------+
| Test Suite | Result |
+=============================+========+
| unit_tests_mbuf | PASS |
+-----------------------------+--------+
| vhost_virtio_user_interrupt | PASS |
+-----------------------------+--------+
| virtio_smoke | PASS |
+-----------------------------+--------+
Ubuntu 22.04
Kernel: 5.15.0-131-generic
Compiler: gcc (Ubuntu 11.4.0-1ubuntu1~22.04) 11.4.0
NIC: Intel Corporation Ethernet Converged Network Adapter 82599ES 10000 Mbps
Aggregate Results by Test Suite
+-----------------------------+--------+
| Test Suite | Result |
+=============================+========+
| unit_tests_mbuf | PASS |
+-----------------------------+--------+
| vhost_virtio_user_interrupt | PASS |
+-----------------------------+--------+
| virtio_smoke | PASS |
+-----------------------------+--------+
Arm Ampere Altra - Ubuntu 22.04
Kernel: 5.15.83+
Compiler: gcc 11.4
NIC: Intel Corporation QAT 8970 0 Mbps
Aggregate Results by Test Suite
+----------------------------+--------+
| Test Suite | Result |
+============================+========+
| crypto_perf_cryptodev_perf | PASS |
+----------------------------+--------+
To view detailed results, visit:
https://lab.dpdk.org/results/dashboard/patchsets/32939/
UNH-IOL DPDK Community Lab
To manage your email subscriptions, visit:
https://lab.dpdk.org/results/dashboard/preferences/subscriptions/
^ permalink raw reply [flat|nested] 30+ messages in thread
* |SUCCESS| pw152750-152753 [PATCH] [RFC,4/4] net/cnxk: report link ty
[not found] <20250403070837.926292-4-ndabilpuram@marvell.com>
` (28 preceding siblings ...)
2025-04-04 0:41 ` dpdklab
@ 2025-04-04 16:43 ` dpdklab
29 siblings, 0 replies; 30+ messages in thread
From: dpdklab @ 2025-04-04 16:43 UTC (permalink / raw)
To: Test Report; +Cc: dpdk-test-reports
Test-Label: iol-marvell-Functional
Test-Status: SUCCESS
http://dpdk.org/patch/152753
_Functional Testing PASS_
Submitter: Nithin Dabilpuram <ndabilpuram@marvell.com>
Date: Thursday, April 03 2025 07:08:37
DPDK git baseline: Repo:dpdk
Branch: master
CommitID:b40c403777e93242a377c07ff51964480d40b51d
152750-152753 --> functional testing pass
Upstream job id: Template-DTS-Pipeline#220189
Test environment and result as below:
Ubuntu 20.04.6
Kernel: 5.4.105
Compiler: gcc 9.4
NIC: Marvell CN106XX 50000 Mbps
Target: arm64-native-linuxapp-gcc
Aggregate Results by Test Suite
+----------------+--------+
| Test Suite | Result |
+================+========+
| cmdline | PASS |
+----------------+--------+
| rxtx_callbacks | PASS |
+----------------+--------+
To view detailed results, visit:
https://lab.dpdk.org/results/dashboard/patchsets/32939/
UNH-IOL DPDK Community Lab
To manage your email subscriptions, visit:
https://lab.dpdk.org/results/dashboard/preferences/subscriptions/
^ permalink raw reply [flat|nested] 30+ messages in thread
end of thread, other threads:[~2025-04-04 16:43 UTC | newest]
Thread overview: 30+ messages (download: mbox.gz / follow: Atom feed)
-- links below jump to the message on this page --
[not found] <20250403070837.926292-4-ndabilpuram@marvell.com>
2025-04-03 6:35 ` |SUCCESS| pw152750-152753 [RFC PATCH 4/4] net/cnxk: report link type along with link status qemudev
2025-04-03 6:41 ` |FAILURE| " qemudev
2025-04-03 7:09 ` |SUCCESS| pw152753 " checkpatch
2025-04-03 8:02 ` |FAILURE| " 0-day Robot
2025-04-03 8:33 ` |SUCCESS| pw152750-152753 [PATCH] [RFC,4/4] net/cnxk: report link ty dpdklab
2025-04-03 8:39 ` dpdklab
2025-04-03 8:41 ` dpdklab
2025-04-03 8:55 ` dpdklab
2025-04-03 9:01 ` dpdklab
2025-04-03 9:03 ` dpdklab
2025-04-03 9:26 ` dpdklab
2025-04-03 9:37 ` |PENDING| " dpdklab
2025-04-03 9:48 ` |FAILURE| " dpdklab
2025-04-03 9:52 ` dpdklab
2025-04-03 9:53 ` dpdklab
2025-04-03 9:53 ` dpdklab
2025-04-03 9:58 ` dpdklab
2025-04-03 10:18 ` |PENDING| " dpdklab
2025-04-03 10:41 ` |FAILURE| " dpdklab
2025-04-03 10:50 ` |WARNING| " dpdklab
2025-04-03 11:41 ` |FAILURE| " dpdklab
2025-04-03 11:53 ` |SUCCESS| " dpdklab
2025-04-03 12:12 ` |FAILURE| " dpdklab
2025-04-03 12:59 ` dpdklab
2025-04-03 13:29 ` |SUCCESS| " dpdklab
2025-04-03 15:53 ` dpdklab
2025-04-03 19:32 ` dpdklab
2025-04-04 0:15 ` dpdklab
2025-04-04 0:41 ` dpdklab
2025-04-04 16:43 ` dpdklab
This is a public inbox, see mirroring instructions
for how to clone and mirror all data and code used for this inbox;
as well as URLs for NNTP newsgroup(s).