automatic DPDK test reports
 help / color / mirror / Atom feed
* [dpdk-test-report] |FAILURE| pw(111112) sid(22922) job(PER_PATCH_BUILD2378)[v6, 7/7] test/security: add inline IPsec IPv6 flow label cases
@ 2022-05-13  7:54 sys_stv
  0 siblings, 0 replies; only message in thread
From: sys_stv @ 2022-05-13  7:54 UTC (permalink / raw)
  To: test-report, gakhil

[-- Attachment #1: Type: text/plain, Size: 8526 bytes --]


Test-Label: Intel-compilation
Test-Status: FAILURE
http://dpdk.org/patch/111112

_Compilation issues_

Submitter: Akhil Goyal <gakhil@marvell.com>
Date: 2022-05-13 07:32:01
Reply_mail: <20220513073201.2320812-8-gakhil@marvell.com>

DPDK git baseline: Repo:dpdk-next-crypto, CommitID: f741d4f2b55c3d25ad2b3f96630e8c39cb08330d


Meson Build Summary: 23 Builds Done, 22 Successful, 1 Failures, 0 Blocked

+--------------+------------+--------------+------------+------------+-----------+----------+------------+
| os           | gcc-static | clang-static | icc-static | gcc-shared | gcc-debug | document | gcc-16byte |
+--------------+------------+--------------+------------+------------+-----------+----------+------------+
| FC35-64      | pass       | pass         |            |            |           |          |            |
| FreeBSD13-64 | pass       | pass         |            | pass       | pass      |          |            |
| RHEL84-64    | pass       | pass         |            | pass       | pass      |          |            |
| SUSE15-64    | pass       | pass         |            |            |           |          |            |
| UB2004-32    | pass       |              |            |            |           |          |            |
| UB2004-64    | pass       | pass         |            |            |           | pass     |            |
| UB2204-32    | pass       |              |            |            |           |          |            |
| UB2204-64    | pass       | pass         |            |            |           | pass     | pass       |
| RHEL85-64    | pass       |              |            |            |           |          |            |
| CentOS7.9-64 | fail       |              |            |            |           |          |            |
+--------------+------------+--------------+------------+------------+-----------+----------+------------+

Comments: 
Because of DPDK bug (https://bugs.dpdk.org/show_bug.cgi?id=928),
All the dpdk-next-* branch add `Ddisable_drivers=event/cnxk` option when build with ICC complier. 
 
Test environment and configuration as below:


OS: FC35-64
	Kernel Version: 5.14.16-301.fc35.x86_64
	GCC Version: gcc (GCC) 11.2.1 20210728 (Red Hat 11.2.1-1)
	Clang Version: 13.0.0 (Fedora 13.0.0~rc1-1.fc35)
	x86_64-native-linuxapp-gcc
	x86_64-native-linuxapp-clang

OS: FreeBSD13-64
	Kernel Version: 13.0-RELEASE
	GCC Version: gcc (FreeBSD Ports Collection) 10.3.0
	Clang Version: 11.0.1 (git@github.com:llvm/llvm-project.git llvmorg-11.0.1-0-g43ff75f2c3fe)
	x86_64-native-bsdapp-gcc
	x86_64-native-bsdapp-clang
	x86_64-native-bsdapp-gcc+shared
	x86_64-native-bsdapp-gcc+debug

OS: RHEL84-64
	Kernel Version: 4.18.0-348.7.1.el8_5.x86_64
	GCC Version: gcc (GCC) 8.5.0 20210514 (Red Hat 8.5.0-4)
	Clang Version: 12.0.1 (Red Hat 12.0.1-4.module_el8.5.0+1025+93159d6c)
	x86_64-native-linuxapp-gcc
	x86_64-native-linuxapp-clang
	x86_64-native-linuxapp-gcc+shared
	x86_64-native-linuxapp-gcc+debug

OS: SUSE15-64
	Kernel Version: 5.3.18-57-default
	GCC Version: gcc (SUSE Linux) 7.5.0
	Clang Version: 11.0.1
	x86_64-native-linuxapp-clang
	x86_64-native-linuxapp-gcc

OS: UB2004-32
	Kernel Version: 5.8.0-48-generic
	GCC Version: gcc (Ubuntu 10.3.0-1ubuntu1~20.04) 10.3.0
	Clang Version: 10.0.0-4ubuntu1
	i686-native-linuxapp-gcc

OS: UB2004-64
	Kernel Version: 5.8.0-48-generic
	GCC Version: gcc (Ubuntu 10.3.0-1ubuntu1~20.04) 10.3.0
	Clang Version: 10.0.0-4ubuntu1
	x86_64-native-linuxapp-clang
	x86_64-native-linuxapp-gcc
	x86_64-native-linuxapp-doc

OS: UB2204-32
	Kernel Version: 5.15.0-25-generic
	GCC Version: gcc (Ubuntu 11.2.0-19ubuntu1) 11.2.0
	Clang Version: NA
	i686-native-linuxapp-gcc

OS: UB2204-64
	Kernel Version: 5.15.0-25-generic
	GCC Version: gcc (Ubuntu 11.2.0-19ubuntu1) 11.2.0
	Clang Version: 14.0.0-1ubuntu1
	x86_64-native-linuxapp-gcc+16byte
	x86_64-native-linuxapp-gcc
	x86_64-native-linuxapp-clang
	x86_64-native-linuxapp-doc

OS: RHEL85-64
	Kernel Version: 4.18.0-348.7.1.el8_5.x86_64
	GCC Version: gcc (GCC) 8.5.0 20210514 (Red Hat 8.5.0-4)
	Clang Version: 12.0.1 (Red Hat 12.0.1-4.module_el8.5.0+1025+93159d6c)
	ICC Version: 19.1.3.304 (gcc version 8.5.0 compatibility)
	x86_64-native-linuxapp-gcc

OS: CentOS7.9-64
	Kernel Version: 3.10.0-1160.el7.x86_64
	GCC Version: gcc (GCC) 4.8.5 20150623 (Red Hat 4.8.5-44)
	Clang Version: 3.4.2 (tags/RELEASE_34/dot2-final)
	x86_64-native-linuxapp-gcc



*Build Failed #1:
OS: CentOS7.9-64
Target: x86_64-native-linuxapp-gcc
FAILED: app/test/dpdk-test.p/test_security_inline_proto.c.o 
gcc -Iapp/test/dpdk-test.p -Iapp/test -I../app/test -I. -I.. -Iconfig -I../config -Ilib/eal/include -I../lib/eal/include -Ilib/eal/linux/include -I../lib/eal/linux/include -Ilib/eal/x86/include -I../lib/eal/x86/include -Ilib/kvargs -I../lib/kvargs -Ilib/metrics -I../lib/metrics -Ilib/telemetry -I../lib/telemetry -Ilib/eal/common -I../lib/eal/common -Ilib/eal -I../lib/eal -Ilib/ring -I../lib/ring -Ilib/rcu -I../lib/rcu -Ilib/mempool -I../lib/mempool -Ilib/mbuf -I../lib/mbuf -Ilib/net -I../lib/net -Ilib/meter -I../lib/meter -Ilib/ethdev -I../lib/ethdev -Ilib/pci -I../lib/pci -Ilib/cmdline -I../lib/cmdline -Ilib/hash -I../lib/hash -Ilib/timer -I../lib/timer -Ilib/acl -I../lib/acl -Ilib/bbdev -I../lib/bbdev -Ilib/bitratestats -I../lib/bitratestats -Ilib/bpf -I../lib/bpf -Ilib/cfgfile -I../lib/cfgfile -Ilib/compressdev -I../lib/compressdev -Ilib/cryptodev -I../lib/cryptodev -Ilib/distributor -I../lib/distributor -Ilib/efd -I../lib/efd -Ilib/eventdev -I../lib/eventdev -Ilib/gpudev -I../lib/gpudev -Ilib/gro -I../lib/gro -Ilib/gso -I../lib/gso -Ilib/ip_frag -I../lib/ip_frag -Ilib/jobstats -I../lib/jobstats -Ilib/kni -I../lib/kni -Ilib/latencystats -I../lib/latencystats -Ilib/lpm -I../lib/lpm -Ilib/member -I../lib/member -Ilib/pcapng -I../lib/pcapng -Ilib/power -I../lib/power -Ilib/rawdev -I../lib/rawdev -Ilib/regexdev -I../lib/regexdev -Ilib/dmadev -I../lib/dmadev -Ilib/rib -I../lib/rib -Ilib/reorder -I../lib/reorder -Ilib/sched -I../lib/sched -Ilib/security -I../lib/security -Ilib/stack -I../lib/stack -Ilib/vhost -I../lib/vhost -Ilib/ipsec -I../lib/ipsec -Ilib/fib -I../lib/fib -Ilib/port -I../lib/port -Ilib/pdump -I../lib/pdump -Ilib/table -I../lib/table -Ilib/pipeline -I../lib/pipeline -Ilib/flow_classify -I../lib/flow_classify -Ilib/graph -I../lib/graph -Ilib/node -I../lib/node -Idrivers/bus/pci -I../drivers/bus/pci -I../drivers/bus/pci/linux -Idrivers/bus/vdev -I../drivers/bus/vdev -Idrivers/mempool/ring -I../drivers/mempool/ring -Idrivers/mempool/stack -I../drivers/mempool/stack -Idrivers/event/skeleton -I../drivers/event/skeleton -Idrivers/net/bonding -I../drivers/net/bonding -Idrivers/net/ring -I../drivers/net/ring -Idrivers/net/null -I../drivers/net/null -Idrivers/crypto/scheduler -I../drivers/crypto/scheduler -D_FILE_OFFSET_BITS=64 -Wall -Winvalid-pch -Wextra -Werror -O3 -include rte_config.h -Wcast-qual -Wdeprecated -Wformat -Wformat-nonliteral -Wformat-security -Wmissing-declarations -Wmissing-prototypes -Wnested-externs -Wold-style-definition -Wpointer-arith -Wsign-compare -Wstrict-prototypes -Wundef -Wwrite-strings -Wno-missing-field-initializers -D_GNU_SOURCE -march=native -DALLOW_EXPERIMENTAL_API -fno-strict-aliasing -DALLOW_INTERNAL_API -MD -MQ app/test/dpdk-test.p/test_security_inline_proto.c.o -MF app/test/dpdk-test.p/test_security_inline_proto.c.o.d -o app/test/dpdk-test.p/test_security_inline_proto.c.o -c ../app/test/test_security_inline_proto.c
../app/test/test_security_inline_proto.c: In function 'test_ipsec_with_reassembly':
../app/test/test_security_inline_proto.c:694:9: error: missing braces around initializer [-Werror=missing-braces]
  struct ipsec_test_data sa_data = {0};
         ^
../app/test/test_security_inline_proto.c:694:9: error: (near initialization for 'sa_data.key') [-Werror=missing-braces]
cc1: all warnings being treated as errors
[3295/3514] Compiling C object app/test/dpdk-test.p/test_string_fns.c.o
[3296/3514] Compiling C object app/test/dpdk-test.p/test_stack.c.o
[3297/3514] Compiling C object app/test/dpdk-test.p/test_stack_perf.c.o
[3298/3514] Compiling C object app/test/dpdk-test.p/test_service_cores.c.o
[3299/3514] Compiling C object app/test/dpdk-test.p/test_cryptodev.c.o
[3300/3514] Compiling C object app/test/dpdk-test.p/test_security.c.o
[3301/3514] Compiling C object app/test/dpdk-test.p/test_memcpy_perf.c.o
[3302/3514] Compiling C object app/test/dpdk-test.p/test_ring.c.o
[3303/3514] Compiling C object app/test/dpdk-test.p/test_ring_perf.c.o
ninja: build stopped


DPDK STV team

^ permalink raw reply	[flat|nested] only message in thread

only message in thread, other threads:[~2022-05-13  7:54 UTC | newest]

Thread overview: (only message) (download: mbox.gz / follow: Atom feed)
-- links below jump to the message on this page --
2022-05-13  7:54 [dpdk-test-report] |FAILURE| pw(111112) sid(22922) job(PER_PATCH_BUILD2378)[v6, 7/7] test/security: add inline IPsec IPv6 flow label cases sys_stv

automatic DPDK test reports

This inbox may be cloned and mirrored by anyone:

	git clone --mirror http://inbox.dpdk.org/test-report/0 test-report/git/0.git

	# If you have public-inbox 1.1+ installed, you may
	# initialize and index your mirror using the following commands:
	public-inbox-init -V2 test-report test-report/ http://inbox.dpdk.org/test-report \
		test-report@dpdk.org
	public-inbox-index test-report

Example config snippet for mirrors.
Newsgroup available over NNTP:
	nntp://inbox.dpdk.org/inbox.dpdk.test-report


AGPL code for this site: git clone https://public-inbox.org/public-inbox.git