automatic DPDK test reports
 help / color / mirror / Atom feed
* compilation|FAILURE| pw(144987) sid(33241) job(PER_PATCH_BUILD13378)[v1, 1/1] dma/cnxk: support dma queue priority configuration
@ 2024-10-03 16:48 sys_stv
  0 siblings, 0 replies; only message in thread
From: sys_stv @ 2024-10-03 16:48 UTC (permalink / raw)
  To: test-report, vattunuru

[-- Attachment #1: Type: text/plain, Size: 75121 bytes --]


Test-Label: Intel-compilation
Test-Status: FAILURE
http://dpdk.org/patch/144987

_Compilation issues_

Submitter: Vamsi Krishna <vattunuru@marvell.com>
Date: 2024-10-03 16:33:55
Reply_mail: <20241003163355.1384425-1-vattunuru@marvell.com>

DPDK git baseline: Repo:dpdk-next-net-mrvl, CommitID: 0b3314b523f776acfdf09c1f2bce2480b2b9951d


Meson Build Summary: 23 Builds Done, 5 Successful, 18 Failures, 0 Blocked

+------------------+------------+--------------+------------+------------+-----------+----------+------------+
| os               | gcc-static | clang-static | icc-static | gcc-shared | gcc-debug | document | gcc-16byte |
+------------------+------------+--------------+------------+------------+-----------+----------+------------+
| OpenAnolis8.9-64 | fail       |              |            |            |           |          |            |
| FreeBSD14-64     | pass       | pass         |            | pass       | pass      |          |            |
| RHEL94-64        | fail       | fail         |            | fail       | fail      |          |            |
| SUSE15-64        | fail       | fail         |            |            |           |          |            |
| AzureLinux3.0-64 | fail       |              |            |            |           |          |            |
| UB2404-32        | pass       |              |            |            |           |          |            |
| RHEL81-64        | fail       |              |            |            |           |          |            |
| UB2404-64        | fail       | fail         |            |            |           | fail     | fail       |
| RHEL94-64Rt      | fail       |              |            |            |           |          |            |
| UB2204-64        | fail       |              |            |            |           |          |            |
| FC40-64          | fail       | fail         |            |            |           |          |            |
| UB2404-64Rt      | fail       |              |            |            |           |          |            |
+------------------+------------+--------------+------------+------------+-----------+----------+------------+

Comments: 
Because of DPDK bug (https://bugs.dpdk.org/show_bug.cgi?id=928),
All the dpdk-next-* branch add `Ddisable_drivers=event/cnxk` option when build with ICC complier. 
 
Test environment and configuration as below:


OS: OpenAnolis8.9-64
	Kernel Version: 5.10.134-16.2.an8.x86_64
	GCC Version: gcc (GCC) 8.5.0 20210514 (Anolis 8.5.0-22.0.1)
	Clang Version: 15.0.7 (Anolis 15.0.7-1.0.3.module+an8.8.0+11135+e398acfc)
	x86_64-native-linuxapp-gcc

OS: FreeBSD14-64
	Kernel Version: 14.1-RELEASE
	GCC Version: gcc (FreeBSD Ports Collection) 13.2.0
	Clang Version: 18.1.5 (https://github.com/llvm/llvm-project.git llvmorg-18.1.5-0-g617a15a9eac9)
	x86_64-native-bsdapp-gcc
	x86_64-native-bsdapp-clang
	x86_64-native-bsdapp-gcc+shared
	x86_64-native-bsdapp-gcc+debug

OS: RHEL94-64
	Kernel Version: 5.14.0-427.13.1.el9_4.x86_64
	GCC Version: gcc (GCC) 11.4.1 20231218 (Red Hat 11.4.1-3)
	Clang Version: 17.0.6 (Red Hat, Inc. 17.0.6-5.el9)
	x86_64-native-linuxapp-gcc
	x86_64-native-linuxapp-clang
	x86_64-native-linuxapp-gcc+shared
	x86_64-native-linuxapp-gcc+debug

OS: SUSE15-64
	Kernel Version: 6.4.0-150600.21-default
	GCC Version: gcc (SUSE Linux) 7.5.0
	Clang Version: 17.0.6
	x86_64-native-linuxapp-clang
	x86_64-native-linuxapp-gcc

OS: AzureLinux3.0-64
	Kernel Version: 6.6.47.1-1.azl3
	GCC Version: gcc (GCC) 13.2.0
	Clang Version: 18.1.2
	x86_64-native-linuxapp-gcc

OS: UB2404-32
	Kernel Version: 6.8.0-41-generic
	GCC Version: gcc (Ubuntu 13.2.0-23ubuntu4) 13.2.0
	Clang Version: NA
	i686-native-linuxapp-gcc

OS: RHEL81-64
	Kernel Version: 4.18.0-553.el8_10.x86_64
	GCC Version: gcc (GCC) 8.5.0 20210514 (Red Hat 8.5.0-21)
	Clang Version: 17.0.6 (Red Hat 17.0.6-1.module+el8.10.0+20808+e12784c0)
	x86_64-native-linuxapp-gcc

OS: UB2404-64
	Kernel Version: 6.8.0-41-generic
	GCC Version: gcc (Ubuntu 13.2.0-23ubuntu4) 13.2.0
	Clang Version: NA
	x86_64-native-linuxapp-gcc+16byte
	x86_64-native-linuxapp-gcc
	x86_64-native-linuxapp-clang
	x86_64-native-linuxapp-doc

OS: RHEL94-64Rt
	Kernel Version: 5.14.0-427.13.1.el9_4.x86_64+rt
	GCC Version: gcc (GCC) 11.4.1 20231218 (Red Hat 11.4.1-3)
	Clang Version: 17.0.6 (Red Hat, Inc. 17.0.6-5.el9)
	x86_64-native-linuxapp-gcc

OS: UB2204-64
	Kernel Version: 5.15.0-94-generic
	GCC Version: gcc (Ubuntu 11.4.0-1ubuntu1~22.04) 11.4.0
	Clang Version: 14.0.0-1ubuntu1.1
	x86_64-native-linuxapp-gcc

OS: FC40-64
	Kernel Version: 6.8.5-301.fc40.x86_64
	GCC Version: gcc (GCC) 14.0.1 20240411 (Red Hat 14.0.1-0)
	Clang Version: 18.1.1 (Fedora 18.1.1-1.fc40)
	x86_64-native-linuxapp-gcc
	x86_64-native-linuxapp-clang

OS: UB2404-64Rt
	Kernel Version: 6.8.0-rt8
	GCC Version: gcc (Ubuntu 13.2.0-23ubuntu4) 13.2.0
	Clang Version: NA
	x86_64-native-linuxapp-gcc



*Build Failed #1:
OS: OpenAnolis8.9-64
Target: x86_64-native-linuxapp-gcc
FAILED: drivers/libtmp_rte_dma_cnxk.a.p/dma_cnxk_cnxk_dmadev.c.o 
gcc -Idrivers/libtmp_rte_dma_cnxk.a.p -Idrivers -I../drivers -Idrivers/dma/cnxk -I../drivers/dma/cnxk -Idrivers/event/cnxk -I../drivers/event/cnxk -Ilib/dmadev -I../lib/dmadev -I. -I.. -Iconfig -I../config -Ilib/eal/include -I../lib/eal/include -Ilib/eal/linux/include -I../lib/eal/linux/include -Ilib/eal/x86/include -I../lib/eal/x86/include -Ilib/eal/common -I../lib/eal/common -Ilib/eal -I../lib/eal -Ilib/kvargs -I../lib/kvargs -Ilib/log -I../lib/log -Ilib/metrics -I../lib/metrics -Ilib/telemetry -I../lib/telemetry -Idrivers/bus/pci -I../drivers/bus/pci -I../drivers/bus/pci/linux -Ilib/pci -I../lib/pci -Idrivers/common/cnxk -I../drivers/common/cnxk -Ilib/net -I../lib/net -Ilib/ethdev -I../lib/ethdev -Ilib/meter -I../lib/meter -Ilib/mbuf -I../lib/mbuf -Ilib/mempool -I../lib/mempool -Ilib/ring -I../lib/ring -Ilib/security -I../lib/security -Ilib/cryptodev -I../lib/cryptodev -Ilib/rcu -I../lib/rcu -Ilib/eventdev -I../lib/eventdev -Ilib/hash -I../lib/hash -Ilib/timer -I../lib/timer -fdiagnostics-color=always -D_FILE_OFFSET_BITS=64 -Wall -Winvalid-pch -Wextra -Werror -std=c11 -O3 -include rte_config.h -Wcast-qual -Wdeprecated -Wformat -Wformat-nonliteral -Wformat-security -Wmissing-declarations -Wmissing-prototypes -Wnested-externs -Wold-style-definition -Wpointer-arith -Wsign-compare -Wstrict-prototypes -Wundef -Wwrite-strings -Wno-packed-not-aligned -Wno-missing-field-initializers -D_GNU_SOURCE -fPIC -march=native -mrtm -DALLOW_EXPERIMENTAL_API -DALLOW_INTERNAL_API -Wno-format-truncation -Wno-uninitialized -DRTE_LOG_DEFAULT_LOGTYPE=pmd.dma.cnxk -MD -MQ drivers/libtmp_rte_dma_cnxk.a.p/dma_cnxk_cnxk_dmadev.c.o -MF drivers/libtmp_rte_dma_cnxk.a.p/dma_cnxk_cnxk_dmadev.c.o.d -o drivers/libtmp_rte_dma_cnxk.a.p/dma_cnxk_cnxk_dmadev.c.o -c ../drivers/dma/cnxk/cnxk_dmadev.c
../drivers/dma/cnxk/cnxk_dmadev.c: In function ‘cnxk_dmadev_info_get’:
../drivers/dma/cnxk/cnxk_dmadev.c:24:25: error: ‘RTE_DMA_CAPA_PRI_POLICY_SP’ undeclared (first use in this function); did you mean ‘RTE_DMA_CAPA_OPS_COPY_SG’?
   dev_info->dev_capa |= RTE_DMA_CAPA_PRI_POLICY_SP;
                         ^~~~~~~~~~~~~~~~~~~~~~~~~~
                         RTE_DMA_CAPA_OPS_COPY_SG
../drivers/dma/cnxk/cnxk_dmadev.c:24:25: note: each undeclared identifier is reported only once for each function it appears in
../drivers/dma/cnxk/cnxk_dmadev.c:25:11: error: ‘struct rte_dma_info’ has no member named ‘nb_priorities’
   dev_info->nb_priorities = CN10K_DPI_MAX_PRI;
           ^~
../drivers/dma/cnxk/cnxk_dmadev.c: In function ‘cnxk_dmadev_configure’:
../drivers/dma/cnxk/cnxk_dmadev.c:115:30: error: ‘const struct rte_dma_conf’ has no member named ‘priority’
   dpivf->rdpi.priority = conf->priority;
                              ^~
[941/3040] Generating drivers/rte_mempool_cnxk.pmd.c with a custom command
[942/3040] Compiling C object drivers/libtmp_rte_mempool_stack.a.p/mempool_stack_rte_mempool_stack.c.o
[943/3040] Linking static target drivers/libtmp_rte_mempool_dpaa.a
[944/3040] Linking static target drivers/libtmp_rte_mempool_octeontx.a
[945/3040] Linking static target drivers/libtmp_rte_mempool_dpaa2.a
[946/3040] Compiling C object drivers/libtmp_rte_mempool_ring.a.p/mempool_ring_rte_mempool_ring.c.o
[947/3040] Compiling C object drivers/libtmp_rte_mempool_bucket.a.p/mempool_bucket_rte_mempool_bucket.c.o
[948/3040] Generating drivers/rte_common_sfc_efx.sym_chk with a custom command (wrapped by meson to capture output)
[949/3040] Generating drivers/rte_common_cnxk.sym_chk with a custom command (wrapped by meson to capture output)
ninja: build stopped




*Build Failed #2:
OS: RHEL94-64
Target: x86_64-native-linuxapp-gcc
FAILED: drivers/libtmp_rte_dma_cnxk.a.p/dma_cnxk_cnxk_dmadev.c.o 
gcc -Idrivers/libtmp_rte_dma_cnxk.a.p -Idrivers -I../drivers -Idrivers/dma/cnxk -I../drivers/dma/cnxk -Idrivers/event/cnxk -I../drivers/event/cnxk -Ilib/dmadev -I../lib/dmadev -I. -I.. -Iconfig -I../config -Ilib/eal/include -I../lib/eal/include -Ilib/eal/linux/include -I../lib/eal/linux/include -Ilib/eal/x86/include -I../lib/eal/x86/include -Ilib/eal/common -I../lib/eal/common -Ilib/eal -I../lib/eal -Ilib/kvargs -I../lib/kvargs -Ilib/log -I../lib/log -Ilib/metrics -I../lib/metrics -Ilib/telemetry -I../lib/telemetry -Idrivers/bus/pci -I../drivers/bus/pci -I../drivers/bus/pci/linux -Ilib/pci -I../lib/pci -Idrivers/common/cnxk -I../drivers/common/cnxk -Ilib/net -I../lib/net -Ilib/ethdev -I../lib/ethdev -Ilib/meter -I../lib/meter -Ilib/mbuf -I../lib/mbuf -Ilib/mempool -I../lib/mempool -Ilib/ring -I../lib/ring -Ilib/security -I../lib/security -Ilib/cryptodev -I../lib/cryptodev -Ilib/rcu -I../lib/rcu -Ilib/eventdev -I../lib/eventdev -Ilib/hash -I../lib/hash -Ilib/timer -I../lib/timer -fdiagnostics-color=always -D_FILE_OFFSET_BITS=64 -Wall -Winvalid-pch -Wextra -Werror -std=c11 -O3 -include rte_config.h -Wcast-qual -Wdeprecated -Wformat -Wformat-nonliteral -Wformat-security -Wmissing-declarations -Wmissing-prototypes -Wnested-externs -Wold-style-definition -Wpointer-arith -Wsign-compare -Wstrict-prototypes -Wundef -Wwrite-strings -Wno-address-of-packed-member -Wno-packed-not-aligned -Wno-missing-field-initializers -Wno-zero-length-bounds -D_GNU_SOURCE -fPIC -march=native -mrtm -DALLOW_EXPERIMENTAL_API -DALLOW_INTERNAL_API -Wno-format-truncation -Wno-uninitialized -DRTE_LOG_DEFAULT_LOGTYPE=pmd.dma.cnxk -MD -MQ drivers/libtmp_rte_dma_cnxk.a.p/dma_cnxk_cnxk_dmadev.c.o -MF drivers/libtmp_rte_dma_cnxk.a.p/dma_cnxk_cnxk_dmadev.c.o.d -o drivers/libtmp_rte_dma_cnxk.a.p/dma_cnxk_cnxk_dmadev.c.o -c ../drivers/dma/cnxk/cnxk_dmadev.c
../drivers/dma/cnxk/cnxk_dmadev.c: In function ‘cnxk_dmadev_info_get’:
../drivers/dma/cnxk/cnxk_dmadev.c:24:39: error: ‘RTE_DMA_CAPA_PRI_POLICY_SP’ undeclared (first use in this function); did you mean ‘RTE_DMA_CAPA_OPS_COPY_SG’?
   24 |                 dev_info->dev_capa |= RTE_DMA_CAPA_PRI_POLICY_SP;
      |                                       ^~~~~~~~~~~~~~~~~~~~~~~~~~
      |                                       RTE_DMA_CAPA_OPS_COPY_SG
../drivers/dma/cnxk/cnxk_dmadev.c:24:39: note: each undeclared identifier is reported only once for each function it appears in
../drivers/dma/cnxk/cnxk_dmadev.c:25:25: error: ‘struct rte_dma_info’ has no member named ‘nb_priorities’
   25 |                 dev_info->nb_priorities = CN10K_DPI_MAX_PRI;
      |                         ^~
../drivers/dma/cnxk/cnxk_dmadev.c: In function ‘cnxk_dmadev_configure’:
../drivers/dma/cnxk/cnxk_dmadev.c:115:44: error: ‘const struct rte_dma_conf’ has no member named ‘priority’
  115 |                 dpivf->rdpi.priority = conf->priority;
      |                                            ^~
[963/3044] Linking target drivers/librte_mempool_octeontx.so.25.0
[964/3044] Compiling C object drivers/librte_mempool_dpaa2.so.25.0.p/meson-generated_.._rte_mempool_dpaa2.pmd.c.o
[965/3044] Compiling C object drivers/libtmp_rte_mempool_stack.a.p/mempool_stack_rte_mempool_stack.c.o
[966/3044] Generating drivers/rte_mempool_bucket.pmd.c with a custom command
[967/3044] Compiling C object drivers/libtmp_rte_mempool_ring.a.p/mempool_ring_rte_mempool_ring.c.o
[968/3044] Generating drivers/rte_mempool_cnxk.sym_chk with a custom command (wrapped by meson to capture output)
[969/3044] Generating drivers/rte_mempool_dpaa.sym_chk with a custom command (wrapped by meson to capture output)
[970/3044] Generating drivers/rte_common_sfc_efx.sym_chk with a custom command (wrapped by meson to capture output)
[971/3044] Generating drivers/rte_common_cnxk.sym_chk with a custom command (wrapped by meson to capture output)
ninja: build stopped




*Build Failed #3:
OS: RHEL94-64
Target: x86_64-native-linuxapp-clang
FAILED: drivers/libtmp_rte_dma_cnxk.a.p/dma_cnxk_cnxk_dmadev.c.o 
clang -Idrivers/libtmp_rte_dma_cnxk.a.p -Idrivers -I../drivers -Idrivers/dma/cnxk -I../drivers/dma/cnxk -Idrivers/event/cnxk -I../drivers/event/cnxk -Ilib/dmadev -I../lib/dmadev -I. -I.. -Iconfig -I../config -Ilib/eal/include -I../lib/eal/include -Ilib/eal/linux/include -I../lib/eal/linux/include -Ilib/eal/x86/include -I../lib/eal/x86/include -Ilib/eal/common -I../lib/eal/common -Ilib/eal -I../lib/eal -Ilib/kvargs -I../lib/kvargs -Ilib/log -I../lib/log -Ilib/metrics -I../lib/metrics -Ilib/telemetry -I../lib/telemetry -Idrivers/bus/pci -I../drivers/bus/pci -I../drivers/bus/pci/linux -Ilib/pci -I../lib/pci -Idrivers/common/cnxk -I../drivers/common/cnxk -Ilib/net -I../lib/net -Ilib/ethdev -I../lib/ethdev -Ilib/meter -I../lib/meter -Ilib/mbuf -I../lib/mbuf -Ilib/mempool -I../lib/mempool -Ilib/ring -I../lib/ring -Ilib/security -I../lib/security -Ilib/cryptodev -I../lib/cryptodev -Ilib/rcu -I../lib/rcu -Ilib/eventdev -I../lib/eventdev -Ilib/hash -I../lib/hash -Ilib/timer -I../lib/timer -fcolor-diagnostics -D_FILE_OFFSET_BITS=64 -Wall -Winvalid-pch -Wextra -Werror -std=c11 -O3 -include rte_config.h -Wcast-qual -Wdeprecated -Wformat -Wformat-nonliteral -Wformat-security -Wmissing-declarations -Wmissing-prototypes -Wnested-externs -Wold-style-definition -Wpointer-arith -Wsign-compare -Wstrict-prototypes -Wundef -Wwrite-strings -Wno-address-of-packed-member -Wno-missing-field-initializers -D_GNU_SOURCE -fPIC -march=native -mrtm -DALLOW_EXPERIMENTAL_API -DALLOW_INTERNAL_API -Wno-uninitialized -DRTE_LOG_DEFAULT_LOGTYPE=pmd.dma.cnxk -DRTE_ANNOTATE_LOCKS -Wthread-safety -MD -MQ drivers/libtmp_rte_dma_cnxk.a.p/dma_cnxk_cnxk_dmadev.c.o -MF drivers/libtmp_rte_dma_cnxk.a.p/dma_cnxk_cnxk_dmadev.c.o.d -o drivers/libtmp_rte_dma_cnxk.a.p/dma_cnxk_cnxk_dmadev.c.o -c ../drivers/dma/cnxk/cnxk_dmadev.c
../drivers/dma/cnxk/cnxk_dmadev.c:24:25: error: use of undeclared identifier 'RTE_DMA_CAPA_PRI_POLICY_SP'
   24 |                 dev_info->dev_capa |= RTE_DMA_CAPA_PRI_POLICY_SP;
      |                                       ^
../drivers/dma/cnxk/cnxk_dmadev.c:25:13: error: no member named 'nb_priorities' in 'struct rte_dma_info'
   25 |                 dev_info->nb_priorities = CN10K_DPI_MAX_PRI;
      |                 ~~~~~~~~  ^
../drivers/dma/cnxk/cnxk_dmadev.c:115:32: error: no member named 'priority' in 'struct rte_dma_conf'
  115 |                 dpivf->rdpi.priority = conf->priority;
      |                                        ~~~~  ^
3 errors generated.
[962/3005] Generating drivers/rte_mempool_octeontx.pmd.c with a custom command
[963/3005] Generating drivers/rte_mempool_bucket.pmd.c with a custom command
[964/3005] Generating drivers/rte_mempool_cnxk.sym_chk with a custom command (wrapped by meson to capture output)
[965/3005] Generating drivers/rte_mempool_dpaa.sym_chk with a custom command (wrapped by meson to capture output)
[966/3005] Generating drivers/rte_mempool_dpaa2.sym_chk with a custom command (wrapped by meson to capture output)
[967/3005] Compiling C object drivers/libtmp_rte_mempool_ring.a.p/mempool_ring_rte_mempool_ring.c.o
[968/3005] Compiling C object drivers/libtmp_rte_mempool_stack.a.p/mempool_stack_rte_mempool_stack.c.o
[969/3005] Generating drivers/rte_common_cnxk.sym_chk with a custom command (wrapped by meson to capture output)
[970/3005] Generating drivers/rte_common_sfc_efx.sym_chk with a custom command (wrapped by meson to capture output)
ninja: build stopped




*Build Failed #4:
OS: RHEL94-64
Target: x86_64-native-linuxapp-gcc+shared
FAILED: drivers/libtmp_rte_dma_cnxk.a.p/dma_cnxk_cnxk_dmadev.c.o 
gcc -Idrivers/libtmp_rte_dma_cnxk.a.p -Idrivers -I../drivers -Idrivers/dma/cnxk -I../drivers/dma/cnxk -Idrivers/event/cnxk -I../drivers/event/cnxk -Ilib/dmadev -I../lib/dmadev -I. -I.. -Iconfig -I../config -Ilib/eal/include -I../lib/eal/include -Ilib/eal/linux/include -I../lib/eal/linux/include -Ilib/eal/x86/include -I../lib/eal/x86/include -Ilib/eal/common -I../lib/eal/common -Ilib/eal -I../lib/eal -Ilib/kvargs -I../lib/kvargs -Ilib/log -I../lib/log -Ilib/metrics -I../lib/metrics -Ilib/telemetry -I../lib/telemetry -Idrivers/bus/pci -I../drivers/bus/pci -I../drivers/bus/pci/linux -Ilib/pci -I../lib/pci -Idrivers/common/cnxk -I../drivers/common/cnxk -Ilib/net -I../lib/net -Ilib/ethdev -I../lib/ethdev -Ilib/meter -I../lib/meter -Ilib/mbuf -I../lib/mbuf -Ilib/mempool -I../lib/mempool -Ilib/ring -I../lib/ring -Ilib/security -I../lib/security -Ilib/cryptodev -I../lib/cryptodev -Ilib/rcu -I../lib/rcu -Ilib/eventdev -I../lib/eventdev -Ilib/hash -I../lib/hash -Ilib/timer -I../lib/timer -fdiagnostics-color=always -D_FILE_OFFSET_BITS=64 -Wall -Winvalid-pch -Wextra -Werror -std=c11 -O3 -include rte_config.h -Wcast-qual -Wdeprecated -Wformat -Wformat-nonliteral -Wformat-security -Wmissing-declarations -Wmissing-prototypes -Wnested-externs -Wold-style-definition -Wpointer-arith -Wsign-compare -Wstrict-prototypes -Wundef -Wwrite-strings -Wno-address-of-packed-member -Wno-packed-not-aligned -Wno-missing-field-initializers -Wno-zero-length-bounds -D_GNU_SOURCE -fPIC -march=native -mrtm -DALLOW_EXPERIMENTAL_API -DALLOW_INTERNAL_API -Wno-format-truncation -Wno-uninitialized -DRTE_LOG_DEFAULT_LOGTYPE=pmd.dma.cnxk -MD -MQ drivers/libtmp_rte_dma_cnxk.a.p/dma_cnxk_cnxk_dmadev.c.o -MF drivers/libtmp_rte_dma_cnxk.a.p/dma_cnxk_cnxk_dmadev.c.o.d -o drivers/libtmp_rte_dma_cnxk.a.p/dma_cnxk_cnxk_dmadev.c.o -c ../drivers/dma/cnxk/cnxk_dmadev.c
../drivers/dma/cnxk/cnxk_dmadev.c: In function ‘cnxk_dmadev_info_get’:
../drivers/dma/cnxk/cnxk_dmadev.c:24:39: error: ‘RTE_DMA_CAPA_PRI_POLICY_SP’ undeclared (first use in this function); did you mean ‘RTE_DMA_CAPA_OPS_COPY_SG’?
   24 |                 dev_info->dev_capa |= RTE_DMA_CAPA_PRI_POLICY_SP;
      |                                       ^~~~~~~~~~~~~~~~~~~~~~~~~~
      |                                       RTE_DMA_CAPA_OPS_COPY_SG
../drivers/dma/cnxk/cnxk_dmadev.c:24:39: note: each undeclared identifier is reported only once for each function it appears in
../drivers/dma/cnxk/cnxk_dmadev.c:25:25: error: ‘struct rte_dma_info’ has no member named ‘nb_priorities’
   25 |                 dev_info->nb_priorities = CN10K_DPI_MAX_PRI;
      |                         ^~
../drivers/dma/cnxk/cnxk_dmadev.c: In function ‘cnxk_dmadev_configure’:
../drivers/dma/cnxk/cnxk_dmadev.c:115:44: error: ‘const struct rte_dma_conf’ has no member named ‘priority’
  115 |                 dpivf->rdpi.priority = conf->priority;
      |                                            ^~
[977/2894] Generating drivers/rte_mempool_octeontx.pmd.c with a custom command
[978/2894] Generating drivers/rte_mempool_dpaa.sym_chk with a custom command (wrapped by meson to capture output)
[979/2894] Generating drivers/rte_mempool_cnxk.sym_chk with a custom command (wrapped by meson to capture output)
[980/2894] Compiling C object drivers/libtmp_rte_mempool_bucket.a.p/mempool_bucket_rte_mempool_bucket.c.o
[981/2894] Generating drivers/rte_mempool_dpaa2.sym_chk with a custom command (wrapped by meson to capture output)
[982/2894] Compiling C object drivers/libtmp_rte_mempool_ring.a.p/mempool_ring_rte_mempool_ring.c.o
[983/2894] Compiling C object drivers/libtmp_rte_mempool_stack.a.p/mempool_stack_rte_mempool_stack.c.o
[984/2894] Generating drivers/rte_common_sfc_efx.sym_chk with a custom command (wrapped by meson to capture output)
[985/2894] Generating drivers/rte_common_cnxk.sym_chk with a custom command (wrapped by meson to capture output)
ninja: build stopped




*Build Failed #5:
OS: RHEL94-64
Target: x86_64-native-linuxapp-gcc+debug
FAILED: drivers/libtmp_rte_dma_cnxk.a.p/dma_cnxk_cnxk_dmadev.c.o 
gcc -Idrivers/libtmp_rte_dma_cnxk.a.p -Idrivers -I../drivers -Idrivers/dma/cnxk -I../drivers/dma/cnxk -Idrivers/event/cnxk -I../drivers/event/cnxk -Ilib/dmadev -I../lib/dmadev -I. -I.. -Iconfig -I../config -Ilib/eal/include -I../lib/eal/include -Ilib/eal/linux/include -I../lib/eal/linux/include -Ilib/eal/x86/include -I../lib/eal/x86/include -Ilib/eal/common -I../lib/eal/common -Ilib/eal -I../lib/eal -Ilib/kvargs -I../lib/kvargs -Ilib/log -I../lib/log -Ilib/metrics -I../lib/metrics -Ilib/telemetry -I../lib/telemetry -Idrivers/bus/pci -I../drivers/bus/pci -I../drivers/bus/pci/linux -Ilib/pci -I../lib/pci -Idrivers/common/cnxk -I../drivers/common/cnxk -Ilib/net -I../lib/net -Ilib/ethdev -I../lib/ethdev -Ilib/meter -I../lib/meter -Ilib/mbuf -I../lib/mbuf -Ilib/mempool -I../lib/mempool -Ilib/ring -I../lib/ring -Ilib/security -I../lib/security -Ilib/cryptodev -I../lib/cryptodev -Ilib/rcu -I../lib/rcu -Ilib/eventdev -I../lib/eventdev -Ilib/hash -I../lib/hash -Ilib/timer -I../lib/timer -fdiagnostics-color=always -D_FILE_OFFSET_BITS=64 -Wall -Winvalid-pch -Wextra -Werror -std=c11 -O2 -g -include rte_config.h -Wcast-qual -Wdeprecated -Wformat -Wformat-nonliteral -Wformat-security -Wmissing-declarations -Wmissing-prototypes -Wnested-externs -Wold-style-definition -Wpointer-arith -Wsign-compare -Wstrict-prototypes -Wundef -Wwrite-strings -Wno-address-of-packed-member -Wno-packed-not-aligned -Wno-missing-field-initializers -Wno-zero-length-bounds -D_GNU_SOURCE -fPIC -march=native -mrtm -DALLOW_EXPERIMENTAL_API -DALLOW_INTERNAL_API -Wno-format-truncation -Wno-uninitialized -DRTE_LOG_DEFAULT_LOGTYPE=pmd.dma.cnxk -MD -MQ drivers/libtmp_rte_dma_cnxk.a.p/dma_cnxk_cnxk_dmadev.c.o -MF drivers/libtmp_rte_dma_cnxk.a.p/dma_cnxk_cnxk_dmadev.c.o.d -o drivers/libtmp_rte_dma_cnxk.a.p/dma_cnxk_cnxk_dmadev.c.o -c ../drivers/dma/cnxk/cnxk_dmadev.c
../drivers/dma/cnxk/cnxk_dmadev.c: In function ‘cnxk_dmadev_info_get’:
../drivers/dma/cnxk/cnxk_dmadev.c:24:39: error: ‘RTE_DMA_CAPA_PRI_POLICY_SP’ undeclared (first use in this function); did you mean ‘RTE_DMA_CAPA_OPS_COPY_SG’?
   24 |                 dev_info->dev_capa |= RTE_DMA_CAPA_PRI_POLICY_SP;
      |                                       ^~~~~~~~~~~~~~~~~~~~~~~~~~
      |                                       RTE_DMA_CAPA_OPS_COPY_SG
../drivers/dma/cnxk/cnxk_dmadev.c:24:39: note: each undeclared identifier is reported only once for each function it appears in
../drivers/dma/cnxk/cnxk_dmadev.c:25:25: error: ‘struct rte_dma_info’ has no member named ‘nb_priorities’
   25 |                 dev_info->nb_priorities = CN10K_DPI_MAX_PRI;
      |                         ^~
../drivers/dma/cnxk/cnxk_dmadev.c: In function ‘cnxk_dmadev_configure’:
../drivers/dma/cnxk/cnxk_dmadev.c:115:44: error: ‘const struct rte_dma_conf’ has no member named ‘priority’
  115 |                 dpivf->rdpi.priority = conf->priority;
      |                                            ^~
[949/3040] Linking static target drivers/librte_mempool_dpaa2.a
[950/3040] Compiling C object drivers/librte_mempool_octeontx.a.p/meson-generated_.._rte_mempool_octeontx.pmd.c.o
[951/3040] Compiling C object drivers/libtmp_rte_mempool_bucket.a.p/mempool_bucket_rte_mempool_bucket.c.o
[952/3040] Compiling C object drivers/libtmp_rte_mempool_ring.a.p/mempool_ring_rte_mempool_ring.c.o
[953/3040] Generating drivers/rte_mempool_cnxk.sym_chk with a custom command (wrapped by meson to capture output)
[954/3040] Generating drivers/rte_mempool_dpaa.sym_chk with a custom command (wrapped by meson to capture output)
[955/3040] Compiling C object drivers/libtmp_rte_common_qat.a.p/crypto_qat_qat_asym.c.o
[956/3040] Generating drivers/rte_common_sfc_efx.sym_chk with a custom command (wrapped by meson to capture output)
[957/3040] Generating drivers/rte_common_cnxk.sym_chk with a custom command (wrapped by meson to capture output)
ninja: build stopped




*Build Failed #6:
OS: SUSE15-64
Target: x86_64-native-linuxapp-clang
FAILED: drivers/libtmp_rte_dma_cnxk.a.p/dma_cnxk_cnxk_dmadev.c.o 
clang -Idrivers/libtmp_rte_dma_cnxk.a.p -Idrivers -I../drivers -Idrivers/dma/cnxk -I../drivers/dma/cnxk -Idrivers/event/cnxk -I../drivers/event/cnxk -Ilib/dmadev -I../lib/dmadev -I. -I.. -Iconfig -I../config -Ilib/eal/include -I../lib/eal/include -Ilib/eal/linux/include -I../lib/eal/linux/include -Ilib/eal/x86/include -I../lib/eal/x86/include -Ilib/eal/common -I../lib/eal/common -Ilib/eal -I../lib/eal -Ilib/kvargs -I../lib/kvargs -Ilib/log -I../lib/log -Ilib/metrics -I../lib/metrics -Ilib/telemetry -I../lib/telemetry -Idrivers/bus/pci -I../drivers/bus/pci -I../drivers/bus/pci/linux -Ilib/pci -I../lib/pci -Idrivers/common/cnxk -I../drivers/common/cnxk -Ilib/net -I../lib/net -Ilib/ethdev -I../lib/ethdev -Ilib/meter -I../lib/meter -Ilib/mbuf -I../lib/mbuf -Ilib/mempool -I../lib/mempool -Ilib/ring -I../lib/ring -Ilib/security -I../lib/security -Ilib/cryptodev -I../lib/cryptodev -Ilib/rcu -I../lib/rcu -Ilib/eventdev -I../lib/eventdev -Ilib/hash -I../lib/hash -Ilib/timer -I../lib/timer -fcolor-diagnostics -D_FILE_OFFSET_BITS=64 -Wall -Winvalid-pch -Wextra -Werror -std=c11 -O3 -include rte_config.h -Wcast-qual -Wdeprecated -Wformat -Wformat-nonliteral -Wformat-security -Wmissing-declarations -Wmissing-prototypes -Wnested-externs -Wold-style-definition -Wpointer-arith -Wsign-compare -Wstrict-prototypes -Wundef -Wwrite-strings -Wno-address-of-packed-member -Wno-missing-field-initializers -D_GNU_SOURCE -fPIC -march=native -mrtm -DALLOW_EXPERIMENTAL_API -DALLOW_INTERNAL_API -Wno-uninitialized -DRTE_LOG_DEFAULT_LOGTYPE=pmd.dma.cnxk -DRTE_ANNOTATE_LOCKS -Wthread-safety -MD -MQ drivers/libtmp_rte_dma_cnxk.a.p/dma_cnxk_cnxk_dmadev.c.o -MF drivers/libtmp_rte_dma_cnxk.a.p/dma_cnxk_cnxk_dmadev.c.o.d -o drivers/libtmp_rte_dma_cnxk.a.p/dma_cnxk_cnxk_dmadev.c.o -c ../drivers/dma/cnxk/cnxk_dmadev.c
../drivers/dma/cnxk/cnxk_dmadev.c:24:25: error: use of undeclared identifier 'RTE_DMA_CAPA_PRI_POLICY_SP'
   24 |                 dev_info->dev_capa |= RTE_DMA_CAPA_PRI_POLICY_SP;
      |                                       ^
../drivers/dma/cnxk/cnxk_dmadev.c:25:13: error: no member named 'nb_priorities' in 'struct rte_dma_info'
   25 |                 dev_info->nb_priorities = CN10K_DPI_MAX_PRI;
      |                 ~~~~~~~~  ^
../drivers/dma/cnxk/cnxk_dmadev.c:115:32: error: no member named 'priority' in 'struct rte_dma_conf'
  115 |                 dpivf->rdpi.priority = conf->priority;
      |                                        ~~~~  ^
3 errors generated.
[954/3023] Generating drivers/rte_mempool_dpaa2.pmd.c with a custom command
[955/3023] Generating drivers/rte_mempool_octeontx.pmd.c with a custom command
[956/3023] Compiling C object drivers/libtmp_rte_mempool_bucket.a.p/mempool_bucket_rte_mempool_bucket.c.o
[957/3023] Compiling C object drivers/libtmp_rte_mempool_stack.a.p/mempool_stack_rte_mempool_stack.c.o
[958/3023] Generating drivers/rte_mempool_cnxk.sym_chk with a custom command (wrapped by meson to capture output)
[959/3023] Compiling C object drivers/libtmp_rte_mempool_ring.a.p/mempool_ring_rte_mempool_ring.c.o
[960/3023] Generating drivers/rte_mempool_dpaa.sym_chk with a custom command (wrapped by meson to capture output)
[961/3023] Generating drivers/rte_common_sfc_efx.sym_chk with a custom command (wrapped by meson to capture output)
[962/3023] Generating drivers/rte_common_cnxk.sym_chk with a custom command (wrapped by meson to capture output)
ninja: build stopped




*Build Failed #7:
OS: SUSE15-64
Target: x86_64-native-linuxapp-gcc
FAILED: drivers/libtmp_rte_dma_cnxk.a.p/dma_cnxk_cnxk_dmadev.c.o 
gcc -Idrivers/libtmp_rte_dma_cnxk.a.p -Idrivers -I../drivers -Idrivers/dma/cnxk -I../drivers/dma/cnxk -Idrivers/event/cnxk -I../drivers/event/cnxk -Ilib/dmadev -I../lib/dmadev -I. -I.. -Iconfig -I../config -Ilib/eal/include -I../lib/eal/include -Ilib/eal/linux/include -I../lib/eal/linux/include -Ilib/eal/x86/include -I../lib/eal/x86/include -Ilib/eal/common -I../lib/eal/common -Ilib/eal -I../lib/eal -Ilib/kvargs -I../lib/kvargs -Ilib/log -I../lib/log -Ilib/metrics -I../lib/metrics -Ilib/telemetry -I../lib/telemetry -Idrivers/bus/pci -I../drivers/bus/pci -I../drivers/bus/pci/linux -Ilib/pci -I../lib/pci -Idrivers/common/cnxk -I../drivers/common/cnxk -Ilib/net -I../lib/net -Ilib/ethdev -I../lib/ethdev -Ilib/meter -I../lib/meter -Ilib/mbuf -I../lib/mbuf -Ilib/mempool -I../lib/mempool -Ilib/ring -I../lib/ring -Ilib/security -I../lib/security -Ilib/cryptodev -I../lib/cryptodev -Ilib/rcu -I../lib/rcu -Ilib/eventdev -I../lib/eventdev -Ilib/hash -I../lib/hash -Ilib/timer -I../lib/timer -fdiagnostics-color=always -D_FILE_OFFSET_BITS=64 -Wall -Winvalid-pch -Wextra -Werror -std=c11 -O3 -include rte_config.h -Wcast-qual -Wdeprecated -Wformat -Wformat-nonliteral -Wformat-security -Wmissing-declarations -Wmissing-prototypes -Wnested-externs -Wold-style-definition -Wpointer-arith -Wsign-compare -Wstrict-prototypes -Wundef -Wwrite-strings -Wno-missing-field-initializers -D_GNU_SOURCE -fPIC -march=native -mrtm -DALLOW_EXPERIMENTAL_API -DALLOW_INTERNAL_API -Wno-format-truncation -Wno-uninitialized -DRTE_LOG_DEFAULT_LOGTYPE=pmd.dma.cnxk -MD -MQ drivers/libtmp_rte_dma_cnxk.a.p/dma_cnxk_cnxk_dmadev.c.o -MF drivers/libtmp_rte_dma_cnxk.a.p/dma_cnxk_cnxk_dmadev.c.o.d -o drivers/libtmp_rte_dma_cnxk.a.p/dma_cnxk_cnxk_dmadev.c.o -c ../drivers/dma/cnxk/cnxk_dmadev.c
../drivers/dma/cnxk/cnxk_dmadev.c: In function ‘cnxk_dmadev_info_get’:
../drivers/dma/cnxk/cnxk_dmadev.c:24:25: error: ‘RTE_DMA_CAPA_PRI_POLICY_SP’ undeclared (first use in this function); did you mean ‘RTE_DMA_CAPA_OPS_COPY_SG’?
   dev_info->dev_capa |= RTE_DMA_CAPA_PRI_POLICY_SP;
                         ^~~~~~~~~~~~~~~~~~~~~~~~~~
                         RTE_DMA_CAPA_OPS_COPY_SG
../drivers/dma/cnxk/cnxk_dmadev.c:24:25: note: each undeclared identifier is reported only once for each function it appears in
../drivers/dma/cnxk/cnxk_dmadev.c:25:11: error: ‘struct rte_dma_info’ has no member named ‘nb_priorities’
   dev_info->nb_priorities = CN10K_DPI_MAX_PRI;
           ^~
../drivers/dma/cnxk/cnxk_dmadev.c: In function ‘cnxk_dmadev_configure’:
../drivers/dma/cnxk/cnxk_dmadev.c:115:30: error: ‘const struct rte_dma_conf’ has no member named ‘priority’
   dpivf->rdpi.priority = conf->priority;
                              ^~
[956/3021] Compiling C object drivers/librte_mempool_octeontx.so.25.0.p/meson-generated_.._rte_mempool_octeontx.pmd.c.o
[957/3021] Compiling C object drivers/libtmp_rte_mempool_stack.a.p/mempool_stack_rte_mempool_stack.c.o
[958/3021] Compiling C object drivers/libtmp_rte_mempool_ring.a.p/mempool_ring_rte_mempool_ring.c.o
[959/3021] Generating drivers/rte_mempool_cnxk.sym_chk with a custom command (wrapped by meson to capture output)
[960/3021] Generating drivers/rte_mempool_dpaa.sym_chk with a custom command (wrapped by meson to capture output)
[961/3021] Generating drivers/rte_mempool_dpaa2.sym_chk with a custom command (wrapped by meson to capture output)
[962/3021] Compiling C object drivers/libtmp_rte_mempool_bucket.a.p/mempool_bucket_rte_mempool_bucket.c.o
[963/3021] Generating drivers/rte_common_sfc_efx.sym_chk with a custom command (wrapped by meson to capture output)
[964/3021] Generating drivers/rte_common_cnxk.sym_chk with a custom command (wrapped by meson to capture output)
ninja: build stopped




*Build Failed #8:
OS: AzureLinux3.0-64
Target: x86_64-native-linuxapp-gcc
FAILED: drivers/libtmp_rte_dma_cnxk.a.p/dma_cnxk_cnxk_dmadev.c.o 
gcc -Idrivers/libtmp_rte_dma_cnxk.a.p -Idrivers -I../drivers -Idrivers/dma/cnxk -I../drivers/dma/cnxk -Idrivers/event/cnxk -I../drivers/event/cnxk -Ilib/dmadev -I../lib/dmadev -I. -I.. -Iconfig -I../config -Ilib/eal/include -I../lib/eal/include -Ilib/eal/linux/include -I../lib/eal/linux/include -Ilib/eal/x86/include -I../lib/eal/x86/include -Ilib/eal/common -I../lib/eal/common -Ilib/eal -I../lib/eal -Ilib/kvargs -I../lib/kvargs -Ilib/log -I../lib/log -Ilib/metrics -I../lib/metrics -Ilib/telemetry -I../lib/telemetry -Idrivers/bus/pci -I../drivers/bus/pci -I../drivers/bus/pci/linux -Ilib/pci -I../lib/pci -Idrivers/common/cnxk -I../drivers/common/cnxk -Ilib/net -I../lib/net -Ilib/ethdev -I../lib/ethdev -Ilib/meter -I../lib/meter -Ilib/mbuf -I../lib/mbuf -Ilib/mempool -I../lib/mempool -Ilib/ring -I../lib/ring -Ilib/security -I../lib/security -Ilib/cryptodev -I../lib/cryptodev -Ilib/rcu -I../lib/rcu -Ilib/eventdev -I../lib/eventdev -Ilib/hash -I../lib/hash -Ilib/timer -I../lib/timer -fdiagnostics-color=always -D_FILE_OFFSET_BITS=64 -Wall -Winvalid-pch -Wextra -Werror -std=c11 -O3 -include rte_config.h -Wcast-qual -Wdeprecated -Wformat -Wformat-nonliteral -Wformat-security -Wmissing-declarations -Wmissing-prototypes -Wnested-externs -Wold-style-definition -Wpointer-arith -Wsign-compare -Wstrict-prototypes -Wundef -Wwrite-strings -Wno-address-of-packed-member -Wno-packed-not-aligned -Wno-missing-field-initializers -Wno-zero-length-bounds -D_GNU_SOURCE -fPIC -march=native -mrtm -DALLOW_EXPERIMENTAL_API -DALLOW_INTERNAL_API -Wno-format-truncation -Wno-uninitialized -DRTE_LOG_DEFAULT_LOGTYPE=pmd.dma.cnxk -MD -MQ drivers/libtmp_rte_dma_cnxk.a.p/dma_cnxk_cnxk_dmadev.c.o -MF drivers/libtmp_rte_dma_cnxk.a.p/dma_cnxk_cnxk_dmadev.c.o.d -o drivers/libtmp_rte_dma_cnxk.a.p/dma_cnxk_cnxk_dmadev.c.o -c ../drivers/dma/cnxk/cnxk_dmadev.c
../drivers/dma/cnxk/cnxk_dmadev.c: In function ‘cnxk_dmadev_info_get’:
../drivers/dma/cnxk/cnxk_dmadev.c:24:39: error: ‘RTE_DMA_CAPA_PRI_POLICY_SP’ undeclared (first use in this function); did you mean ‘RTE_DMA_CAPA_OPS_COPY_SG’?
   24 |                 dev_info->dev_capa |= RTE_DMA_CAPA_PRI_POLICY_SP;
      |                                       ^~~~~~~~~~~~~~~~~~~~~~~~~~
      |                                       RTE_DMA_CAPA_OPS_COPY_SG
../drivers/dma/cnxk/cnxk_dmadev.c:24:39: note: each undeclared identifier is reported only once for each function it appears in
../drivers/dma/cnxk/cnxk_dmadev.c:25:25: error: ‘struct rte_dma_info’ has no member named ‘nb_priorities’
   25 |                 dev_info->nb_priorities = CN10K_DPI_MAX_PRI;
      |                         ^~
../drivers/dma/cnxk/cnxk_dmadev.c: In function ‘cnxk_dmadev_configure’:
../drivers/dma/cnxk/cnxk_dmadev.c:115:44: error: ‘const struct rte_dma_conf’ has no member named ‘priority’
  115 |                 dpivf->rdpi.priority = conf->priority;
      |                                            ^~
[961/3041] Generating drivers/rte_mempool_octeontx.pmd.c with a custom command
[962/3041] Compiling C object drivers/libtmp_rte_mempool_stack.a.p/mempool_stack_rte_mempool_stack.c.o
[963/3041] Generating drivers/rte_mempool_dpaa.sym_chk with a custom command (wrapped by meson to capture output)
[964/3041] Generating drivers/rte_mempool_cnxk.sym_chk with a custom command (wrapped by meson to capture output)
[965/3041] Compiling C object drivers/libtmp_rte_mempool_ring.a.p/mempool_ring_rte_mempool_ring.c.o
[966/3041] Compiling C object drivers/libtmp_rte_mempool_bucket.a.p/mempool_bucket_rte_mempool_bucket.c.o
[967/3041] Generating drivers/rte_mempool_dpaa2.sym_chk with a custom command (wrapped by meson to capture output)
[968/3041] Generating drivers/rte_common_sfc_efx.sym_chk with a custom command (wrapped by meson to capture output)
[969/3041] Generating drivers/rte_common_cnxk.sym_chk with a custom command (wrapped by meson to capture output)
ninja: build stopped




*Build Failed #9:
OS: RHEL81-64
Target: x86_64-native-linuxapp-gcc
FAILED: drivers/libtmp_rte_dma_cnxk.a.p/dma_cnxk_cnxk_dmadev.c.o 
gcc -Idrivers/libtmp_rte_dma_cnxk.a.p -Idrivers -I../drivers -Idrivers/dma/cnxk -I../drivers/dma/cnxk -Idrivers/event/cnxk -I../drivers/event/cnxk -Ilib/dmadev -I../lib/dmadev -I. -I.. -Iconfig -I../config -Ilib/eal/include -I../lib/eal/include -Ilib/eal/linux/include -I../lib/eal/linux/include -Ilib/eal/x86/include -I../lib/eal/x86/include -Ilib/eal/common -I../lib/eal/common -Ilib/eal -I../lib/eal -Ilib/kvargs -I../lib/kvargs -Ilib/log -I../lib/log -Ilib/metrics -I../lib/metrics -Ilib/telemetry -I../lib/telemetry -Idrivers/bus/pci -I../drivers/bus/pci -I../drivers/bus/pci/linux -Ilib/pci -I../lib/pci -Idrivers/common/cnxk -I../drivers/common/cnxk -Ilib/net -I../lib/net -Ilib/ethdev -I../lib/ethdev -Ilib/meter -I../lib/meter -Ilib/mbuf -I../lib/mbuf -Ilib/mempool -I../lib/mempool -Ilib/ring -I../lib/ring -Ilib/security -I../lib/security -Ilib/cryptodev -I../lib/cryptodev -Ilib/rcu -I../lib/rcu -Ilib/eventdev -I../lib/eventdev -Ilib/hash -I../lib/hash -Ilib/timer -I../lib/timer -fdiagnostics-color=always -D_FILE_OFFSET_BITS=64 -Wall -Winvalid-pch -Wextra -Werror -std=c11 -O3 -include rte_config.h -Wcast-qual -Wdeprecated -Wformat -Wformat-nonliteral -Wformat-security -Wmissing-declarations -Wmissing-prototypes -Wnested-externs -Wold-style-definition -Wpointer-arith -Wsign-compare -Wstrict-prototypes -Wundef -Wwrite-strings -Wno-packed-not-aligned -Wno-missing-field-initializers -D_GNU_SOURCE -fPIC -march=native -mrtm -DALLOW_EXPERIMENTAL_API -DALLOW_INTERNAL_API -Wno-format-truncation -Wno-uninitialized -DRTE_LOG_DEFAULT_LOGTYPE=pmd.dma.cnxk -MD -MQ drivers/libtmp_rte_dma_cnxk.a.p/dma_cnxk_cnxk_dmadev.c.o -MF drivers/libtmp_rte_dma_cnxk.a.p/dma_cnxk_cnxk_dmadev.c.o.d -o drivers/libtmp_rte_dma_cnxk.a.p/dma_cnxk_cnxk_dmadev.c.o -c ../drivers/dma/cnxk/cnxk_dmadev.c
../drivers/dma/cnxk/cnxk_dmadev.c: In function ‘cnxk_dmadev_info_get’:
../drivers/dma/cnxk/cnxk_dmadev.c:24:25: error: ‘RTE_DMA_CAPA_PRI_POLICY_SP’ undeclared (first use in this function); did you mean ‘RTE_DMA_CAPA_OPS_COPY_SG’?
   dev_info->dev_capa |= RTE_DMA_CAPA_PRI_POLICY_SP;
                         ^~~~~~~~~~~~~~~~~~~~~~~~~~
                         RTE_DMA_CAPA_OPS_COPY_SG
../drivers/dma/cnxk/cnxk_dmadev.c:24:25: note: each undeclared identifier is reported only once for each function it appears in
../drivers/dma/cnxk/cnxk_dmadev.c:25:11: error: ‘struct rte_dma_info’ has no member named ‘nb_priorities’
   dev_info->nb_priorities = CN10K_DPI_MAX_PRI;
           ^~
../drivers/dma/cnxk/cnxk_dmadev.c: In function ‘cnxk_dmadev_configure’:
../drivers/dma/cnxk/cnxk_dmadev.c:115:30: error: ‘const struct rte_dma_conf’ has no member named ‘priority’
   dpivf->rdpi.priority = conf->priority;
                              ^~
[956/3005] Generating drivers/rte_mempool_octeontx.pmd.c with a custom command
[957/3005] Generating drivers/rte_mempool_dpaa2.pmd.c with a custom command
[958/3005] Compiling C object drivers/libtmp_rte_mempool_stack.a.p/mempool_stack_rte_mempool_stack.c.o
[959/3005] Compiling C object drivers/libtmp_rte_mempool_ring.a.p/mempool_ring_rte_mempool_ring.c.o
[960/3005] Generating drivers/rte_mempool_cnxk.sym_chk with a custom command (wrapped by meson to capture output)
[961/3005] Compiling C object drivers/libtmp_rte_mempool_bucket.a.p/mempool_bucket_rte_mempool_bucket.c.o
[962/3005] Generating drivers/rte_mempool_dpaa.sym_chk with a custom command (wrapped by meson to capture output)
[963/3005] Generating drivers/rte_common_sfc_efx.sym_chk with a custom command (wrapped by meson to capture output)
[964/3005] Generating drivers/rte_common_cnxk.sym_chk with a custom command (wrapped by meson to capture output)
ninja: build stopped




*Build Failed #10:
OS: UB2404-64
Target: x86_64-native-linuxapp-gcc+16byte
FAILED: drivers/libtmp_rte_dma_cnxk.a.p/dma_cnxk_cnxk_dmadev.c.o 
gcc -Idrivers/libtmp_rte_dma_cnxk.a.p -Idrivers -I../drivers -Idrivers/dma/cnxk -I../drivers/dma/cnxk -Idrivers/event/cnxk -I../drivers/event/cnxk -Ilib/dmadev -I../lib/dmadev -I. -I.. -Iconfig -I../config -Ilib/eal/include -I../lib/eal/include -Ilib/eal/linux/include -I../lib/eal/linux/include -Ilib/eal/x86/include -I../lib/eal/x86/include -Ilib/eal/common -I../lib/eal/common -Ilib/eal -I../lib/eal -Ilib/kvargs -I../lib/kvargs -Ilib/log -I../lib/log -Ilib/metrics -I../lib/metrics -Ilib/telemetry -I../lib/telemetry -Idrivers/bus/pci -I../drivers/bus/pci -I../drivers/bus/pci/linux -Ilib/pci -I../lib/pci -Idrivers/common/cnxk -I../drivers/common/cnxk -Ilib/net -I../lib/net -Ilib/ethdev -I../lib/ethdev -Ilib/meter -I../lib/meter -Ilib/mbuf -I../lib/mbuf -Ilib/mempool -I../lib/mempool -Ilib/ring -I../lib/ring -Ilib/security -I../lib/security -Ilib/cryptodev -I../lib/cryptodev -Ilib/rcu -I../lib/rcu -Ilib/eventdev -I../lib/eventdev -Ilib/hash -I../lib/hash -Ilib/timer -I../lib/timer -fdiagnostics-color=always -D_FILE_OFFSET_BITS=64 -Wall -Winvalid-pch -Wextra -Werror -std=c11 -O3 -include rte_config.h -Wcast-qual -Wdeprecated -Wformat -Wformat-nonliteral -Wformat-security -Wmissing-declarations -Wmissing-prototypes -Wnested-externs -Wold-style-definition -Wpointer-arith -Wsign-compare -Wstrict-prototypes -Wundef -Wwrite-strings -Wno-address-of-packed-member -Wno-packed-not-aligned -Wno-missing-field-initializers -Wno-zero-length-bounds -D_GNU_SOURCE -DRTE_LIBRTE_I40E_16BYTE_RX_DESC -DRTE_LIBRTE_ICE_16BYTE_RX_DESC -fPIC -march=native -mrtm -DALLOW_EXPERIMENTAL_API -DALLOW_INTERNAL_API -Wno-format-truncation -Wno-uninitialized -DRTE_LOG_DEFAULT_LOGTYPE=pmd.dma.cnxk -MD -MQ drivers/libtmp_rte_dma_cnxk.a.p/dma_cnxk_cnxk_dmadev.c.o -MF drivers/libtmp_rte_dma_cnxk.a.p/dma_cnxk_cnxk_dmadev.c.o.d -o drivers/libtmp_rte_dma_cnxk.a.p/dma_cnxk_cnxk_dmadev.c.o -c ../drivers/dma/cnxk/cnxk_dmadev.c
../drivers/dma/cnxk/cnxk_dmadev.c: In function ‘cnxk_dmadev_info_get’:
../drivers/dma/cnxk/cnxk_dmadev.c:24:39: error: ‘RTE_DMA_CAPA_PRI_POLICY_SP’ undeclared (first use in this function); did you mean ‘RTE_DMA_CAPA_OPS_COPY_SG’?
   24 |                 dev_info->dev_capa |= RTE_DMA_CAPA_PRI_POLICY_SP;
      |                                       ^~~~~~~~~~~~~~~~~~~~~~~~~~
      |                                       RTE_DMA_CAPA_OPS_COPY_SG
../drivers/dma/cnxk/cnxk_dmadev.c:24:39: note: each undeclared identifier is reported only once for each function it appears in
../drivers/dma/cnxk/cnxk_dmadev.c:25:25: error: ‘struct rte_dma_info’ has no member named ‘nb_priorities’
   25 |                 dev_info->nb_priorities = CN10K_DPI_MAX_PRI;
      |                         ^~
../drivers/dma/cnxk/cnxk_dmadev.c: In function ‘cnxk_dmadev_configure’:
../drivers/dma/cnxk/cnxk_dmadev.c:115:44: error: ‘const struct rte_dma_conf’ has no member named ‘priority’
  115 |                 dpivf->rdpi.priority = conf->priority;
      |                                            ^~
[501/3199] Generating lib/table.sym_chk with a custom command (wrapped by meson to capture output)
[502/3199] Compiling C object lib/librte_graph.a.p/graph_graph_debug.c.o
[503/3199] Compiling C object lib/librte_graph.a.p/graph_graph_ops.c.o
[504/3199] Compiling C object lib/librte_graph.a.p/graph_graph.c.o
[505/3199] Compiling C object lib/librte_pipeline.a.p/pipeline_rte_swx_ctl.c.o
[506/3199] Compiling C object lib/librte_pipeline.a.p/pipeline_rte_swx_pipeline_spec.c.o
[507/3199] Compiling C object lib/librte_pipeline.a.p/pipeline_rte_swx_pipeline.c.o
[508/3199] Compiling C object lib/librte_vhost.a.p/vhost_virtio_net.c.o
[509/3199] Compiling C object lib/librte_pipeline.a.p/pipeline_rte_table_action.c.o
ninja: build stopped




*Build Failed #11:
OS: UB2404-64
Target: x86_64-native-linuxapp-gcc
FAILED: drivers/libtmp_rte_dma_cnxk.a.p/dma_cnxk_cnxk_dmadev.c.o 
gcc -Idrivers/libtmp_rte_dma_cnxk.a.p -Idrivers -I../drivers -Idrivers/dma/cnxk -I../drivers/dma/cnxk -Idrivers/event/cnxk -I../drivers/event/cnxk -Ilib/dmadev -I../lib/dmadev -I. -I.. -Iconfig -I../config -Ilib/eal/include -I../lib/eal/include -Ilib/eal/linux/include -I../lib/eal/linux/include -Ilib/eal/x86/include -I../lib/eal/x86/include -Ilib/eal/common -I../lib/eal/common -Ilib/eal -I../lib/eal -Ilib/kvargs -I../lib/kvargs -Ilib/log -I../lib/log -Ilib/metrics -I../lib/metrics -Ilib/telemetry -I../lib/telemetry -Idrivers/bus/pci -I../drivers/bus/pci -I../drivers/bus/pci/linux -Ilib/pci -I../lib/pci -Idrivers/common/cnxk -I../drivers/common/cnxk -Ilib/net -I../lib/net -Ilib/ethdev -I../lib/ethdev -Ilib/meter -I../lib/meter -Ilib/mbuf -I../lib/mbuf -Ilib/mempool -I../lib/mempool -Ilib/ring -I../lib/ring -Ilib/security -I../lib/security -Ilib/cryptodev -I../lib/cryptodev -Ilib/rcu -I../lib/rcu -Ilib/eventdev -I../lib/eventdev -Ilib/hash -I../lib/hash -Ilib/timer -I../lib/timer -fdiagnostics-color=always -D_FILE_OFFSET_BITS=64 -Wall -Winvalid-pch -Wextra -Werror -std=c11 -O3 -include rte_config.h -Wcast-qual -Wdeprecated -Wformat -Wformat-nonliteral -Wformat-security -Wmissing-declarations -Wmissing-prototypes -Wnested-externs -Wold-style-definition -Wpointer-arith -Wsign-compare -Wstrict-prototypes -Wundef -Wwrite-strings -Wno-address-of-packed-member -Wno-packed-not-aligned -Wno-missing-field-initializers -Wno-zero-length-bounds -D_GNU_SOURCE -fPIC -march=native -mrtm -DALLOW_EXPERIMENTAL_API -DALLOW_INTERNAL_API -Wno-format-truncation -Wno-uninitialized -DRTE_LOG_DEFAULT_LOGTYPE=pmd.dma.cnxk -MD -MQ drivers/libtmp_rte_dma_cnxk.a.p/dma_cnxk_cnxk_dmadev.c.o -MF drivers/libtmp_rte_dma_cnxk.a.p/dma_cnxk_cnxk_dmadev.c.o.d -o drivers/libtmp_rte_dma_cnxk.a.p/dma_cnxk_cnxk_dmadev.c.o -c ../drivers/dma/cnxk/cnxk_dmadev.c
../drivers/dma/cnxk/cnxk_dmadev.c: In function ‘cnxk_dmadev_info_get’:
../drivers/dma/cnxk/cnxk_dmadev.c:24:39: error: ‘RTE_DMA_CAPA_PRI_POLICY_SP’ undeclared (first use in this function); did you mean ‘RTE_DMA_CAPA_OPS_COPY_SG’?
   24 |                 dev_info->dev_capa |= RTE_DMA_CAPA_PRI_POLICY_SP;
      |                                       ^~~~~~~~~~~~~~~~~~~~~~~~~~
      |                                       RTE_DMA_CAPA_OPS_COPY_SG
../drivers/dma/cnxk/cnxk_dmadev.c:24:39: note: each undeclared identifier is reported only once for each function it appears in
../drivers/dma/cnxk/cnxk_dmadev.c:25:25: error: ‘struct rte_dma_info’ has no member named ‘nb_priorities’
   25 |                 dev_info->nb_priorities = CN10K_DPI_MAX_PRI;
      |                         ^~
../drivers/dma/cnxk/cnxk_dmadev.c: In function ‘cnxk_dmadev_configure’:
../drivers/dma/cnxk/cnxk_dmadev.c:115:44: error: ‘const struct rte_dma_conf’ has no member named ‘priority’
  115 |                 dpivf->rdpi.priority = conf->priority;
      |                                            ^~
[982/3195] Generating drivers/rte_mempool_octeontx.pmd.c with a custom command
[983/3195] Compiling C object drivers/librte_mempool_dpaa2.so.25.0.p/meson-generated_.._rte_mempool_dpaa2.pmd.c.o
[984/3195] Generating drivers/rte_mempool_cnxk.sym_chk with a custom command (wrapped by meson to capture output)
[985/3195] Generating drivers/rte_mempool_dpaa.sym_chk with a custom command (wrapped by meson to capture output)
[986/3195] Compiling C object drivers/libtmp_rte_mempool_ring.a.p/mempool_ring_rte_mempool_ring.c.o
[987/3195] Compiling C object drivers/libtmp_rte_net_pfe.a.p/net_pfe_pfe_ethdev.c.o
[988/3195] Compiling C object drivers/libtmp_rte_mempool_bucket.a.p/mempool_bucket_rte_mempool_bucket.c.o
[989/3195] Generating drivers/rte_common_cnxk.sym_chk with a custom command (wrapped by meson to capture output)
[990/3195] Generating drivers/rte_common_sfc_efx.sym_chk with a custom command (wrapped by meson to capture output)
ninja: build stopped




*Build Failed #12:
OS: UB2404-64
Target: x86_64-native-linuxapp-clang
FAILED: drivers/libtmp_rte_dma_cnxk.a.p/dma_cnxk_cnxk_dmadev.c.o 
clang -Idrivers/libtmp_rte_dma_cnxk.a.p -Idrivers -I../drivers -Idrivers/dma/cnxk -I../drivers/dma/cnxk -Idrivers/event/cnxk -I../drivers/event/cnxk -Ilib/dmadev -I../lib/dmadev -I. -I.. -Iconfig -I../config -Ilib/eal/include -I../lib/eal/include -Ilib/eal/linux/include -I../lib/eal/linux/include -Ilib/eal/x86/include -I../lib/eal/x86/include -Ilib/eal/common -I../lib/eal/common -Ilib/eal -I../lib/eal -Ilib/kvargs -I../lib/kvargs -Ilib/log -I../lib/log -Ilib/metrics -I../lib/metrics -Ilib/telemetry -I../lib/telemetry -Idrivers/bus/pci -I../drivers/bus/pci -I../drivers/bus/pci/linux -Ilib/pci -I../lib/pci -Idrivers/common/cnxk -I../drivers/common/cnxk -Ilib/net -I../lib/net -Ilib/ethdev -I../lib/ethdev -Ilib/meter -I../lib/meter -Ilib/mbuf -I../lib/mbuf -Ilib/mempool -I../lib/mempool -Ilib/ring -I../lib/ring -Ilib/security -I../lib/security -Ilib/cryptodev -I../lib/cryptodev -Ilib/rcu -I../lib/rcu -Ilib/eventdev -I../lib/eventdev -Ilib/hash -I../lib/hash -Ilib/timer -I../lib/timer -fcolor-diagnostics -D_FILE_OFFSET_BITS=64 -Wall -Winvalid-pch -Wextra -Werror -std=c11 -O3 -include rte_config.h -Wcast-qual -Wdeprecated -Wformat -Wformat-nonliteral -Wformat-security -Wmissing-declarations -Wmissing-prototypes -Wnested-externs -Wold-style-definition -Wpointer-arith -Wsign-compare -Wstrict-prototypes -Wundef -Wwrite-strings -Wno-address-of-packed-member -Wno-missing-field-initializers -D_GNU_SOURCE -fPIC -march=native -mrtm -DALLOW_EXPERIMENTAL_API -DALLOW_INTERNAL_API -Wno-format-truncation -Wno-uninitialized -DRTE_LOG_DEFAULT_LOGTYPE=pmd.dma.cnxk -DRTE_ANNOTATE_LOCKS -Wthread-safety -MD -MQ drivers/libtmp_rte_dma_cnxk.a.p/dma_cnxk_cnxk_dmadev.c.o -MF drivers/libtmp_rte_dma_cnxk.a.p/dma_cnxk_cnxk_dmadev.c.o.d -o drivers/libtmp_rte_dma_cnxk.a.p/dma_cnxk_cnxk_dmadev.c.o -c ../drivers/dma/cnxk/cnxk_dmadev.c
../drivers/dma/cnxk/cnxk_dmadev.c:24:25: error: use of undeclared identifier 'RTE_DMA_CAPA_PRI_POLICY_SP'
   24 |                 dev_info->dev_capa |= RTE_DMA_CAPA_PRI_POLICY_SP;
      |                                       ^
../drivers/dma/cnxk/cnxk_dmadev.c:25:13: error: no member named 'nb_priorities' in 'struct rte_dma_info'
   25 |                 dev_info->nb_priorities = CN10K_DPI_MAX_PRI;
      |                 ~~~~~~~~  ^
../drivers/dma/cnxk/cnxk_dmadev.c:115:32: error: no member named 'priority' in 'struct rte_dma_conf'
  115 |                 dpivf->rdpi.priority = conf->priority;
      |                                        ~~~~  ^
3 errors generated.
[980/3195] Linking static target drivers/librte_mempool_dpaa2.a
[981/3195] Compiling C object drivers/libtmp_rte_mempool_octeontx.a.p/mempool_octeontx_octeontx_fpavf.c.o
[982/3195] Generating drivers/rte_mempool_cnxk.sym_chk with a custom command (wrapped by meson to capture output)
[983/3195] Compiling C object drivers/libtmp_rte_mempool_bucket.a.p/mempool_bucket_rte_mempool_bucket.c.o
[984/3195] Generating drivers/rte_mempool_dpaa.sym_chk with a custom command (wrapped by meson to capture output)
[985/3195] Compiling C object drivers/libtmp_rte_mempool_ring.a.p/mempool_ring_rte_mempool_ring.c.o
[986/3195] Compiling C object drivers/libtmp_rte_net_pfe.a.p/net_pfe_pfe_ethdev.c.o
[987/3195] Generating drivers/rte_common_cnxk.sym_chk with a custom command (wrapped by meson to capture output)
[988/3195] Generating drivers/rte_common_sfc_efx.sym_chk with a custom command (wrapped by meson to capture output)
ninja: build stopped




*Build Failed #13:
OS: UB2404-64
Target: x86_64-native-linuxapp-doc
FAILED: drivers/libtmp_rte_dma_cnxk.a.p/dma_cnxk_cnxk_dmadev.c.o 
gcc -Idrivers/libtmp_rte_dma_cnxk.a.p -Idrivers -I../drivers -Idrivers/dma/cnxk -I../drivers/dma/cnxk -Idrivers/event/cnxk -I../drivers/event/cnxk -Ilib/dmadev -I../lib/dmadev -I. -I.. -Iconfig -I../config -Ilib/eal/include -I../lib/eal/include -Ilib/eal/linux/include -I../lib/eal/linux/include -Ilib/eal/x86/include -I../lib/eal/x86/include -Ilib/eal/common -I../lib/eal/common -Ilib/eal -I../lib/eal -Ilib/kvargs -I../lib/kvargs -Ilib/log -I../lib/log -Ilib/metrics -I../lib/metrics -Ilib/telemetry -I../lib/telemetry -Idrivers/bus/pci -I../drivers/bus/pci -I../drivers/bus/pci/linux -Ilib/pci -I../lib/pci -Idrivers/common/cnxk -I../drivers/common/cnxk -Ilib/net -I../lib/net -Ilib/ethdev -I../lib/ethdev -Ilib/meter -I../lib/meter -Ilib/mbuf -I../lib/mbuf -Ilib/mempool -I../lib/mempool -Ilib/ring -I../lib/ring -Ilib/security -I../lib/security -Ilib/cryptodev -I../lib/cryptodev -Ilib/rcu -I../lib/rcu -Ilib/eventdev -I../lib/eventdev -Ilib/hash -I../lib/hash -Ilib/timer -I../lib/timer -fdiagnostics-color=always -D_FILE_OFFSET_BITS=64 -Wall -Winvalid-pch -Wextra -Werror -std=c11 -O3 -include rte_config.h -Wcast-qual -Wdeprecated -Wformat -Wformat-nonliteral -Wformat-security -Wmissing-declarations -Wmissing-prototypes -Wnested-externs -Wold-style-definition -Wpointer-arith -Wsign-compare -Wstrict-prototypes -Wundef -Wwrite-strings -Wno-address-of-packed-member -Wno-packed-not-aligned -Wno-missing-field-initializers -Wno-zero-length-bounds -D_GNU_SOURCE -fPIC -march=native -mrtm -DALLOW_EXPERIMENTAL_API -DALLOW_INTERNAL_API -Wno-format-truncation -Wno-uninitialized -DRTE_LOG_DEFAULT_LOGTYPE=pmd.dma.cnxk -MD -MQ drivers/libtmp_rte_dma_cnxk.a.p/dma_cnxk_cnxk_dmadev.c.o -MF drivers/libtmp_rte_dma_cnxk.a.p/dma_cnxk_cnxk_dmadev.c.o.d -o drivers/libtmp_rte_dma_cnxk.a.p/dma_cnxk_cnxk_dmadev.c.o -c ../drivers/dma/cnxk/cnxk_dmadev.c
../drivers/dma/cnxk/cnxk_dmadev.c: In function ‘cnxk_dmadev_info_get’:
../drivers/dma/cnxk/cnxk_dmadev.c:24:39: error: ‘RTE_DMA_CAPA_PRI_POLICY_SP’ undeclared (first use in this function); did you mean ‘RTE_DMA_CAPA_OPS_COPY_SG’?
   24 |                 dev_info->dev_capa |= RTE_DMA_CAPA_PRI_POLICY_SP;
      |                                       ^~~~~~~~~~~~~~~~~~~~~~~~~~
      |                                       RTE_DMA_CAPA_OPS_COPY_SG
../drivers/dma/cnxk/cnxk_dmadev.c:24:39: note: each undeclared identifier is reported only once for each function it appears in
../drivers/dma/cnxk/cnxk_dmadev.c:25:25: error: ‘struct rte_dma_info’ has no member named ‘nb_priorities’
   25 |                 dev_info->nb_priorities = CN10K_DPI_MAX_PRI;
      |                         ^~
../drivers/dma/cnxk/cnxk_dmadev.c: In function ‘cnxk_dmadev_configure’:
../drivers/dma/cnxk/cnxk_dmadev.c:115:44: error: ‘const struct rte_dma_conf’ has no member named ‘priority’
  115 |                 dpivf->rdpi.priority = conf->priority;
      |                                            ^~
[986/3022] Linking target drivers/librte_mempool_octeontx.so.25.0
[987/3022] Compiling C object drivers/librte_mempool_dpaa2.so.25.0.p/meson-generated_.._rte_mempool_dpaa2.pmd.c.o
[988/3022] Generating drivers/rte_mempool_cnxk.sym_chk with a custom command (wrapped by meson to capture output)
[989/3022] Generating drivers/rte_mempool_dpaa.sym_chk with a custom command (wrapped by meson to capture output)
[990/3022] Compiling C object drivers/libtmp_rte_mempool_ring.a.p/mempool_ring_rte_mempool_ring.c.o
[991/3022] Compiling C object drivers/libtmp_rte_mempool_bucket.a.p/mempool_bucket_rte_mempool_bucket.c.o
[992/3022] Compiling C object drivers/libtmp_rte_net_pfe.a.p/net_pfe_pfe_ethdev.c.o
[993/3022] Generating drivers/rte_common_cnxk.sym_chk with a custom command (wrapped by meson to capture output)
[994/3022] Generating drivers/rte_common_sfc_efx.sym_chk with a custom command (wrapped by meson to capture output)
ninja: build stopped




*Build Failed #14:
OS: RHEL94-64Rt
Target: x86_64-native-linuxapp-gcc
FAILED: drivers/libtmp_rte_dma_cnxk.a.p/dma_cnxk_cnxk_dmadev.c.o 
gcc -Idrivers/libtmp_rte_dma_cnxk.a.p -Idrivers -I../drivers -Idrivers/dma/cnxk -I../drivers/dma/cnxk -Idrivers/event/cnxk -I../drivers/event/cnxk -Ilib/dmadev -I../lib/dmadev -I. -I.. -Iconfig -I../config -Ilib/eal/include -I../lib/eal/include -Ilib/eal/linux/include -I../lib/eal/linux/include -Ilib/eal/x86/include -I../lib/eal/x86/include -Ilib/eal/common -I../lib/eal/common -Ilib/eal -I../lib/eal -Ilib/kvargs -I../lib/kvargs -Ilib/log -I../lib/log -Ilib/metrics -I../lib/metrics -Ilib/telemetry -I../lib/telemetry -Idrivers/bus/pci -I../drivers/bus/pci -I../drivers/bus/pci/linux -Ilib/pci -I../lib/pci -Idrivers/common/cnxk -I../drivers/common/cnxk -Ilib/net -I../lib/net -Ilib/ethdev -I../lib/ethdev -Ilib/meter -I../lib/meter -Ilib/mbuf -I../lib/mbuf -Ilib/mempool -I../lib/mempool -Ilib/ring -I../lib/ring -Ilib/security -I../lib/security -Ilib/cryptodev -I../lib/cryptodev -Ilib/rcu -I../lib/rcu -Ilib/eventdev -I../lib/eventdev -Ilib/hash -I../lib/hash -Ilib/timer -I../lib/timer -fdiagnostics-color=always -D_FILE_OFFSET_BITS=64 -Wall -Winvalid-pch -Wextra -Werror -std=c11 -O3 -include rte_config.h -Wcast-qual -Wdeprecated -Wformat -Wformat-nonliteral -Wformat-security -Wmissing-declarations -Wmissing-prototypes -Wnested-externs -Wold-style-definition -Wpointer-arith -Wsign-compare -Wstrict-prototypes -Wundef -Wwrite-strings -Wno-address-of-packed-member -Wno-packed-not-aligned -Wno-missing-field-initializers -Wno-zero-length-bounds -D_GNU_SOURCE -fPIC -march=native -mrtm -DALLOW_EXPERIMENTAL_API -DALLOW_INTERNAL_API -Wno-format-truncation -Wno-uninitialized -DRTE_LOG_DEFAULT_LOGTYPE=pmd.dma.cnxk -MD -MQ drivers/libtmp_rte_dma_cnxk.a.p/dma_cnxk_cnxk_dmadev.c.o -MF drivers/libtmp_rte_dma_cnxk.a.p/dma_cnxk_cnxk_dmadev.c.o.d -o drivers/libtmp_rte_dma_cnxk.a.p/dma_cnxk_cnxk_dmadev.c.o -c ../drivers/dma/cnxk/cnxk_dmadev.c
../drivers/dma/cnxk/cnxk_dmadev.c: In function ‘cnxk_dmadev_info_get’:
../drivers/dma/cnxk/cnxk_dmadev.c:24:39: error: ‘RTE_DMA_CAPA_PRI_POLICY_SP’ undeclared (first use in this function); did you mean ‘RTE_DMA_CAPA_OPS_COPY_SG’?
   24 |                 dev_info->dev_capa |= RTE_DMA_CAPA_PRI_POLICY_SP;
      |                                       ^~~~~~~~~~~~~~~~~~~~~~~~~~
      |                                       RTE_DMA_CAPA_OPS_COPY_SG
../drivers/dma/cnxk/cnxk_dmadev.c:24:39: note: each undeclared identifier is reported only once for each function it appears in
../drivers/dma/cnxk/cnxk_dmadev.c:25:25: error: ‘struct rte_dma_info’ has no member named ‘nb_priorities’
   25 |                 dev_info->nb_priorities = CN10K_DPI_MAX_PRI;
      |                         ^~
../drivers/dma/cnxk/cnxk_dmadev.c: In function ‘cnxk_dmadev_configure’:
../drivers/dma/cnxk/cnxk_dmadev.c:115:44: error: ‘const struct rte_dma_conf’ has no member named ‘priority’
  115 |                 dpivf->rdpi.priority = conf->priority;
      |                                            ^~
[956/3044] Compiling C object drivers/libtmp_rte_mempool_octeontx.a.p/mempool_octeontx_rte_mempool_octeontx.c.o
[957/3044] Generating drivers/rte_mempool_bucket.pmd.c with a custom command
[958/3044] Generating drivers/rte_mempool_dpaa2.pmd.c with a custom command
[959/3044] Compiling C object drivers/libtmp_rte_mempool_ring.a.p/mempool_ring_rte_mempool_ring.c.o
[960/3044] Generating drivers/rte_mempool_cnxk.sym_chk with a custom command (wrapped by meson to capture output)
[961/3044] Generating drivers/rte_mempool_dpaa.sym_chk with a custom command (wrapped by meson to capture output)
[962/3044] Compiling C object drivers/libtmp_rte_mempool_stack.a.p/mempool_stack_rte_mempool_stack.c.o
[963/3044] Generating drivers/rte_common_sfc_efx.sym_chk with a custom command (wrapped by meson to capture output)
[964/3044] Generating drivers/rte_common_cnxk.sym_chk with a custom command (wrapped by meson to capture output)
ninja: build stopped




*Build Failed #15:
OS: UB2204-64
Target: x86_64-native-linuxapp-gcc
FAILED: drivers/libtmp_rte_dma_cnxk.a.p/dma_cnxk_cnxk_dmadev.c.o 
gcc -Idrivers/libtmp_rte_dma_cnxk.a.p -Idrivers -I../drivers -Idrivers/dma/cnxk -I../drivers/dma/cnxk -Idrivers/event/cnxk -I../drivers/event/cnxk -Ilib/dmadev -I../lib/dmadev -I. -I.. -Iconfig -I../config -Ilib/eal/include -I../lib/eal/include -Ilib/eal/linux/include -I../lib/eal/linux/include -Ilib/eal/x86/include -I../lib/eal/x86/include -Ilib/eal/common -I../lib/eal/common -Ilib/eal -I../lib/eal -Ilib/kvargs -I../lib/kvargs -Ilib/log -I../lib/log -Ilib/metrics -I../lib/metrics -Ilib/telemetry -I../lib/telemetry -Idrivers/bus/pci -I../drivers/bus/pci -I../drivers/bus/pci/linux -Ilib/pci -I../lib/pci -Idrivers/common/cnxk -I../drivers/common/cnxk -Ilib/net -I../lib/net -Ilib/ethdev -I../lib/ethdev -Ilib/meter -I../lib/meter -Ilib/mbuf -I../lib/mbuf -Ilib/mempool -I../lib/mempool -Ilib/ring -I../lib/ring -Ilib/security -I../lib/security -Ilib/cryptodev -I../lib/cryptodev -Ilib/rcu -I../lib/rcu -Ilib/eventdev -I../lib/eventdev -Ilib/hash -I../lib/hash -Ilib/timer -I../lib/timer -fdiagnostics-color=always -D_FILE_OFFSET_BITS=64 -Wall -Winvalid-pch -Wextra -Werror -std=c11 -O3 -include rte_config.h -Wcast-qual -Wdeprecated -Wformat -Wformat-nonliteral -Wformat-security -Wmissing-declarations -Wmissing-prototypes -Wnested-externs -Wold-style-definition -Wpointer-arith -Wsign-compare -Wstrict-prototypes -Wundef -Wwrite-strings -Wno-address-of-packed-member -Wno-packed-not-aligned -Wno-missing-field-initializers -Wno-zero-length-bounds -D_GNU_SOURCE -fPIC -march=native -mrtm -DALLOW_EXPERIMENTAL_API -DALLOW_INTERNAL_API -Wno-format-truncation -Wno-uninitialized -DRTE_LOG_DEFAULT_LOGTYPE=pmd.dma.cnxk -MD -MQ drivers/libtmp_rte_dma_cnxk.a.p/dma_cnxk_cnxk_dmadev.c.o -MF drivers/libtmp_rte_dma_cnxk.a.p/dma_cnxk_cnxk_dmadev.c.o.d -o drivers/libtmp_rte_dma_cnxk.a.p/dma_cnxk_cnxk_dmadev.c.o -c ../drivers/dma/cnxk/cnxk_dmadev.c
../drivers/dma/cnxk/cnxk_dmadev.c: In function ‘cnxk_dmadev_info_get’:
../drivers/dma/cnxk/cnxk_dmadev.c:24:39: error: ‘RTE_DMA_CAPA_PRI_POLICY_SP’ undeclared (first use in this function); did you mean ‘RTE_DMA_CAPA_OPS_COPY_SG’?
   24 |                 dev_info->dev_capa |= RTE_DMA_CAPA_PRI_POLICY_SP;
      |                                       ^~~~~~~~~~~~~~~~~~~~~~~~~~
      |                                       RTE_DMA_CAPA_OPS_COPY_SG
../drivers/dma/cnxk/cnxk_dmadev.c:24:39: note: each undeclared identifier is reported only once for each function it appears in
../drivers/dma/cnxk/cnxk_dmadev.c:25:25: error: ‘struct rte_dma_info’ has no member named ‘nb_priorities’
   25 |                 dev_info->nb_priorities = CN10K_DPI_MAX_PRI;
      |                         ^~
../drivers/dma/cnxk/cnxk_dmadev.c: In function ‘cnxk_dmadev_configure’:
../drivers/dma/cnxk/cnxk_dmadev.c:115:44: error: ‘const struct rte_dma_conf’ has no member named ‘priority’
  115 |                 dpivf->rdpi.priority = conf->priority;
      |                                            ^~
[956/3041] Compiling C object drivers/librte_mempool_dpaa.a.p/meson-generated_.._rte_mempool_dpaa.pmd.c.o
[957/3041] Generating drivers/rte_mempool_octeontx.pmd.c with a custom command
[958/3041] Generating drivers/rte_mempool_dpaa2.pmd.c with a custom command
[959/3041] Generating drivers/rte_mempool_cnxk.sym_chk with a custom command (wrapped by meson to capture output)
[960/3041] Compiling C object drivers/libtmp_rte_mempool_ring.a.p/mempool_ring_rte_mempool_ring.c.o
[961/3041] Compiling C object drivers/libtmp_rte_mempool_stack.a.p/mempool_stack_rte_mempool_stack.c.o
[962/3041] Compiling C object drivers/libtmp_rte_mempool_bucket.a.p/mempool_bucket_rte_mempool_bucket.c.o
[963/3041] Generating drivers/rte_common_sfc_efx.sym_chk with a custom command (wrapped by meson to capture output)
[964/3041] Generating drivers/rte_common_cnxk.sym_chk with a custom command (wrapped by meson to capture output)
ninja: build stopped




*Build Failed #16:
OS: FC40-64
Target: x86_64-native-linuxapp-gcc
FAILED: drivers/libtmp_rte_dma_cnxk.a.p/dma_cnxk_cnxk_dmadev.c.o 
gcc -Idrivers/libtmp_rte_dma_cnxk.a.p -Idrivers -I../drivers -Idrivers/dma/cnxk -I../drivers/dma/cnxk -Idrivers/event/cnxk -I../drivers/event/cnxk -Ilib/dmadev -I../lib/dmadev -I. -I.. -Iconfig -I../config -Ilib/eal/include -I../lib/eal/include -Ilib/eal/linux/include -I../lib/eal/linux/include -Ilib/eal/x86/include -I../lib/eal/x86/include -Ilib/eal/common -I../lib/eal/common -Ilib/eal -I../lib/eal -Ilib/kvargs -I../lib/kvargs -Ilib/log -I../lib/log -Ilib/metrics -I../lib/metrics -Ilib/telemetry -I../lib/telemetry -Idrivers/bus/pci -I../drivers/bus/pci -I../drivers/bus/pci/linux -Ilib/pci -I../lib/pci -Idrivers/common/cnxk -I../drivers/common/cnxk -Ilib/net -I../lib/net -Ilib/ethdev -I../lib/ethdev -Ilib/meter -I../lib/meter -Ilib/mbuf -I../lib/mbuf -Ilib/mempool -I../lib/mempool -Ilib/ring -I../lib/ring -Ilib/security -I../lib/security -Ilib/cryptodev -I../lib/cryptodev -Ilib/rcu -I../lib/rcu -Ilib/eventdev -I../lib/eventdev -Ilib/hash -I../lib/hash -Ilib/timer -I../lib/timer -fdiagnostics-color=always -D_FILE_OFFSET_BITS=64 -Wall -Winvalid-pch -Wextra -Werror -std=c11 -O3 -include rte_config.h -Wcast-qual -Wdeprecated -Wformat -Wformat-nonliteral -Wformat-security -Wmissing-declarations -Wmissing-prototypes -Wnested-externs -Wold-style-definition -Wpointer-arith -Wsign-compare -Wstrict-prototypes -Wundef -Wwrite-strings -Wno-address-of-packed-member -Wno-packed-not-aligned -Wno-missing-field-initializers -Wno-zero-length-bounds -D_GNU_SOURCE -fPIC -march=native -mrtm -DALLOW_EXPERIMENTAL_API -DALLOW_INTERNAL_API -Wno-format-truncation -Wno-uninitialized -DRTE_LOG_DEFAULT_LOGTYPE=pmd.dma.cnxk -MD -MQ drivers/libtmp_rte_dma_cnxk.a.p/dma_cnxk_cnxk_dmadev.c.o -MF drivers/libtmp_rte_dma_cnxk.a.p/dma_cnxk_cnxk_dmadev.c.o.d -o drivers/libtmp_rte_dma_cnxk.a.p/dma_cnxk_cnxk_dmadev.c.o -c ../drivers/dma/cnxk/cnxk_dmadev.c
../drivers/dma/cnxk/cnxk_dmadev.c: In function ‘cnxk_dmadev_info_get’:
../drivers/dma/cnxk/cnxk_dmadev.c:24:39: error: ‘RTE_DMA_CAPA_PRI_POLICY_SP’ undeclared (first use in this function); did you mean ‘RTE_DMA_CAPA_OPS_COPY_SG’?
   24 |                 dev_info->dev_capa |= RTE_DMA_CAPA_PRI_POLICY_SP;
      |                                       ^~~~~~~~~~~~~~~~~~~~~~~~~~
      |                                       RTE_DMA_CAPA_OPS_COPY_SG
../drivers/dma/cnxk/cnxk_dmadev.c:24:39: note: each undeclared identifier is reported only once for each function it appears in
../drivers/dma/cnxk/cnxk_dmadev.c:25:25: error: ‘struct rte_dma_info’ has no member named ‘nb_priorities’
   25 |                 dev_info->nb_priorities = CN10K_DPI_MAX_PRI;
      |                         ^~
../drivers/dma/cnxk/cnxk_dmadev.c: In function ‘cnxk_dmadev_configure’:
../drivers/dma/cnxk/cnxk_dmadev.c:115:44: error: ‘const struct rte_dma_conf’ has no member named ‘priority’
  115 |                 dpivf->rdpi.priority = conf->priority;
      |                                            ^~
[989/3199] Compiling C object drivers/librte_mempool_dpaa2.so.25.0.p/meson-generated_.._rte_mempool_dpaa2.pmd.c.o
[990/3199] Compiling C object drivers/librte_mempool_dpaa2.a.p/meson-generated_.._rte_mempool_dpaa2.pmd.c.o
[991/3199] Generating drivers/rte_mempool_cnxk.sym_chk with a custom command (wrapped by meson to capture output)
[992/3199] Generating symbol file drivers/librte_common_cnxk.so.25.0.p/librte_common_cnxk.so.25.0.symbols
[993/3199] Generating drivers/rte_mempool_dpaa.sym_chk with a custom command (wrapped by meson to capture output)
[994/3199] Compiling C object drivers/libtmp_rte_net_pfe.a.p/net_pfe_pfe_hal.c.o
[995/3199] Compiling C object drivers/libtmp_rte_mempool_ring.a.p/mempool_ring_rte_mempool_ring.c.o
[996/3199] Compiling C object drivers/libtmp_rte_mempool_bucket.a.p/mempool_bucket_rte_mempool_bucket.c.o
[997/3199] Generating drivers/rte_common_sfc_efx.sym_chk with a custom command (wrapped by meson to capture output)
ninja: build stopped




*Build Failed #17:
OS: FC40-64
Target: x86_64-native-linuxapp-clang
FAILED: drivers/libtmp_rte_dma_cnxk.a.p/dma_cnxk_cnxk_dmadev.c.o 
clang -Idrivers/libtmp_rte_dma_cnxk.a.p -Idrivers -I../drivers -Idrivers/dma/cnxk -I../drivers/dma/cnxk -Idrivers/event/cnxk -I../drivers/event/cnxk -Ilib/dmadev -I../lib/dmadev -I. -I.. -Iconfig -I../config -Ilib/eal/include -I../lib/eal/include -Ilib/eal/linux/include -I../lib/eal/linux/include -Ilib/eal/x86/include -I../lib/eal/x86/include -Ilib/eal/common -I../lib/eal/common -Ilib/eal -I../lib/eal -Ilib/kvargs -I../lib/kvargs -Ilib/log -I../lib/log -Ilib/metrics -I../lib/metrics -Ilib/telemetry -I../lib/telemetry -Idrivers/bus/pci -I../drivers/bus/pci -I../drivers/bus/pci/linux -Ilib/pci -I../lib/pci -Idrivers/common/cnxk -I../drivers/common/cnxk -Ilib/net -I../lib/net -Ilib/ethdev -I../lib/ethdev -Ilib/meter -I../lib/meter -Ilib/mbuf -I../lib/mbuf -Ilib/mempool -I../lib/mempool -Ilib/ring -I../lib/ring -Ilib/security -I../lib/security -Ilib/cryptodev -I../lib/cryptodev -Ilib/rcu -I../lib/rcu -Ilib/eventdev -I../lib/eventdev -Ilib/hash -I../lib/hash -Ilib/timer -I../lib/timer -fcolor-diagnostics -D_FILE_OFFSET_BITS=64 -Wall -Winvalid-pch -Wextra -Werror -std=c11 -O3 -include rte_config.h -Wcast-qual -Wdeprecated -Wformat -Wformat-nonliteral -Wformat-security -Wmissing-declarations -Wmissing-prototypes -Wnested-externs -Wold-style-definition -Wpointer-arith -Wsign-compare -Wstrict-prototypes -Wundef -Wwrite-strings -Wno-address-of-packed-member -Wno-missing-field-initializers -D_GNU_SOURCE -fPIC -march=native -mrtm -DALLOW_EXPERIMENTAL_API -DALLOW_INTERNAL_API -Wno-format-truncation -Wno-uninitialized -DRTE_LOG_DEFAULT_LOGTYPE=pmd.dma.cnxk -DRTE_ANNOTATE_LOCKS -Wthread-safety -MD -MQ drivers/libtmp_rte_dma_cnxk.a.p/dma_cnxk_cnxk_dmadev.c.o -MF drivers/libtmp_rte_dma_cnxk.a.p/dma_cnxk_cnxk_dmadev.c.o.d -o drivers/libtmp_rte_dma_cnxk.a.p/dma_cnxk_cnxk_dmadev.c.o -c ../drivers/dma/cnxk/cnxk_dmadev.c
../drivers/dma/cnxk/cnxk_dmadev.c:24:25: error: use of undeclared identifier 'RTE_DMA_CAPA_PRI_POLICY_SP'
   24 |                 dev_info->dev_capa |= RTE_DMA_CAPA_PRI_POLICY_SP;
      |                                       ^
../drivers/dma/cnxk/cnxk_dmadev.c:25:13: error: no member named 'nb_priorities' in 'struct rte_dma_info'
   25 |                 dev_info->nb_priorities = CN10K_DPI_MAX_PRI;
      |                 ~~~~~~~~  ^
../drivers/dma/cnxk/cnxk_dmadev.c:115:32: error: no member named 'priority' in 'struct rte_dma_conf'
  115 |                 dpivf->rdpi.priority = conf->priority;
      |                                        ~~~~  ^
3 errors generated.
[991/3199] Linking static target drivers/librte_mempool_bucket.a
[992/3199] Compiling C object drivers/librte_mempool_bucket.so.25.0.p/meson-generated_.._rte_mempool_bucket.pmd.c.o
[993/3199] Generating drivers/rte_mempool_dpaa.sym_chk with a custom command (wrapped by meson to capture output)
[994/3199] Generating drivers/rte_mempool_octeontx.pmd.c with a custom command
[995/3199] Compiling C object drivers/libtmp_rte_mempool_ring.a.p/mempool_ring_rte_mempool_ring.c.o
[996/3199] Generating drivers/rte_mempool_dpaa2.sym_chk with a custom command (wrapped by meson to capture output)
[997/3199] Compiling C object drivers/libtmp_rte_net_pfe.a.p/net_pfe_pfe_hal.c.o
[998/3199] Generating drivers/rte_common_cnxk.sym_chk with a custom command (wrapped by meson to capture output)
[999/3199] Generating drivers/rte_common_sfc_efx.sym_chk with a custom command (wrapped by meson to capture output)
ninja: build stopped




*Build Failed #18:
OS: UB2404-64Rt
Target: x86_64-native-linuxapp-gcc
FAILED: drivers/libtmp_rte_dma_cnxk.a.p/dma_cnxk_cnxk_dmadev.c.o 
gcc -Idrivers/libtmp_rte_dma_cnxk.a.p -Idrivers -I../drivers -Idrivers/dma/cnxk -I../drivers/dma/cnxk -Idrivers/event/cnxk -I../drivers/event/cnxk -Ilib/dmadev -I../lib/dmadev -I. -I.. -Iconfig -I../config -Ilib/eal/include -I../lib/eal/include -Ilib/eal/linux/include -I../lib/eal/linux/include -Ilib/eal/x86/include -I../lib/eal/x86/include -Ilib/eal/common -I../lib/eal/common -Ilib/eal -I../lib/eal -Ilib/kvargs -I../lib/kvargs -Ilib/log -I../lib/log -Ilib/metrics -I../lib/metrics -Ilib/telemetry -I../lib/telemetry -Idrivers/bus/pci -I../drivers/bus/pci -I../drivers/bus/pci/linux -Ilib/pci -I../lib/pci -Idrivers/common/cnxk -I../drivers/common/cnxk -Ilib/net -I../lib/net -Ilib/ethdev -I../lib/ethdev -Ilib/meter -I../lib/meter -Ilib/mbuf -I../lib/mbuf -Ilib/mempool -I../lib/mempool -Ilib/ring -I../lib/ring -Ilib/security -I../lib/security -Ilib/cryptodev -I../lib/cryptodev -Ilib/rcu -I../lib/rcu -Ilib/eventdev -I../lib/eventdev -Ilib/hash -I../lib/hash -Ilib/timer -I../lib/timer -fdiagnostics-color=always -D_FILE_OFFSET_BITS=64 -Wall -Winvalid-pch -Wextra -Werror -std=c11 -O3 -include rte_config.h -Wcast-qual -Wdeprecated -Wformat -Wformat-nonliteral -Wformat-security -Wmissing-declarations -Wmissing-prototypes -Wnested-externs -Wold-style-definition -Wpointer-arith -Wsign-compare -Wstrict-prototypes -Wundef -Wwrite-strings -Wno-address-of-packed-member -Wno-packed-not-aligned -Wno-missing-field-initializers -Wno-zero-length-bounds -D_GNU_SOURCE -fPIC -march=native -mrtm -DALLOW_EXPERIMENTAL_API -DALLOW_INTERNAL_API -Wno-format-truncation -Wno-uninitialized -DRTE_LOG_DEFAULT_LOGTYPE=pmd.dma.cnxk -MD -MQ drivers/libtmp_rte_dma_cnxk.a.p/dma_cnxk_cnxk_dmadev.c.o -MF drivers/libtmp_rte_dma_cnxk.a.p/dma_cnxk_cnxk_dmadev.c.o.d -o drivers/libtmp_rte_dma_cnxk.a.p/dma_cnxk_cnxk_dmadev.c.o -c ../drivers/dma/cnxk/cnxk_dmadev.c
../drivers/dma/cnxk/cnxk_dmadev.c: In function ‘cnxk_dmadev_info_get’:
../drivers/dma/cnxk/cnxk_dmadev.c:24:39: error: ‘RTE_DMA_CAPA_PRI_POLICY_SP’ undeclared (first use in this function); did you mean ‘RTE_DMA_CAPA_OPS_COPY_SG’?
   24 |                 dev_info->dev_capa |= RTE_DMA_CAPA_PRI_POLICY_SP;
      |                                       ^~~~~~~~~~~~~~~~~~~~~~~~~~
      |                                       RTE_DMA_CAPA_OPS_COPY_SG
../drivers/dma/cnxk/cnxk_dmadev.c:24:39: note: each undeclared identifier is reported only once for each function it appears in
../drivers/dma/cnxk/cnxk_dmadev.c:25:25: error: ‘struct rte_dma_info’ has no member named ‘nb_priorities’
   25 |                 dev_info->nb_priorities = CN10K_DPI_MAX_PRI;
      |                         ^~
../drivers/dma/cnxk/cnxk_dmadev.c: In function ‘cnxk_dmadev_configure’:
../drivers/dma/cnxk/cnxk_dmadev.c:115:44: error: ‘const struct rte_dma_conf’ has no member named ‘priority’
  115 |                 dpivf->rdpi.priority = conf->priority;
      |                                            ^~
[987/3185] Linking static target drivers/librte_mempool_dpaa2.a
[988/3185] Generating drivers/rte_mempool_bucket.pmd.c with a custom command
[989/3185] Generating drivers/rte_mempool_octeontx.pmd.c with a custom command
[990/3185] Generating drivers/rte_mempool_dpaa.sym_chk with a custom command (wrapped by meson to capture output)
[991/3185] Generating drivers/rte_mempool_cnxk.sym_chk with a custom command (wrapped by meson to capture output)
[992/3185] Compiling C object drivers/libtmp_rte_mempool_ring.a.p/mempool_ring_rte_mempool_ring.c.o
[993/3185] Compiling C object drivers/libtmp_rte_net_pfe.a.p/net_pfe_pfe_ethdev.c.o
[994/3185] Generating drivers/rte_common_cnxk.sym_chk with a custom command (wrapped by meson to capture output)
[995/3185] Generating drivers/rte_common_sfc_efx.sym_chk with a custom command (wrapped by meson to capture output)
ninja: build stopped


DPDK STV team

^ permalink raw reply	[flat|nested] only message in thread

only message in thread, other threads:[~2024-10-03 16:48 UTC | newest]

Thread overview: (only message) (download: mbox.gz / follow: Atom feed)
-- links below jump to the message on this page --
2024-10-03 16:48 compilation|FAILURE| pw(144987) sid(33241) job(PER_PATCH_BUILD13378)[v1, 1/1] dma/cnxk: support dma queue priority configuration sys_stv

This is a public inbox, see mirroring instructions
for how to clone and mirror all data and code used for this inbox;
as well as URLs for NNTP newsgroup(s).