automatic DPDK test reports
 help / color / Atom feed
* [dpdk-test-report] |FAILURE| pw(81195) [14/14] net/bnxt: add VXLAN decap offload support
@ 2020-10-17 14:33 sys_stv
  0 siblings, 0 replies; only message in thread
From: sys_stv @ 2020-10-17 14:33 UTC (permalink / raw)
  To: test-report

[-- Attachment #1: Type: text/plain, Size: 26208 bytes --]


Test-Label: Intel-compilation
Test-Status: FAILURE
http://dpdk.org/patch/81195

_Compilation issues_

Submitter: Venkat Duvvuru <venkatkumar.duvvuru@broadcom.com>
Date: 2020-10-17 06:28:09
Reply_mail: 1602916089-18576-15-git-send-email-venkatkumar.duvvuru@broadcom.com

DPDK git baseline: Repo:dpdk-next-net-brcm, CommitID: 2b337dd4d35b36d8670ff5c8a7ca70c8cfa6709a


Meson Build Summary: 21 Builds Done, 14 Successful, 7 Failures, 0 Blocked

+----------------+------------+--------------+------------+------------+-----------+----------+
| os             | gcc-static | clang-static | icc-static | gcc-shared | gcc-debug | document |
+----------------+------------+--------------+------------+------------+-----------+----------+
| CENTOS82-64    | pass       | FAIL         | pass       | pass       | pass      |          |
| RHEL82-64      | pass       |              |            |            |           |          |
| UB1804-64      | pass       |              |            |            |           |          |
| FC32-64        | FAIL       | FAIL         |            |            |           |          |
| UB2004-64      | FAIL       | FAIL         | pass       |            |           | pass     |
| WIN10-64       |            | pass         |            |            |           |          |
| UB2004-32      | pass       |              |            |            |           |          |
| FreeBSD1201-64 | pass       | FAIL         |            | pass       | pass      |          |
| SUSE15-64      | pass       | FAIL         |            |            |           |          |
+----------------+------------+--------------+------------+------------+-----------+----------+
Test environment and configuration as below:


OS: CENTOS82-64
	Kernel Version: 4.18.0-193.14.2.el8_2.x86_64
	CPU info: Intel(R) Xeon(R) Platinum 8280M CPU @ 2.70GHz
	GCC Version: gcc (GCC) 8.3.1 20191121 (Red Hat 8.3.1-5)
	Clang Version: 9.0.1 (Red Hat 9.0.1-2.module_el8.2.0+309+0c7b6b03)
	x86_64-native-linuxapp-gcc
	x86_64-native-linuxapp-clang
	x86_64-native-linuxapp-icc
	x86_64-native-linuxapp-gcc+shared
	x86_64-native-linuxapp-gcc+debug

OS: RHEL82-64
	Kernel Version: 4.18.0-193.el8.x86_64
	CPU info: Intel(R) Xeon(R) Platinum 8280M CPU @ 2.70GHz
	GCC Version: gcc (GCC) 8.3.1 20191121 (Red Hat 8.3.1-5)
	Clang Version: 8.0.1 (Red Hat 8.0.1-1.module_el8.1.0+215+a01033fb)
	x86_64-native-linuxapp-gcc

OS: UB1804-64
	Kernel Version: 5.3.0-59-generic
	CPU info: Intel(R) Xeon(R) Platinum 8180 CPU @ 2.50GHz
	GCC Version: gcc (Ubuntu 8.4.0-1ubuntu1~18.04) 8.4.0
	Clang Version: 6.0.0-1ubuntu2 (tags/RELEASE_600/final)
	x86_64-native-linuxapp-gcc

OS: FC32-64
	Kernel Version: 5.6.0-0.rc7.git0.2.fc32.x86_64
	CPU info: Intel(R) Xeon(R) Platinum 8280M CPU @ 2.70GHz
	GCC Version: gcc (GCC) 10.0.1 20200311 (Red Hat 10.0.1-0.9)
	Clang Version: 10.0.0 (Fedora 10.0.0-0.3.rc4.fc32)
	x86_64-native-linuxapp-gcc
	x86_64-native-linuxapp-clang

OS: UB2004-64
	Kernel Version: 5.4.0-47-generic
	CPU info: Intel(R) Xeon(R) Platinum 8180 CPU @ 2.50GHz
	GCC Version: gcc (Ubuntu 10-20200416-0ubuntu1) 10.0.1 20200416 (experimental) [master revision 3c3f12e2a76:dcee354ce56:44b326839d864fc10c459916abcc97f35a9ac3de]
	Clang Version: 10.0.0-4ubuntu1
	x86_64-native-linuxapp-clang
	x86_64-native-linuxapp-gcc
	x86_64-native-linuxapp-icc
	x86_64-native-linuxapp-doc

OS: WIN10-64
	Kernel Version: N/A
	CPU info: N/A
	GCC Version: N/A
	Clang Version: Clang 8.0.0
	x86_64-windows-clang

OS: UB2004-32
	Kernel Version: 5.4.0-47-generic
	CPU info: Intel(R) Xeon(R) Platinum 8180 CPU @ 2.50GHz
	GCC Version: gcc (Ubuntu 9.3.0-10ubuntu2) 9.3.0
	Clang Version: 10.0.0-4ubuntu1
	i686-native-linuxapp-gcc

OS: FreeBSD1201-64
	Kernel Version: 12.1-RELEASE
	CPU info: Intel(R) Xeon(R) CPU E5-2699 v3 @ 2.30GHz (2294.74-MHz K8-class CPU)
	GCC Version: gcc (FreeBSD Ports Collection) 9.2.0
	Clang Version: 8.0.1 (tags/RELEASE_801/final 366581) (based on LLVM 8.0.1)
	x86_64-native-bsdapp-gcc
	x86_64-native-bsdapp-clang
	x86_64-native-bsdapp-gcc+shared
	x86_64-native-bsdapp-gcc+debug

OS: SUSE15-64
	Kernel Version: 4.12.14-lp150.11-default
	CPU info: Intel(R) Xeon(R) CPU E5-2699 v4 @ 2.20GHz
	GCC Version: gcc (SUSE Linux) 7.3.1 20180323 [gcc-7-branch revision 258812]
	Clang Version: 5.0.1 (tags/RELEASE_501/final 312548)
	x86_64-native-linuxapp-clang
	x86_64-native-linuxapp-gcc



*Build Failed #1:
OS: CENTOS82-64
Target: x86_64-native-linuxapp-clang
FAILED: drivers/libtmp_rte_pmd_bnxt.a.p/net_bnxt_tf_core_tf_em_common.c.o 
clang -Idrivers/libtmp_rte_pmd_bnxt.a.p -Idrivers -I../drivers -Idrivers/net/bnxt -I../drivers/net/bnxt -I../drivers/net/bnxt/tf_ulp -I../drivers/net/bnxt/tf_core -Ilib/librte_ethdev -I../lib/librte_ethdev -I. -I.. -Iconfig -I../config -Ilib/librte_eal/include -I../lib/librte_eal/include -Ilib/librte_eal/linux/include -I../lib/librte_eal/linux/include -Ilib/librte_eal/x86/include -I../lib/librte_eal/x86/include -Ilib/librte_eal/common -I../lib/librte_eal/common -Ilib/librte_eal -I../lib/librte_eal -Ilib/librte_kvargs -I../lib/librte_kvargs -Ilib/librte_metrics -I../lib/librte_metrics -Ilib/librte_telemetry -I../lib/librte_telemetry -Ilib/librte_net -I../lib/librte_net -Ilib/librte_mbuf -I../lib/librte_mbuf -Ilib/librte_mempool -I../lib/librte_mempool -Ilib/librte_ring -I../lib/librte_ring -Ilib/librte_meter -I../lib/librte_meter -Idrivers/bus/pci -I../drivers/bus/pci -I../drivers/bus/pci/linux -Ilib/librte_pci -I../lib/librte_pci -Idrivers/bus/vdev -I../drivers/bus/vdev -Xclang -fcolor-diagnostics -pipe -D_FILE_OFFSET_BITS=64 -Wall -Winvalid-pch -Werror -O3 -include rte_config.h -Wextra -Wcast-qual -Wdeprecated -Wformat-nonliteral -Wformat-security -Wmissing-declarations -Wmissing-prototypes -Wnested-externs -Wold-style-definition -Wpointer-arith -Wsign-compare -Wstrict-prototypes -Wundef -Wwrite-strings -Wno-address-of-packed-member -Wno-missing-field-initializers -D_GNU_SOURCE -fPIC -march=native -mno-avx512f -DALLOW_EXPERIMENTAL_API -DALLOW_INTERNAL_API -MD -MQ drivers/libtmp_rte_pmd_bnxt.a.p/net_bnxt_tf_core_tf_em_common.c.o -MF drivers/libtmp_rte_pmd_bnxt.a.p/net_bnxt_tf_core_tf_em_common.c.o.d -o drivers/libtmp_rte_pmd_bnxt.a.p/net_bnxt_tf_core_tf_em_common.c.o -c ../drivers/net/bnxt/tf_core/tf_em_common.c
../drivers/net/bnxt/tf_core/tf_em_common.c:1119:20: error: implicit conversion from enumeration type 'enum tf_global_config_internal_type' to different enumeration type 'enum tf_global_config_type' [-Werror,-Wenum-conversion]
        gcfg_parms.type = TF_GLOBAL_CFG_INTERNAL_PARIF_2_PF;
                        ~ ^~~~~~~~~~~~~~~~~~~~~~~~~~~~~~~~~
1 error generated.
[974/2678] Compiling C object drivers/libtmp_rte_pmd_bnxt.a.p/net_bnxt_tf_core_tf_session.c.o
[975/2678] Compiling C object drivers/libtmp_rte_pmd_bnxt.a.p/net_bnxt_tf_core_tf_device_p4.c.o
[976/2678] Compiling C object drivers/libtmp_rte_pmd_bnxt.a.p/net_bnxt_tf_core_tf_em_internal.c.o
[977/2678] Compiling C object drivers/libtmp_rte_pmd_bnxt.a.p/net_bnxt_tf_core_tf_tcam.c.o
[978/2678] Compiling C object drivers/libtmp_rte_pmd_bnxt.a.p/net_bnxt_tf_core_tf_identifier.c.o
[979/2678] Compiling C object drivers/libtmp_rte_pmd_bnx2x.a.p/net_bnx2x_elink.c.o
[980/2678] Compiling C object drivers/libtmp_rte_pmd_bnxt.a.p/net_bnxt_tf_core_tfp.c.o
[981/2678] Compiling C object drivers/libtmp_rte_pmd_bnxt.a.p/net_bnxt_bnxt_hwrm.c.o
[982/2678] Compiling C object drivers/libtmp_rte_pmd_bnx2x.a.p/net_bnx2x_bnx2x.c.o
ninja: build stopped: subcommand failed




*Build Failed #2:
OS: FC32-64
Target: x86_64-native-linuxapp-gcc
FAILED: drivers/libtmp_rte_pmd_bnxt.a.p/net_bnxt_tf_core_tf_em_common.c.o 
gcc -Idrivers/libtmp_rte_pmd_bnxt.a.p -Idrivers -I../drivers -Idrivers/net/bnxt -I../drivers/net/bnxt -I../drivers/net/bnxt/tf_ulp -I../drivers/net/bnxt/tf_core -Ilib/librte_ethdev -I../lib/librte_ethdev -I. -I.. -Iconfig -I../config -Ilib/librte_eal/include -I../lib/librte_eal/include -Ilib/librte_eal/linux/include -I../lib/librte_eal/linux/include -Ilib/librte_eal/x86/include -I../lib/librte_eal/x86/include -Ilib/librte_eal/common -I../lib/librte_eal/common -Ilib/librte_eal -I../lib/librte_eal -Ilib/librte_kvargs -I../lib/librte_kvargs -Ilib/librte_metrics -I../lib/librte_metrics -Ilib/librte_telemetry -I../lib/librte_telemetry -Ilib/librte_net -I../lib/librte_net -Ilib/librte_mbuf -I../lib/librte_mbuf -Ilib/librte_mempool -I../lib/librte_mempool -Ilib/librte_ring -I../lib/librte_ring -Ilib/librte_meter -I../lib/librte_meter -Idrivers/bus/pci -I../drivers/bus/pci -I../drivers/bus/pci/linux -Ilib/librte_pci -I../lib/librte_pci -Idrivers/bus/vdev -I../drivers/bus/vdev -fdiagnostics-color=always -pipe -D_FILE_OFFSET_BITS=64 -Wall -Winvalid-pch -Werror -O3 -include rte_config.h -Wextra -Wcast-qual -Wdeprecated -Wformat-nonliteral -Wformat-security -Wmissing-declarations -Wmissing-prototypes -Wnested-externs -Wold-style-definition -Wpointer-arith -Wsign-compare -Wstrict-prototypes -Wundef -Wwrite-strings -Wno-address-of-packed-member -Wno-packed-not-aligned -Wno-missing-field-initializers -Wno-zero-length-bounds -D_GNU_SOURCE -fPIC -march=native -DALLOW_EXPERIMENTAL_API -DALLOW_INTERNAL_API -Wno-format-truncation -MD -MQ drivers/libtmp_rte_pmd_bnxt.a.p/net_bnxt_tf_core_tf_em_common.c.o -MF drivers/libtmp_rte_pmd_bnxt.a.p/net_bnxt_tf_core_tf_em_common.c.o.d -o drivers/libtmp_rte_pmd_bnxt.a.p/net_bnxt_tf_core_tf_em_common.c.o -c ../drivers/net/bnxt/tf_core/tf_em_common.c
../drivers/net/bnxt/tf_core/tf_em_common.c: In function ‘tf_em_ext_map_tbl_scope’:
../drivers/net/bnxt/tf_core/tf_em_common.c:1119:18: error: implicit conversion from ‘enum tf_global_config_internal_type’ to ‘enum tf_global_config_type’ [-Werror=enum-conversion]
 1119 |  gcfg_parms.type = TF_GLOBAL_CFG_INTERNAL_PARIF_2_PF;
      |                  ^
cc1: all warnings being treated as errors
[975/2682] Compiling C object drivers/librte_pmd_bond.so.21.0.p/meson-generated_.._rte_pmd_bond.pmd.c.o
[976/2682] Compiling C object drivers/librte_pmd_bond.a.p/meson-generated_.._rte_pmd_bond.pmd.c.o
[977/2682] Compiling C object drivers/libtmp_rte_pmd_bnxt.a.p/net_bnxt_tf_core_tf_device_p4.c.o
[978/2682] Compiling C object drivers/libtmp_rte_pmd_bnxt.a.p/net_bnxt_tf_core_tf_session.c.o
[979/2682] Compiling C object drivers/libtmp_rte_pmd_bnxt.a.p/net_bnxt_tf_core_tf_identifier.c.o
[980/2682] Compiling C object drivers/libtmp_rte_pmd_bnxt.a.p/net_bnxt_tf_core_tf_tcam.c.o
[981/2682] Compiling C object drivers/libtmp_rte_pmd_bnxt.a.p/net_bnxt_bnxt_reps.c.o
[982/2682] Compiling C object drivers/libtmp_rte_pmd_bnxt.a.p/net_bnxt_tf_core_tfp.c.o
[983/2682] Compiling C object drivers/libtmp_rte_pmd_bnx2x.a.p/net_bnx2x_bnx2x.c.o
[984/2682] Compiling C object drivers/libtmp_rte_pmd_bnx2x.a.p/net_bnx2x_elink.c.o
[985/2682] Compiling C object drivers/libtmp_rte_pmd_bnxt.a.p/net_bnxt_bnxt_hwrm.c.o
ninja: build stopped: subcommand failed




*Build Failed #3:
OS: FC32-64
Target: x86_64-native-linuxapp-clang
FAILED: drivers/libtmp_rte_pmd_bnxt.a.p/net_bnxt_tf_core_tf_em_common.c.o 
clang -Idrivers/libtmp_rte_pmd_bnxt.a.p -Idrivers -I../drivers -Idrivers/net/bnxt -I../drivers/net/bnxt -I../drivers/net/bnxt/tf_ulp -I../drivers/net/bnxt/tf_core -Ilib/librte_ethdev -I../lib/librte_ethdev -I. -I.. -Iconfig -I../config -Ilib/librte_eal/include -I../lib/librte_eal/include -Ilib/librte_eal/linux/include -I../lib/librte_eal/linux/include -Ilib/librte_eal/x86/include -I../lib/librte_eal/x86/include -Ilib/librte_eal/common -I../lib/librte_eal/common -Ilib/librte_eal -I../lib/librte_eal -Ilib/librte_kvargs -I../lib/librte_kvargs -Ilib/librte_metrics -I../lib/librte_metrics -Ilib/librte_telemetry -I../lib/librte_telemetry -Ilib/librte_net -I../lib/librte_net -Ilib/librte_mbuf -I../lib/librte_mbuf -Ilib/librte_mempool -I../lib/librte_mempool -Ilib/librte_ring -I../lib/librte_ring -Ilib/librte_meter -I../lib/librte_meter -Idrivers/bus/pci -I../drivers/bus/pci -I../drivers/bus/pci/linux -Ilib/librte_pci -I../lib/librte_pci -Idrivers/bus/vdev -I../drivers/bus/vdev -Xclang -fcolor-diagnostics -pipe -D_FILE_OFFSET_BITS=64 -Wall -Winvalid-pch -Werror -O3 -include rte_config.h -Wextra -Wcast-qual -Wdeprecated -Wformat-nonliteral -Wformat-security -Wmissing-declarations -Wmissing-prototypes -Wnested-externs -Wold-style-definition -Wpointer-arith -Wsign-compare -Wstrict-prototypes -Wundef -Wwrite-strings -Wno-address-of-packed-member -Wno-missing-field-initializers -D_GNU_SOURCE -fPIC -march=native -DALLOW_EXPERIMENTAL_API -DALLOW_INTERNAL_API -MD -MQ drivers/libtmp_rte_pmd_bnxt.a.p/net_bnxt_tf_core_tf_em_common.c.o -MF drivers/libtmp_rte_pmd_bnxt.a.p/net_bnxt_tf_core_tf_em_common.c.o.d -o drivers/libtmp_rte_pmd_bnxt.a.p/net_bnxt_tf_core_tf_em_common.c.o -c ../drivers/net/bnxt/tf_core/tf_em_common.c
../drivers/net/bnxt/tf_core/tf_em_common.c:1119:20: error: implicit conversion from enumeration type 'enum tf_global_config_internal_type' to different enumeration type 'enum tf_global_config_type' [-Werror,-Wenum-conversion]
        gcfg_parms.type = TF_GLOBAL_CFG_INTERNAL_PARIF_2_PF;
                        ~ ^~~~~~~~~~~~~~~~~~~~~~~~~~~~~~~~~
1 error generated.
[981/2683] Compiling C object drivers/libtmp_rte_pmd_bnxt.a.p/net_bnxt_tf_core_tf_session.c.o
[982/2683] Compiling C object drivers/libtmp_rte_pmd_bnxt.a.p/net_bnxt_tf_core_tf_identifier.c.o
[983/2683] Compiling C object drivers/libtmp_rte_pmd_bnxt.a.p/net_bnxt_tf_core_tf_device_p4.c.o
[984/2683] Compiling C object drivers/libtmp_rte_pmd_bnxt.a.p/net_bnxt_tf_core_tf_em_internal.c.o
[985/2683] Compiling C object drivers/libtmp_rte_pmd_bnxt.a.p/net_bnxt_tf_core_tfp.c.o
[986/2683] Compiling C object drivers/libtmp_rte_pmd_bnxt.a.p/net_bnxt_tf_core_tf_tcam.c.o
[987/2683] Compiling C object drivers/libtmp_rte_pmd_bnxt.a.p/net_bnxt_tf_core_tf_shadow_tbl.c.o
[988/2683] Compiling C object drivers/libtmp_rte_pmd_bnxt.a.p/net_bnxt_bnxt_hwrm.c.o
[989/2683] Compiling C object drivers/libtmp_rte_pmd_bnx2x.a.p/net_bnx2x_bnx2x.c.o
ninja: build stopped: subcommand failed




*Build Failed #4:
OS: FreeBSD1201-64
Target: x86_64-native-bsdapp-clang
FAILED: drivers/libtmp_rte_pmd_bnxt.a.p/net_bnxt_tf_core_tf_em_common.c.o 
clang -Idrivers/libtmp_rte_pmd_bnxt.a.p -Idrivers -I../drivers -Idrivers/net/bnxt -I../drivers/net/bnxt -I../drivers/net/bnxt/tf_ulp -I../drivers/net/bnxt/tf_core -Ilib/librte_ethdev -I../lib/librte_ethdev -I. -I.. -Iconfig -I../config -Ilib/librte_eal/include -I../lib/librte_eal/include -Ilib/librte_eal/freebsd/include -I../lib/librte_eal/freebsd/include -Ilib/librte_eal/x86/include -I../lib/librte_eal/x86/include -Ilib/librte_eal/common -I../lib/librte_eal/common -Ilib/librte_eal -I../lib/librte_eal -Ilib/librte_kvargs -I../lib/librte_kvargs -Ilib/librte_metrics -I../lib/librte_metrics -Ilib/librte_telemetry -I../lib/librte_telemetry -Ilib/librte_net -I../lib/librte_net -Ilib/librte_mbuf -I../lib/librte_mbuf -Ilib/librte_mempool -I../lib/librte_mempool -Ilib/librte_ring -I../lib/librte_ring -Ilib/librte_meter -I../lib/librte_meter -Idrivers/bus/pci -I../drivers/bus/pci -I../drivers/bus/pci/bsd -Ilib/librte_pci -I../lib/librte_pci -Idrivers/bus/vdev -I../drivers/bus/vdev -Xclang -fcolor-diagnostics -pipe -D_FILE_OFFSET_BITS=64 -Wall -Winvalid-pch -Werror -O3 -include rte_config.h -Wextra -Wcast-qual -Wdeprecated -Wformat-nonliteral -Wformat-security -Wmissing-declarations -Wmissing-prototypes -Wnested-externs -Wold-style-definition -Wpointer-arith -Wsign-compare -Wstrict-prototypes -Wundef -Wwrite-strings -Wno-address-of-packed-member -Wno-missing-field-initializers -D_GNU_SOURCE -D__BSD_VISIBLE -fPIC -march=native -mno-avx512f -DALLOW_EXPERIMENTAL_API -DALLOW_INTERNAL_API -MD -MQ drivers/libtmp_rte_pmd_bnxt.a.p/net_bnxt_tf_core_tf_em_common.c.o -MF drivers/libtmp_rte_pmd_bnxt.a.p/net_bnxt_tf_core_tf_em_common.c.o.d -o drivers/libtmp_rte_pmd_bnxt.a.p/net_bnxt_tf_core_tf_em_common.c.o -c ../drivers/net/bnxt/tf_core/tf_em_common.c
../drivers/net/bnxt/tf_core/tf_em_common.c:1119:20: error: implicit conversion from enumeration type 'enum tf_global_config_internal_type' to different enumeration type 'enum tf_global_config_type' [-Werror,-Wenum-conversion]
        gcfg_parms.type = TF_GLOBAL_CFG_INTERNAL_PARIF_2_PF;
                        ~ ^~~~~~~~~~~~~~~~~~~~~~~~~~~~~~~~~
1 error generated.
[800/1983] Compiling C object drivers/libtmp_rte_pmd_bnxt.a.p/net_bnxt_tf_core_tf_device.c.o
[801/1983] Compiling C object drivers/libtmp_rte_pmd_bnxt.a.p/net_bnxt_tf_core_tf_em_internal.c.o
[802/1983] Compiling C object drivers/libtmp_rte_pmd_bnxt.a.p/net_bnxt_tf_core_tf_device_p4.c.o
[803/1983] Compiling C object drivers/libtmp_rte_pmd_bnxt.a.p/net_bnxt_tf_core_tf_identifier.c.o
[804/1983] Compiling C object drivers/libtmp_rte_pmd_bnxt.a.p/net_bnxt_tf_core_tfp.c.o
ninja: build stopped: subcommand failed




*Build Failed #5:
OS: SUSE15-64
Target: x86_64-native-linuxapp-clang
FAILED: drivers/libtmp_rte_pmd_bnxt.a.p/net_bnxt_tf_core_tf_em_common.c.o 
clang -Idrivers/libtmp_rte_pmd_bnxt.a.p -Idrivers -I../drivers -Idrivers/net/bnxt -I../drivers/net/bnxt -I../drivers/net/bnxt/tf_ulp -I../drivers/net/bnxt/tf_core -Ilib/librte_ethdev -I../lib/librte_ethdev -I. -I.. -Iconfig -I../config -Ilib/librte_eal/include -I../lib/librte_eal/include -Ilib/librte_eal/linux/include -I../lib/librte_eal/linux/include -Ilib/librte_eal/x86/include -I../lib/librte_eal/x86/include -Ilib/librte_eal/common -I../lib/librte_eal/common -Ilib/librte_eal -I../lib/librte_eal -Ilib/librte_kvargs -I../lib/librte_kvargs -Ilib/librte_metrics -I../lib/librte_metrics -Ilib/librte_telemetry -I../lib/librte_telemetry -Ilib/librte_net -I../lib/librte_net -Ilib/librte_mbuf -I../lib/librte_mbuf -Ilib/librte_mempool -I../lib/librte_mempool -Ilib/librte_ring -I../lib/librte_ring -Ilib/librte_meter -I../lib/librte_meter -Idrivers/bus/pci -I../drivers/bus/pci -I../drivers/bus/pci/linux -Ilib/librte_pci -I../lib/librte_pci -Idrivers/bus/vdev -I../drivers/bus/vdev -Xclang -fcolor-diagnostics -pipe -D_FILE_OFFSET_BITS=64 -Wall -Winvalid-pch -Werror -O3 -include rte_config.h -Wextra -Wcast-qual -Wdeprecated -Wformat-nonliteral -Wformat-security -Wmissing-declarations -Wmissing-prototypes -Wnested-externs -Wold-style-definition -Wpointer-arith -Wsign-compare -Wstrict-prototypes -Wundef -Wwrite-strings -Wno-address-of-packed-member -Wno-missing-field-initializers -D_GNU_SOURCE -fPIC -march=native -DALLOW_EXPERIMENTAL_API -DALLOW_INTERNAL_API -MD -MQ drivers/libtmp_rte_pmd_bnxt.a.p/net_bnxt_tf_core_tf_em_common.c.o -MF drivers/libtmp_rte_pmd_bnxt.a.p/net_bnxt_tf_core_tf_em_common.c.o.d -o drivers/libtmp_rte_pmd_bnxt.a.p/net_bnxt_tf_core_tf_em_common.c.o -c ../drivers/net/bnxt/tf_core/tf_em_common.c
../drivers/net/bnxt/tf_core/tf_em_common.c:1119:20: error: implicit conversion from enumeration type 'enum tf_global_config_internal_type' to different enumeration type 'enum tf_global_config_type' [-Werror,-Wenum-conversion]
        gcfg_parms.type = TF_GLOBAL_CFG_INTERNAL_PARIF_2_PF;
                        ~ ^~~~~~~~~~~~~~~~~~~~~~~~~~~~~~~~~
1 error generated.
[973/2649] Compiling C object drivers/libtmp_rte_pmd_bnxt.a.p/net_bnxt_bnxt_txr.c.o
[974/2649] Compiling C object drivers/libtmp_rte_pmd_bnxt.a.p/net_bnxt_tf_core_tf_em_internal.c.o
[975/2649] Compiling C object drivers/libtmp_rte_pmd_bnxt.a.p/net_bnxt_bnxt_hwrm.c.o
[976/2649] Compiling C object drivers/libtmp_rte_pmd_bnxt.a.p/net_bnxt_tf_core_tf_session.c.o
[977/2649] Compiling C object drivers/libtmp_rte_pmd_bnxt.a.p/net_bnxt_tf_core_tf_device.c.o
[978/2649] Compiling C object drivers/libtmp_rte_pmd_bnxt.a.p/net_bnxt_tf_core_tf_tcam.c.o
[979/2649] Compiling C object drivers/libtmp_rte_pmd_bnxt.a.p/net_bnxt_tf_core_tfp.c.o
[980/2649] Compiling C object drivers/libtmp_rte_pmd_bnx2x.a.p/net_bnx2x_elink.c.o
[981/2649] Compiling C object drivers/libtmp_rte_pmd_bnx2x.a.p/net_bnx2x_bnx2x.c.o
ninja: build stopped: subcommand failed




*Build Failed #6:
OS: UB2004-64
Target: x86_64-native-linuxapp-clang
FAILED: drivers/libtmp_rte_pmd_bnxt.a.p/net_bnxt_tf_core_tf_em_common.c.o 
clang -Idrivers/libtmp_rte_pmd_bnxt.a.p -Idrivers -I../drivers -Idrivers/net/bnxt -I../drivers/net/bnxt -I../drivers/net/bnxt/tf_ulp -I../drivers/net/bnxt/tf_core -Ilib/librte_ethdev -I../lib/librte_ethdev -I. -I.. -Iconfig -I../config -Ilib/librte_eal/include -I../lib/librte_eal/include -Ilib/librte_eal/linux/include -I../lib/librte_eal/linux/include -Ilib/librte_eal/x86/include -I../lib/librte_eal/x86/include -Ilib/librte_eal/common -I../lib/librte_eal/common -Ilib/librte_eal -I../lib/librte_eal -Ilib/librte_kvargs -I../lib/librte_kvargs -Ilib/librte_metrics -I../lib/librte_metrics -Ilib/librte_telemetry -I../lib/librte_telemetry -Ilib/librte_net -I../lib/librte_net -Ilib/librte_mbuf -I../lib/librte_mbuf -Ilib/librte_mempool -I../lib/librte_mempool -Ilib/librte_ring -I../lib/librte_ring -Ilib/librte_meter -I../lib/librte_meter -Idrivers/bus/pci -I../drivers/bus/pci -I../drivers/bus/pci/linux -Ilib/librte_pci -I../lib/librte_pci -Idrivers/bus/vdev -I../drivers/bus/vdev -Xclang -fcolor-diagnostics -pipe -D_FILE_OFFSET_BITS=64 -Wall -Winvalid-pch -Werror -O3 -include rte_config.h -Wextra -Wcast-qual -Wdeprecated -Wformat-nonliteral -Wformat-security -Wmissing-declarations -Wmissing-prototypes -Wnested-externs -Wold-style-definition -Wpointer-arith -Wsign-compare -Wstrict-prototypes -Wundef -Wwrite-strings -Wno-address-of-packed-member -Wno-missing-field-initializers -D_GNU_SOURCE -fPIC -march=native -DALLOW_EXPERIMENTAL_API -DALLOW_INTERNAL_API -MD -MQ drivers/libtmp_rte_pmd_bnxt.a.p/net_bnxt_tf_core_tf_em_common.c.o -MF drivers/libtmp_rte_pmd_bnxt.a.p/net_bnxt_tf_core_tf_em_common.c.o.d -o drivers/libtmp_rte_pmd_bnxt.a.p/net_bnxt_tf_core_tf_em_common.c.o -c ../drivers/net/bnxt/tf_core/tf_em_common.c
../drivers/net/bnxt/tf_core/tf_em_common.c:1119:20: error: implicit conversion from enumeration type 'enum tf_global_config_internal_type' to different enumeration type 'enum tf_global_config_type' [-Werror,-Wenum-conversion]
        gcfg_parms.type = TF_GLOBAL_CFG_INTERNAL_PARIF_2_PF;
                        ~ ^~~~~~~~~~~~~~~~~~~~~~~~~~~~~~~~~
1 error generated.
[983/2672] Compiling C object drivers/libtmp_rte_pmd_bnxt.a.p/net_bnxt_tf_core_tf_identifier.c.o
[984/2672] Compiling C object drivers/libtmp_rte_pmd_bnx2x.a.p/net_bnx2x_elink.c.o
[985/2672] Compiling C object drivers/libtmp_rte_pmd_bnxt.a.p/net_bnxt_tf_core_tf_shadow_tbl.c.o
[986/2672] Compiling C object drivers/libtmp_rte_pmd_bnxt.a.p/net_bnxt_tf_core_tfp.c.o
[987/2672] Compiling C object drivers/libtmp_rte_pmd_bnxt.a.p/net_bnxt_bnxt_hwrm.c.o
[988/2672] Compiling C object drivers/libtmp_rte_pmd_crypto_scheduler.a.p/crypto_scheduler_rte_cryptodev_scheduler.c.o
[989/2672] Compiling C object drivers/libtmp_rte_pmd_crypto_scheduler.a.p/crypto_scheduler_scheduler_failover.c.o
[990/2672] Compiling C object drivers/libtmp_rte_pmd_bnx2x.a.p/net_bnx2x_bnx2x.c.o
[991/2672] Compiling C object drivers/libtmp_rte_pmd_crypto_scheduler.a.p/crypto_scheduler_scheduler_multicore.c.o
ninja: build stopped: subcommand failed




*Build Failed #7:
OS: UB2004-64
Target: x86_64-native-linuxapp-gcc
FAILED: drivers/libtmp_rte_pmd_bnxt.a.p/net_bnxt_tf_core_tf_em_common.c.o 
gcc -Idrivers/libtmp_rte_pmd_bnxt.a.p -Idrivers -I../drivers -Idrivers/net/bnxt -I../drivers/net/bnxt -I../drivers/net/bnxt/tf_ulp -I../drivers/net/bnxt/tf_core -Ilib/librte_ethdev -I../lib/librte_ethdev -I. -I.. -Iconfig -I../config -Ilib/librte_eal/include -I../lib/librte_eal/include -Ilib/librte_eal/linux/include -I../lib/librte_eal/linux/include -Ilib/librte_eal/x86/include -I../lib/librte_eal/x86/include -Ilib/librte_eal/common -I../lib/librte_eal/common -Ilib/librte_eal -I../lib/librte_eal -Ilib/librte_kvargs -I../lib/librte_kvargs -Ilib/librte_metrics -I../lib/librte_metrics -Ilib/librte_telemetry -I../lib/librte_telemetry -Ilib/librte_net -I../lib/librte_net -Ilib/librte_mbuf -I../lib/librte_mbuf -Ilib/librte_mempool -I../lib/librte_mempool -Ilib/librte_ring -I../lib/librte_ring -Ilib/librte_meter -I../lib/librte_meter -Idrivers/bus/pci -I../drivers/bus/pci -I../drivers/bus/pci/linux -Ilib/librte_pci -I../lib/librte_pci -Idrivers/bus/vdev -I../drivers/bus/vdev -fdiagnostics-color=always -pipe -D_FILE_OFFSET_BITS=64 -Wall -Winvalid-pch -Werror -O3 -include rte_config.h -Wextra -Wcast-qual -Wdeprecated -Wformat-nonliteral -Wformat-security -Wmissing-declarations -Wmissing-prototypes -Wnested-externs -Wold-style-definition -Wpointer-arith -Wsign-compare -Wstrict-prototypes -Wundef -Wwrite-strings -Wno-address-of-packed-member -Wno-packed-not-aligned -Wno-missing-field-initializers -Wno-zero-length-bounds -D_GNU_SOURCE -fPIC -march=native -DALLOW_EXPERIMENTAL_API -DALLOW_INTERNAL_API -Wno-format-truncation -MD -MQ drivers/libtmp_rte_pmd_bnxt.a.p/net_bnxt_tf_core_tf_em_common.c.o -MF drivers/libtmp_rte_pmd_bnxt.a.p/net_bnxt_tf_core_tf_em_common.c.o.d -o drivers/libtmp_rte_pmd_bnxt.a.p/net_bnxt_tf_core_tf_em_common.c.o -c ../drivers/net/bnxt/tf_core/tf_em_common.c
../drivers/net/bnxt/tf_core/tf_em_common.c: In function ‘tf_em_ext_map_tbl_scope’:
../drivers/net/bnxt/tf_core/tf_em_common.c:1119:18: error: implicit conversion from ‘enum tf_global_config_internal_type’ to ‘enum tf_global_config_type’ [-Werror=enum-conversion]
 1119 |  gcfg_parms.type = TF_GLOBAL_CFG_INTERNAL_PARIF_2_PF;
      |                  ^
cc1: all warnings being treated as errors
[976/2672] Compiling C object drivers/libtmp_rte_pmd_bnxt.a.p/net_bnxt_tf_core_tfp.c.o
[977/2672] Compiling C object drivers/libtmp_rte_pmd_bnxt.a.p/net_bnxt_tf_core_tf_tcam.c.o
[978/2672] Compiling C object drivers/libtmp_rte_pmd_bnxt.a.p/net_bnxt_tf_core_tf_device_p4.c.o
[979/2672] Compiling C object drivers/libtmp_rte_pmd_bnxt.a.p/net_bnxt_tf_core_tf_identifier.c.o
[980/2672] Compiling C object drivers/libtmp_rte_pmd_bnxt.a.p/net_bnxt_tf_core_tf_shadow_tbl.c.o
[981/2672] Compiling C object drivers/libtmp_rte_pmd_bnx2x.a.p/net_bnx2x_bnx2x.c.o
[982/2672] Compiling C object drivers/libtmp_rte_pmd_bnxt.a.p/net_bnxt_bnxt_hwrm.c.o
[983/2672] Compiling C object drivers/libtmp_rte_pmd_bnx2x.a.p/net_bnx2x_elink.c.o
[984/2672] Compiling C object lib/librte_pipeline.a.p/librte_pipeline_rte_table_action.c.o
ninja: build stopped: subcommand failed


DPDK STV team

^ permalink raw reply	[flat|nested] only message in thread

only message in thread, back to index

Thread overview: (only message) (download: mbox.gz / follow: Atom feed)
-- links below jump to the message on this page --
2020-10-17 14:33 [dpdk-test-report] |FAILURE| pw(81195) [14/14] net/bnxt: add VXLAN decap offload support sys_stv

automatic DPDK test reports

Archives are clonable:
	git clone --mirror http://inbox.dpdk.org/test-report/0 test-report/git/0.git

	# If you have public-inbox 1.1+ installed, you may
	# initialize and index your mirror using the following commands:
	public-inbox-init -V2 test-report test-report/ http://inbox.dpdk.org/test-report \
		test-report@dpdk.org
	public-inbox-index test-report


Newsgroup available over NNTP:
	nntp://inbox.dpdk.org/inbox.dpdk.test-report


AGPL code for this site: git clone https://public-inbox.org/ public-inbox