automatic DPDK test reports
 help / color / mirror / Atom feed
From: sys_stv@intel.com
To: test-report@dpdk.org, thomas@monjalon.net
Cc: dpdk_sw_eng@intel.com, npg.sw.core.tools.prc@intel.com
Subject: [dpdk-test-report]  |FAILURE| dpdk daily Intel builds
Date: 19 Oct 2020 22:41:41 -0700
Message-ID: <569c58$fs75sd@orsmga005-auth.jf.intel.com> (raw)

[-- Attachment #1: Type: text/plain, Size: 60400 bytes --]


Test-Label: Intel-compilation
Test-Status: FAILURE
_Compilation issues_


commit 1dd6cffb6571f816d5a0d1fd620f43532240b40b
Author: Stephen Hemminger <stephen@networkplumber.org>
Date:   Wed Sep 23 22:34:33 2020 -0700

    app/procinfo: provide way to request info on owned ports

DPDK git Repo: dpdk 


Meson Build Summary: 23 Builds Done, 5 Successful, 18 Failures, 0 Blocked

+----------------+------------+--------------+------------+------------+-----------+----------+
| os             | gcc-static | clang-static | icc-static | gcc-shared | gcc-debug | document |
+----------------+------------+--------------+------------+------------+-----------+----------+
| CENTOS82-64    | FAIL       | FAIL         | FAIL       | FAIL       | FAIL      |          |
| RHEL82-64      | FAIL       |              |            |            |           |          |
| UB1804-64      | FAIL       |              |            |            |           |          |
| FC32-64        | FAIL       | FAIL         |            |            |           |          |
| UB2004-64      | FAIL       | FAIL         | FAIL       |            |           | FAIL     |
| WIN10-64       |            | pass         |            |            |           |          |
| UB2004-32      | FAIL       |              |            |            |           |          |
| FreeBSD1201-64 | pass       | pass         |            | pass       | pass      |          |
| SUSE15-64      | FAIL       | FAIL         |            |            |           |          |
| UB2004-64N     | FAIL       |              |            | FAIL       |           |          |
+----------------+------------+--------------+------------+------------+-----------+----------+
Test environment and configuration as below:


OS: CENTOS82-64
	Kernel Version: 4.18.0-193.14.2.el8_2.x86_64
	CPU info: Intel(R) Xeon(R) Platinum 8280M CPU @ 2.70GHz
	GCC Version: gcc (GCC) 8.3.1 20191121 (Red Hat 8.3.1-5)
	Clang Version: 9.0.1 (Red Hat 9.0.1-2.module_el8.2.0+309+0c7b6b03)
	x86_64-native-linuxapp-gcc
	x86_64-native-linuxapp-clang
	x86_64-native-linuxapp-icc
	x86_64-native-linuxapp-gcc+shared
	x86_64-native-linuxapp-gcc+debug

OS: RHEL82-64
	Kernel Version: 4.18.0-193.el8.x86_64
	CPU info: Intel(R) Xeon(R) Platinum 8280M CPU @ 2.70GHz
	GCC Version: gcc (GCC) 8.3.1 20191121 (Red Hat 8.3.1-5)
	Clang Version: 8.0.1 (Red Hat 8.0.1-1.module_el8.1.0+215+a01033fb)
	x86_64-native-linuxapp-gcc

OS: UB1804-64
	Kernel Version: 5.3.0-59-generic
	CPU info: Intel(R) Xeon(R) Platinum 8180 CPU @ 2.50GHz
	GCC Version: gcc (Ubuntu 8.4.0-1ubuntu1~18.04) 8.4.0
	Clang Version: 6.0.0-1ubuntu2 (tags/RELEASE_600/final)
	x86_64-native-linuxapp-gcc

OS: FC32-64
	Kernel Version: 5.6.0-0.rc7.git0.2.fc32.x86_64
	CPU info: Intel(R) Xeon(R) Platinum 8280M CPU @ 2.70GHz
	GCC Version: gcc (GCC) 10.0.1 20200311 (Red Hat 10.0.1-0.9)
	Clang Version: 10.0.0 (Fedora 10.0.0-0.3.rc4.fc32)
	x86_64-native-linuxapp-gcc
	x86_64-native-linuxapp-clang

OS: UB2004-64
	Kernel Version: 5.4.0-47-generic
	CPU info: Intel(R) Xeon(R) Platinum 8180 CPU @ 2.50GHz
	GCC Version: gcc (Ubuntu 10-20200416-0ubuntu1) 10.0.1 20200416 (experimental) [master revision 3c3f12e2a76:dcee354ce56:44b326839d864fc10c459916abcc97f35a9ac3de]
	Clang Version: 10.0.0-4ubuntu1
	x86_64-native-linuxapp-clang
	x86_64-native-linuxapp-gcc
	x86_64-native-linuxapp-icc
	x86_64-native-linuxapp-doc

OS: WIN10-64
	Kernel Version: N/A
	CPU info: N/A
	GCC Version: N/A
	Clang Version: Clang 8.0.0
	x86_64-windows-clang

OS: UB2004-32
	Kernel Version: 5.4.0-47-generic
	CPU info: Intel(R) Xeon(R) Platinum 8180 CPU @ 2.50GHz
	GCC Version: gcc (Ubuntu 9.3.0-10ubuntu2) 9.3.0
	Clang Version: 10.0.0-4ubuntu1
	i686-native-linuxapp-gcc

OS: FreeBSD1201-64
	Kernel Version: 12.1-RELEASE
	CPU info: Intel(R) Xeon(R) CPU E5-2699 v3 @ 2.30GHz (2294.74-MHz K8-class CPU)
	GCC Version: gcc (FreeBSD Ports Collection) 9.2.0
	Clang Version: 8.0.1 (tags/RELEASE_801/final 366581) (based on LLVM 8.0.1)
	x86_64-native-bsdapp-gcc
	x86_64-native-bsdapp-clang
	x86_64-native-bsdapp-gcc+shared
	x86_64-native-bsdapp-gcc+debug

OS: SUSE15-64
	Kernel Version: 4.12.14-lp150.11-default
	CPU info: Intel(R) Xeon(R) CPU E5-2699 v4 @ 2.20GHz
	GCC Version: gcc (SUSE Linux) 7.3.1 20180323 [gcc-7-branch revision 258812]
	Clang Version: 5.0.1 (tags/RELEASE_501/final 312548)
	x86_64-native-linuxapp-clang
	x86_64-native-linuxapp-gcc

OS: UB2004-64N
	Kernel Version: 5.8.0-050800-generic
	CPU info: Intel(R) Xeon(R) Platinum 8180 CPU @ 2.50GHz
	GCC Version: gcc (Ubuntu 9.3.0-10ubuntu2) 9.3.0
	Clang Version: 10.0.0-4ubuntu1
	x86_64-native-linuxapp-gcc
	x86_64-native-linuxapp-gcc+shared



*Build Failed #1:
OS: CENTOS82-64
Target: x86_64-native-linuxapp-gcc
FAILED: kernel/linux/kni/rte_kni.ko 
make -j4 -C /lib/modules/4.18.0-193.14.2.el8_2.x86_64/build M=/root/CENTOS82-64_K4.18.0_GCC8.3.1/x86_64-native-linuxapp-gcc/ff7f84dab74e48bea55919d8b9988c1d/dpdk/x86_64-native-linuxapp-gcc/kernel/linux/kni src=/root/CENTOS82-64_K4.18.0_GCC8.3.1/x86_64-native-linuxapp-gcc/ff7f84dab74e48bea55919d8b9988c1d/dpdk/kernel/linux/kni 'MODULE_CFLAGS=-include /root/CENTOS82-64_K4.18.0_GCC8.3.1/x86_64-native-linuxapp-gcc/ff7f84dab74e48bea55919d8b9988c1d/dpdk/config/rte_config.h -I/root/CENTOS82-64_K4.18.0_GCC8.3.1/x86_64-native-linuxapp-gcc/ff7f84dab74e48bea55919d8b9988c1d/dpdk/lib/librte_eal/include -I/root/CENTOS82-64_K4.18.0_GCC8.3.1/x86_64-native-linuxapp-gcc/ff7f84dab74e48bea55919d8b9988c1d/dpdk/lib/librte_eal/linux/include -I/root/CENTOS82-64_K4.18.0_GCC8.3.1/x86_64-native-linuxapp-gcc/ff7f84dab74e48bea55919d8b9988c1d/dpdk/x86_64-native-linuxapp-gcc -I/root/CENTOS82-64_K4.18.0_GCC8.3.1/x86_64-native-linuxapp-gcc/ff7f84dab74e48bea55919d8b9988c1d/dpdk/kernel/linux/kni' modules
make: Entering directory '/usr/src/kernels/4.18.0-193.14.2.el8_2.x86_64'
  CC [M]  /root/CENTOS82-64_K4.18.0_GCC8.3.1/x86_64-native-linuxapp-gcc/ff7f84dab74e48bea55919d8b9988c1d/dpdk/x86_64-native-linuxapp-gcc/kernel/linux/kni/kni_net.o
In file included from <command-line>:
/root/CENTOS82-64_K4.18.0_GCC8.3.1/x86_64-native-linuxapp-gcc/ff7f84dab74e48bea55919d8b9988c1d/dpdk/config/rte_config.h:16:10: fatal error: rte_compatibility_defines.h: No such file or directory
 #include <rte_compatibility_defines.h>
          ^~~~~~~~~~~~~~~~~~~~~~~~~~~~~
compilation terminated.
  CC [M]  /root/CENTOS82-64_K4.18.0_GCC8.3.1/x86_64-native-linuxapp-gcc/ff7f84dab74e48bea55919d8b9988c1d/dpdk/x86_64-native-linuxapp-gcc/kernel/linux/kni/kni_misc.o
make[1]: *** [scripts/Makefile.build:313: /root/CENTOS82-64_K4.18.0_GCC8.3.1/x86_64-native-linuxapp-gcc/ff7f84dab74e48bea55919d8b9988c1d/dpdk/x86_64-native-linuxapp-gcc/kernel/linux/kni/kni_net.o] Error 1
make[1]: *** Waiting for unfinished jobs....
In file included from <command-line>:
/root/CENTOS82-64_K4.18.0_GCC8.3.1/x86_64-native-linuxapp-gcc/ff7f84dab74e48bea55919d8b9988c1d/dpdk/config/rte_config.h:16:10: fatal error: rte_compatibility_defines.h: No such file or directory
 #include <rte_compatibility_defines.h>
          ^~~~~~~~~~~~~~~~~~~~~~~~~~~~~
compilation terminated.
make[1]: *** [scripts/Makefile.build:313: /root/CENTOS82-64_K4.18.0_GCC8.3.1/x86_64-native-linuxapp-gcc/ff7f84dab74e48bea55919d8b9988c1d/dpdk/x86_64-native-linuxapp-gcc/kernel/linux/kni/kni_misc.o] Error 1
make: *** [Makefile:1545: _module_/root/CENTOS82-64_K4.18.0_GCC8.3.1/x86_64-native-linuxapp-gcc/ff7f84dab74e48bea55919d8b9988c1d/dpdk/x86_64-native-linuxapp-gcc/kernel/linux/kni] Error 2
make: Leaving directory '/usr/src/kernels/4.18.0-193.14.2.el8_2.x86_64'
ninja: build stopped: subcommand failed




*Build Failed #2:
OS: CENTOS82-64
Target: x86_64-native-linuxapp-clang
FAILED: kernel/linux/kni/rte_kni.ko 
make -j4 -C /lib/modules/4.18.0-193.14.2.el8_2.x86_64/build M=/root/CENTOS82-64_K4.18.0_Clang7.0.1/x86_64-native-linuxapp-clang/ff7f84dab74e48bea55919d8b9988c1d/dpdk/x86_64-native-linuxapp-clang/kernel/linux/kni src=/root/CENTOS82-64_K4.18.0_Clang7.0.1/x86_64-native-linuxapp-clang/ff7f84dab74e48bea55919d8b9988c1d/dpdk/kernel/linux/kni 'MODULE_CFLAGS=-include /root/CENTOS82-64_K4.18.0_Clang7.0.1/x86_64-native-linuxapp-clang/ff7f84dab74e48bea55919d8b9988c1d/dpdk/config/rte_config.h -I/root/CENTOS82-64_K4.18.0_Clang7.0.1/x86_64-native-linuxapp-clang/ff7f84dab74e48bea55919d8b9988c1d/dpdk/lib/librte_eal/include -I/root/CENTOS82-64_K4.18.0_Clang7.0.1/x86_64-native-linuxapp-clang/ff7f84dab74e48bea55919d8b9988c1d/dpdk/lib/librte_eal/linux/include -I/root/CENTOS82-64_K4.18.0_Clang7.0.1/x86_64-native-linuxapp-clang/ff7f84dab74e48bea55919d8b9988c1d/dpdk/x86_64-native-linuxapp-clang -I/root/CENTOS82-64_K4.18.0_Clang7.0.1/x86_64-native-linuxapp-clang/ff7f84dab74e48bea55919d8b9988c1d/dpdk/kernel/linux/kni' modules
make: Entering directory '/usr/src/kernels/4.18.0-193.14.2.el8_2.x86_64'
  CC [M]  /root/CENTOS82-64_K4.18.0_Clang7.0.1/x86_64-native-linuxapp-clang/ff7f84dab74e48bea55919d8b9988c1d/dpdk/x86_64-native-linuxapp-clang/kernel/linux/kni/kni_net.o
In file included from <command-line>:
/root/CENTOS82-64_K4.18.0_Clang7.0.1/x86_64-native-linuxapp-clang/ff7f84dab74e48bea55919d8b9988c1d/dpdk/config/rte_config.h:16:10: fatal error: rte_compatibility_defines.h: No such file or directory
 #include <rte_compatibility_defines.h>
          ^~~~~~~~~~~~~~~~~~~~~~~~~~~~~
compilation terminated.
make[1]: *** [scripts/Makefile.build:313: /root/CENTOS82-64_K4.18.0_Clang7.0.1/x86_64-native-linuxapp-clang/ff7f84dab74e48bea55919d8b9988c1d/dpdk/x86_64-native-linuxapp-clang/kernel/linux/kni/kni_net.o] Error 1
make[1]: *** Waiting for unfinished jobs....
  CC [M]  /root/CENTOS82-64_K4.18.0_Clang7.0.1/x86_64-native-linuxapp-clang/ff7f84dab74e48bea55919d8b9988c1d/dpdk/x86_64-native-linuxapp-clang/kernel/linux/kni/kni_misc.o
In file included from <command-line>:
/root/CENTOS82-64_K4.18.0_Clang7.0.1/x86_64-native-linuxapp-clang/ff7f84dab74e48bea55919d8b9988c1d/dpdk/config/rte_config.h:16:10: fatal error: rte_compatibility_defines.h: No such file or directory
 #include <rte_compatibility_defines.h>
          ^~~~~~~~~~~~~~~~~~~~~~~~~~~~~
compilation terminated.
make[1]: *** [scripts/Makefile.build:313: /root/CENTOS82-64_K4.18.0_Clang7.0.1/x86_64-native-linuxapp-clang/ff7f84dab74e48bea55919d8b9988c1d/dpdk/x86_64-native-linuxapp-clang/kernel/linux/kni/kni_misc.o] Error 1
make: *** [Makefile:1545: _module_/root/CENTOS82-64_K4.18.0_Clang7.0.1/x86_64-native-linuxapp-clang/ff7f84dab74e48bea55919d8b9988c1d/dpdk/x86_64-native-linuxapp-clang/kernel/linux/kni] Error 2
make: Leaving directory '/usr/src/kernels/4.18.0-193.14.2.el8_2.x86_64'
[2599/2677] Compiling C object drivers/libtmp_rte_event_octeontx2.a.p/event_octeontx2_otx2_worker.c.o
[2600/2677] Compiling C object drivers/libtmp_rte_event_octeontx2.a.p/event_octeontx2_otx2_worker_dual.c.o
[2601/2677] Compiling C object app/test/dpdk-test.p/test_ring.c.o
[2602/2677] Compiling C object app/test/dpdk-test.p/test_ring_perf.c.o
ninja: build stopped: subcommand failed




*Build Failed #3:
OS: CENTOS82-64
Target: x86_64-native-linuxapp-icc
FAILED: kernel/linux/kni/rte_kni.ko 
make -j4 -C /lib/modules/4.18.0-193.14.2.el8_2.x86_64/build M=/root/CENTOS82-64_K4.18.0_ICC19.1.1/x86_64-native-linuxapp-icc/ff7f84dab74e48bea55919d8b9988c1d/dpdk/26/kernel/linux/kni src=/root/CENTOS82-64_K4.18.0_ICC19.1.1/x86_64-native-linuxapp-icc/ff7f84dab74e48bea55919d8b9988c1d/dpdk/kernel/linux/kni 'MODULE_CFLAGS=-include /root/CENTOS82-64_K4.18.0_ICC19.1.1/x86_64-native-linuxapp-icc/ff7f84dab74e48bea55919d8b9988c1d/dpdk/config/rte_config.h -I/root/CENTOS82-64_K4.18.0_ICC19.1.1/x86_64-native-linuxapp-icc/ff7f84dab74e48bea55919d8b9988c1d/dpdk/lib/librte_eal/include -I/root/CENTOS82-64_K4.18.0_ICC19.1.1/x86_64-native-linuxapp-icc/ff7f84dab74e48bea55919d8b9988c1d/dpdk/lib/librte_eal/linux/include -I/root/CENTOS82-64_K4.18.0_ICC19.1.1/x86_64-native-linuxapp-icc/ff7f84dab74e48bea55919d8b9988c1d/dpdk/26 -I/root/CENTOS82-64_K4.18.0_ICC19.1.1/x86_64-native-linuxapp-icc/ff7f84dab74e48bea55919d8b9988c1d/dpdk/kernel/linux/kni' modules
make: Entering directory '/usr/src/kernels/4.18.0-193.14.2.el8_2.x86_64'
  CC [M]  /root/CENTOS82-64_K4.18.0_ICC19.1.1/x86_64-native-linuxapp-icc/ff7f84dab74e48bea55919d8b9988c1d/dpdk/26/kernel/linux/kni/kni_net.o
In file included from <command-line>:
/root/CENTOS82-64_K4.18.0_ICC19.1.1/x86_64-native-linuxapp-icc/ff7f84dab74e48bea55919d8b9988c1d/dpdk/config/rte_config.h:16:10: fatal error: rte_compatibility_defines.h: No such file or directory
 #include <rte_compatibility_defines.h>
          ^~~~~~~~~~~~~~~~~~~~~~~~~~~~~
compilation terminated.
make[1]: *** [scripts/Makefile.build:313: /root/CENTOS82-64_K4.18.0_ICC19.1.1/x86_64-native-linuxapp-icc/ff7f84dab74e48bea55919d8b9988c1d/dpdk/26/kernel/linux/kni/kni_net.o] Error 1
make: *** [Makefile:1545: _module_/root/CENTOS82-64_K4.18.0_ICC19.1.1/x86_64-native-linuxapp-icc/ff7f84dab74e48bea55919d8b9988c1d/dpdk/26/kernel/linux/kni] Error 2
make: Leaving directory '/usr/src/kernels/4.18.0-193.14.2.el8_2.x86_64'
[2599/2677] Compiling C object app/test/dpdk-test.p/test_ring_perf.c.o
[2600/2677] Compiling C object drivers/libtmp_rte_event_octeontx2.a.p/event_octeontx2_otx2_worker.c.o
[2601/2677] Compiling C object drivers/libtmp_rte_event_octeontx2.a.p/event_octeontx2_otx2_worker_dual.c.o
[2602/2677] Compiling C object app/test/dpdk-test.p/test_memcpy_perf.c.o
ninja: build stopped: subcommand failed




*Build Failed #4:
OS: CENTOS82-64
Target: x86_64-native-linuxapp-gcc+shared
FAILED: kernel/linux/kni/rte_kni.ko 
make -j4 -C /lib/modules/4.18.0-193.el8.x86_64/build M=/root/CENTOS82-64_K4.18.0_GCC8.3.1/x86_64-native-linuxapp-gcc+shared/ff7f84dab74e48bea55919d8b9988c1d/dpdk/x86_64-native-linuxapp-gcc+shared/kernel/linux/kni src=/root/CENTOS82-64_K4.18.0_GCC8.3.1/x86_64-native-linuxapp-gcc+shared/ff7f84dab74e48bea55919d8b9988c1d/dpdk/kernel/linux/kni 'MODULE_CFLAGS=-include /root/CENTOS82-64_K4.18.0_GCC8.3.1/x86_64-native-linuxapp-gcc+shared/ff7f84dab74e48bea55919d8b9988c1d/dpdk/config/rte_config.h -I/root/CENTOS82-64_K4.18.0_GCC8.3.1/x86_64-native-linuxapp-gcc+shared/ff7f84dab74e48bea55919d8b9988c1d/dpdk/lib/librte_eal/include -I/root/CENTOS82-64_K4.18.0_GCC8.3.1/x86_64-native-linuxapp-gcc+shared/ff7f84dab74e48bea55919d8b9988c1d/dpdk/lib/librte_eal/linux/include -I/root/CENTOS82-64_K4.18.0_GCC8.3.1/x86_64-native-linuxapp-gcc+shared/ff7f84dab74e48bea55919d8b9988c1d/dpdk/x86_64-native-linuxapp-gcc+shared -I/root/CENTOS82-64_K4.18.0_GCC8.3.1/x86_64-native-linuxapp-gcc+shared/ff7f84dab74e48bea55919d8b9988c1d/dpdk/kernel/linux/kni' modules
make: Entering directory '/usr/src/kernels/4.18.0-193.el8.x86_64'
  CC [M]  /root/CENTOS82-64_K4.18.0_GCC8.3.1/x86_64-native-linuxapp-gcc+shared/ff7f84dab74e48bea55919d8b9988c1d/dpdk/x86_64-native-linuxapp-gcc+shared/kernel/linux/kni/kni_net.o
In file included from <command-line>:
/root/CENTOS82-64_K4.18.0_GCC8.3.1/x86_64-native-linuxapp-gcc+shared/ff7f84dab74e48bea55919d8b9988c1d/dpdk/config/rte_config.h:16:10: fatal error: rte_compatibility_defines.h: No such file or directory
 #include <rte_compatibility_defines.h>
          ^~~~~~~~~~~~~~~~~~~~~~~~~~~~~
compilation terminated.
make[1]: *** [scripts/Makefile.build:313: /root/CENTOS82-64_K4.18.0_GCC8.3.1/x86_64-native-linuxapp-gcc+shared/ff7f84dab74e48bea55919d8b9988c1d/dpdk/x86_64-native-linuxapp-gcc+shared/kernel/linux/kni/kni_net.o] Error 1
make: *** [Makefile:1542: _module_/root/CENTOS82-64_K4.18.0_GCC8.3.1/x86_64-native-linuxapp-gcc+shared/ff7f84dab74e48bea55919d8b9988c1d/dpdk/x86_64-native-linuxapp-gcc+shared/kernel/linux/kni] Error 2
make: Leaving directory '/usr/src/kernels/4.18.0-193.el8.x86_64'
[2508/2508] Linking target app/test/dpdk-test
ninja: build stopped: subcommand failed




*Build Failed #5:
OS: CENTOS82-64
Target: x86_64-native-linuxapp-gcc+debug
FAILED: kernel/linux/kni/rte_kni.ko 
make -j4 -C /lib/modules/4.18.0-193.el8.x86_64/build M=/root/CENTOS82-64_K4.18.0_GCC8.3.1/x86_64-native-linuxapp-gcc+debug/ff7f84dab74e48bea55919d8b9988c1d/dpdk/x86_64-native-linuxapp-gcc+debug/kernel/linux/kni src=/root/CENTOS82-64_K4.18.0_GCC8.3.1/x86_64-native-linuxapp-gcc+debug/ff7f84dab74e48bea55919d8b9988c1d/dpdk/kernel/linux/kni 'MODULE_CFLAGS=-include /root/CENTOS82-64_K4.18.0_GCC8.3.1/x86_64-native-linuxapp-gcc+debug/ff7f84dab74e48bea55919d8b9988c1d/dpdk/config/rte_config.h -I/root/CENTOS82-64_K4.18.0_GCC8.3.1/x86_64-native-linuxapp-gcc+debug/ff7f84dab74e48bea55919d8b9988c1d/dpdk/lib/librte_eal/include -I/root/CENTOS82-64_K4.18.0_GCC8.3.1/x86_64-native-linuxapp-gcc+debug/ff7f84dab74e48bea55919d8b9988c1d/dpdk/lib/librte_eal/linux/include -I/root/CENTOS82-64_K4.18.0_GCC8.3.1/x86_64-native-linuxapp-gcc+debug/ff7f84dab74e48bea55919d8b9988c1d/dpdk/x86_64-native-linuxapp-gcc+debug -I/root/CENTOS82-64_K4.18.0_GCC8.3.1/x86_64-native-linuxapp-gcc+debug/ff7f84dab74e48bea55919d8b9988c1d/dpdk/kernel/linux/kni' modules
make: Entering directory '/usr/src/kernels/4.18.0-193.el8.x86_64'
  CC [M]  /root/CENTOS82-64_K4.18.0_GCC8.3.1/x86_64-native-linuxapp-gcc+debug/ff7f84dab74e48bea55919d8b9988c1d/dpdk/x86_64-native-linuxapp-gcc+debug/kernel/linux/kni/kni_net.o
  CC [M]  /root/CENTOS82-64_K4.18.0_GCC8.3.1/x86_64-native-linuxapp-gcc+debug/ff7f84dab74e48bea55919d8b9988c1d/dpdk/x86_64-native-linuxapp-gcc+debug/kernel/linux/kni/kni_misc.o
In file included from <command-line>:
/root/CENTOS82-64_K4.18.0_GCC8.3.1/x86_64-native-linuxapp-gcc+debug/ff7f84dab74e48bea55919d8b9988c1d/dpdk/config/rte_config.h:16:10: fatal error: rte_compatibility_defines.h: No such file or directory
 #include <rte_compatibility_defines.h>
          ^~~~~~~~~~~~~~~~~~~~~~~~~~~~~
compilation terminated.
make[1]: *** [scripts/Makefile.build:313: /root/CENTOS82-64_K4.18.0_GCC8.3.1/x86_64-native-linuxapp-gcc+debug/ff7f84dab74e48bea55919d8b9988c1d/dpdk/x86_64-native-linuxapp-gcc+debug/kernel/linux/kni/kni_net.o] Error 1
make[1]: *** Waiting for unfinished jobs....
In file included from <command-line>:
/root/CENTOS82-64_K4.18.0_GCC8.3.1/x86_64-native-linuxapp-gcc+debug/ff7f84dab74e48bea55919d8b9988c1d/dpdk/config/rte_config.h:16:10: fatal error: rte_compatibility_defines.h: No such file or directory
 #include <rte_compatibility_defines.h>
          ^~~~~~~~~~~~~~~~~~~~~~~~~~~~~
compilation terminated.
make[1]: *** [scripts/Makefile.build:313: /root/CENTOS82-64_K4.18.0_GCC8.3.1/x86_64-native-linuxapp-gcc+debug/ff7f84dab74e48bea55919d8b9988c1d/dpdk/x86_64-native-linuxapp-gcc+debug/kernel/linux/kni/kni_misc.o] Error 1
make: *** [Makefile:1542: _module_/root/CENTOS82-64_K4.18.0_GCC8.3.1/x86_64-native-linuxapp-gcc+debug/ff7f84dab74e48bea55919d8b9988c1d/dpdk/x86_64-native-linuxapp-gcc+debug/kernel/linux/kni] Error 2
make: Leaving directory '/usr/src/kernels/4.18.0-193.el8.x86_64'
[2671/2677] Linking target examples/dpdk-timer
[2672/2677] Linking target examples/dpdk-vmdq_dcb
[2673/2677] Linking target examples/dpdk-vhost
[2674/2677] Linking target examples/dpdk-vmdq
[2675/2677] Linking target examples/dpdk-vhost_blk
ninja: build stopped: subcommand failed




*Build Failed #6:
OS: FC32-64
Target: x86_64-native-linuxapp-gcc
FAILED: kernel/linux/kni/rte_kni.ko 
make -j4 -C /lib/modules/5.6.0-0.rc7.git0.2.fc32.x86_64/build M=/root/FC32-64_K5.6.0_GCC10.0.1/x86_64-native-linuxapp-gcc/ff7f84dab74e48bea55919d8b9988c1d/dpdk/x86_64-native-linuxapp-gcc/kernel/linux/kni src=/root/FC32-64_K5.6.0_GCC10.0.1/x86_64-native-linuxapp-gcc/ff7f84dab74e48bea55919d8b9988c1d/dpdk/kernel/linux/kni 'MODULE_CFLAGS=-include /root/FC32-64_K5.6.0_GCC10.0.1/x86_64-native-linuxapp-gcc/ff7f84dab74e48bea55919d8b9988c1d/dpdk/config/rte_config.h -I/root/FC32-64_K5.6.0_GCC10.0.1/x86_64-native-linuxapp-gcc/ff7f84dab74e48bea55919d8b9988c1d/dpdk/lib/librte_eal/include -I/root/FC32-64_K5.6.0_GCC10.0.1/x86_64-native-linuxapp-gcc/ff7f84dab74e48bea55919d8b9988c1d/dpdk/lib/librte_eal/linux/include -I/root/FC32-64_K5.6.0_GCC10.0.1/x86_64-native-linuxapp-gcc/ff7f84dab74e48bea55919d8b9988c1d/dpdk/x86_64-native-linuxapp-gcc -I/root/FC32-64_K5.6.0_GCC10.0.1/x86_64-native-linuxapp-gcc/ff7f84dab74e48bea55919d8b9988c1d/dpdk/kernel/linux/kni' modules
make: Entering directory '/usr/src/kernels/5.6.5-300.fc32.x86_64'
  CC [M]  /root/FC32-64_K5.6.0_GCC10.0.1/x86_64-native-linuxapp-gcc/ff7f84dab74e48bea55919d8b9988c1d/dpdk/x86_64-native-linuxapp-gcc/kernel/linux/kni/kni_net.o
  CC [M]  /root/FC32-64_K5.6.0_GCC10.0.1/x86_64-native-linuxapp-gcc/ff7f84dab74e48bea55919d8b9988c1d/dpdk/x86_64-native-linuxapp-gcc/kernel/linux/kni/kni_misc.o
In file included from <command-line>:
/root/FC32-64_K5.6.0_GCC10.0.1/x86_64-native-linuxapp-gcc/ff7f84dab74e48bea55919d8b9988c1d/dpdk/config/rte_config.h:16:10: fatal error: rte_compatibility_defines.h: No such file or directory
   16 | #include <rte_compatibility_defines.h>
      |          ^~~~~~~~~~~~~~~~~~~~~~~~~~~~~
compilation terminated.
make[1]: *** [scripts/Makefile.build:268: /root/FC32-64_K5.6.0_GCC10.0.1/x86_64-native-linuxapp-gcc/ff7f84dab74e48bea55919d8b9988c1d/dpdk/x86_64-native-linuxapp-gcc/kernel/linux/kni/kni_misc.o] Error 1
make[1]: *** Waiting for unfinished jobs....
In file included from <command-line>:
/root/FC32-64_K5.6.0_GCC10.0.1/x86_64-native-linuxapp-gcc/ff7f84dab74e48bea55919d8b9988c1d/dpdk/config/rte_config.h:16:10: fatal error: rte_compatibility_defines.h: No such file or directory
   16 | #include <rte_compatibility_defines.h>
      |          ^~~~~~~~~~~~~~~~~~~~~~~~~~~~~
compilation terminated.
make[1]: *** [scripts/Makefile.build:268: /root/FC32-64_K5.6.0_GCC10.0.1/x86_64-native-linuxapp-gcc/ff7f84dab74e48bea55919d8b9988c1d/dpdk/x86_64-native-linuxapp-gcc/kernel/linux/kni/kni_net.o] Error 1
make: *** [Makefile:1683: /root/FC32-64_K5.6.0_GCC10.0.1/x86_64-native-linuxapp-gcc/ff7f84dab74e48bea55919d8b9988c1d/dpdk/x86_64-native-linuxapp-gcc/kernel/linux/kni] Error 2
make: Leaving directory '/usr/src/kernels/5.6.5-300.fc32.x86_64'
[2604/2681] Compiling C object examples/dpdk-vmdq_dcb.p/vmdq_dcb_main.c.o
[2605/2681] Compiling C object drivers/libtmp_rte_event_octeontx2.a.p/event_octeontx2_otx2_worker.c.o
[2606/2681] Compiling C object drivers/libtmp_rte_event_octeontx2.a.p/event_octeontx2_otx2_worker_dual.c.o
ninja: build stopped: subcommand failed




*Build Failed #7:
OS: FC32-64
Target: x86_64-native-linuxapp-clang
FAILED: kernel/linux/kni/rte_kni.ko 
make -j4 -C /lib/modules/5.6.0-0.rc7.git0.2.fc32.x86_64/build M=/root/FC32-64_K5.6.0_Clang10.0.0/x86_64-native-linuxapp-clang/ff7f84dab74e48bea55919d8b9988c1d/dpdk/x86_64-native-linuxapp-clang/kernel/linux/kni src=/root/FC32-64_K5.6.0_Clang10.0.0/x86_64-native-linuxapp-clang/ff7f84dab74e48bea55919d8b9988c1d/dpdk/kernel/linux/kni 'MODULE_CFLAGS=-include /root/FC32-64_K5.6.0_Clang10.0.0/x86_64-native-linuxapp-clang/ff7f84dab74e48bea55919d8b9988c1d/dpdk/config/rte_config.h -I/root/FC32-64_K5.6.0_Clang10.0.0/x86_64-native-linuxapp-clang/ff7f84dab74e48bea55919d8b9988c1d/dpdk/lib/librte_eal/include -I/root/FC32-64_K5.6.0_Clang10.0.0/x86_64-native-linuxapp-clang/ff7f84dab74e48bea55919d8b9988c1d/dpdk/lib/librte_eal/linux/include -I/root/FC32-64_K5.6.0_Clang10.0.0/x86_64-native-linuxapp-clang/ff7f84dab74e48bea55919d8b9988c1d/dpdk/x86_64-native-linuxapp-clang -I/root/FC32-64_K5.6.0_Clang10.0.0/x86_64-native-linuxapp-clang/ff7f84dab74e48bea55919d8b9988c1d/dpdk/kernel/linux/kni' modules
make: Entering directory '/usr/src/kernels/5.6.5-300.fc32.x86_64'
  CC [M]  /root/FC32-64_K5.6.0_Clang10.0.0/x86_64-native-linuxapp-clang/ff7f84dab74e48bea55919d8b9988c1d/dpdk/x86_64-native-linuxapp-clang/kernel/linux/kni/kni_net.o
  CC [M]  /root/FC32-64_K5.6.0_Clang10.0.0/x86_64-native-linuxapp-clang/ff7f84dab74e48bea55919d8b9988c1d/dpdk/x86_64-native-linuxapp-clang/kernel/linux/kni/kni_misc.o
In file included from <command-line>:
/root/FC32-64_K5.6.0_Clang10.0.0/x86_64-native-linuxapp-clang/ff7f84dab74e48bea55919d8b9988c1d/dpdk/config/rte_config.h:16:10: fatal error: rte_compatibility_defines.h: No such file or directory
   16 | #include <rte_compatibility_defines.h>
      |          ^~~~~~~~~~~~~~~~~~~~~~~~~~~~~
compilation terminated.
make[1]: *** [scripts/Makefile.build:268: /root/FC32-64_K5.6.0_Clang10.0.0/x86_64-native-linuxapp-clang/ff7f84dab74e48bea55919d8b9988c1d/dpdk/x86_64-native-linuxapp-clang/kernel/linux/kni/kni_misc.o] Error 1
make[1]: *** Waiting for unfinished jobs....
In file included from <command-line>:
/root/FC32-64_K5.6.0_Clang10.0.0/x86_64-native-linuxapp-clang/ff7f84dab74e48bea55919d8b9988c1d/dpdk/config/rte_config.h:16:10: fatal error: rte_compatibility_defines.h: No such file or directory
   16 | #include <rte_compatibility_defines.h>
      |          ^~~~~~~~~~~~~~~~~~~~~~~~~~~~~
compilation terminated.
make[1]: *** [scripts/Makefile.build:268: /root/FC32-64_K5.6.0_Clang10.0.0/x86_64-native-linuxapp-clang/ff7f84dab74e48bea55919d8b9988c1d/dpdk/x86_64-native-linuxapp-clang/kernel/linux/kni/kni_net.o] Error 1
make: *** [Makefile:1683: /root/FC32-64_K5.6.0_Clang10.0.0/x86_64-native-linuxapp-clang/ff7f84dab74e48bea55919d8b9988c1d/dpdk/x86_64-native-linuxapp-clang/kernel/linux/kni] Error 2
make: Leaving directory '/usr/src/kernels/5.6.5-300.fc32.x86_64'
[2603/2682] Compiling C object examples/dpdk-vmdq_dcb.p/vmdq_dcb_main.c.o
[2604/2682] Compiling C object app/test/dpdk-test.p/test_ring.c.o
[2605/2682] Compiling C object drivers/libtmp_rte_event_octeontx2.a.p/event_octeontx2_otx2_worker.c.o
[2606/2682] Compiling C object drivers/libtmp_rte_event_octeontx2.a.p/event_octeontx2_otx2_worker_dual.c.o
[2607/2682] Compiling C object app/test/dpdk-test.p/test_ring_perf.c.o
ninja: build stopped: subcommand failed




*Build Failed #8:
OS: RHEL82-64
Target: x86_64-native-linuxapp-gcc
FAILED: kernel/linux/kni/rte_kni.ko 
make -j4 -C /lib/modules/4.18.0-193.el8.x86_64/build M=/root/RHEL82-64_K4.18.0_GCC8.3.1/x86_64-native-linuxapp-gcc/ff7f84dab74e48bea55919d8b9988c1d/dpdk/x86_64-native-linuxapp-gcc/kernel/linux/kni src=/root/RHEL82-64_K4.18.0_GCC8.3.1/x86_64-native-linuxapp-gcc/ff7f84dab74e48bea55919d8b9988c1d/dpdk/kernel/linux/kni 'MODULE_CFLAGS=-include /root/RHEL82-64_K4.18.0_GCC8.3.1/x86_64-native-linuxapp-gcc/ff7f84dab74e48bea55919d8b9988c1d/dpdk/config/rte_config.h -I/root/RHEL82-64_K4.18.0_GCC8.3.1/x86_64-native-linuxapp-gcc/ff7f84dab74e48bea55919d8b9988c1d/dpdk/lib/librte_eal/include -I/root/RHEL82-64_K4.18.0_GCC8.3.1/x86_64-native-linuxapp-gcc/ff7f84dab74e48bea55919d8b9988c1d/dpdk/lib/librte_eal/linux/include -I/root/RHEL82-64_K4.18.0_GCC8.3.1/x86_64-native-linuxapp-gcc/ff7f84dab74e48bea55919d8b9988c1d/dpdk/x86_64-native-linuxapp-gcc -I/root/RHEL82-64_K4.18.0_GCC8.3.1/x86_64-native-linuxapp-gcc/ff7f84dab74e48bea55919d8b9988c1d/dpdk/kernel/linux/kni' modules
make: Entering directory '/usr/src/kernels/4.18.0-193.el8.x86_64'
  CC [M]  /root/RHEL82-64_K4.18.0_GCC8.3.1/x86_64-native-linuxapp-gcc/ff7f84dab74e48bea55919d8b9988c1d/dpdk/x86_64-native-linuxapp-gcc/kernel/linux/kni/kni_net.o
  CC [M]  /root/RHEL82-64_K4.18.0_GCC8.3.1/x86_64-native-linuxapp-gcc/ff7f84dab74e48bea55919d8b9988c1d/dpdk/x86_64-native-linuxapp-gcc/kernel/linux/kni/kni_misc.o
In file included from <command-line>:
/root/RHEL82-64_K4.18.0_GCC8.3.1/x86_64-native-linuxapp-gcc/ff7f84dab74e48bea55919d8b9988c1d/dpdk/config/rte_config.h:16:10: fatal error: rte_compatibility_defines.h: No such file or directory
 #include <rte_compatibility_defines.h>
          ^~~~~~~~~~~~~~~~~~~~~~~~~~~~~
compilation terminated.
make[1]: *** [scripts/Makefile.build:313: /root/RHEL82-64_K4.18.0_GCC8.3.1/x86_64-native-linuxapp-gcc/ff7f84dab74e48bea55919d8b9988c1d/dpdk/x86_64-native-linuxapp-gcc/kernel/linux/kni/kni_misc.o] Error 1
make[1]: *** Waiting for unfinished jobs....
In file included from <command-line>:
/root/RHEL82-64_K4.18.0_GCC8.3.1/x86_64-native-linuxapp-gcc/ff7f84dab74e48bea55919d8b9988c1d/dpdk/config/rte_config.h:16:10: fatal error: rte_compatibility_defines.h: No such file or directory
 #include <rte_compatibility_defines.h>
          ^~~~~~~~~~~~~~~~~~~~~~~~~~~~~
compilation terminated.
make[1]: *** [scripts/Makefile.build:313: /root/RHEL82-64_K4.18.0_GCC8.3.1/x86_64-native-linuxapp-gcc/ff7f84dab74e48bea55919d8b9988c1d/dpdk/x86_64-native-linuxapp-gcc/kernel/linux/kni/kni_net.o] Error 1
make: *** [Makefile:1542: _module_/root/RHEL82-64_K4.18.0_GCC8.3.1/x86_64-native-linuxapp-gcc/ff7f84dab74e48bea55919d8b9988c1d/dpdk/x86_64-native-linuxapp-gcc/kernel/linux/kni] Error 2
make: Leaving directory '/usr/src/kernels/4.18.0-193.el8.x86_64'
[2663/2677] Linking target examples/dpdk-qos_sched
[2664/2677] Linking target examples/dpdk-qos_meter
[2665/2677] Linking target examples/dpdk-service_cores
[2666/2677] Linking target examples/dpdk-rxtx_callbacks
[2667/2677] Linking target examples/dpdk-vmdq
[2668/2677] Linking target examples/dpdk-efd_node
[2669/2677] Linking target examples/dpdk-efd_server
[2670/2677] Linking target examples/dpdk-vdpa
[2671/2677] Linking target examples/dpdk-timer
ninja: build stopped: subcommand failed




*Build Failed #9:
OS: SUSE15-64
Target: x86_64-native-linuxapp-clang
FAILED: kernel/linux/kni/rte_kni.ko 
make -j4 -C /lib/modules/4.12.14-lp150.11-default/build M=/root/SUSE15-64_K4.12.14_Clang5.0.1/x86_64-native-linuxapp-clang/ff7f84dab74e48bea55919d8b9988c1d/dpdk/x86_64-native-linuxapp-clang/kernel/linux/kni src=/root/SUSE15-64_K4.12.14_Clang5.0.1/x86_64-native-linuxapp-clang/ff7f84dab74e48bea55919d8b9988c1d/dpdk/kernel/linux/kni 'MODULE_CFLAGS=-include /root/SUSE15-64_K4.12.14_Clang5.0.1/x86_64-native-linuxapp-clang/ff7f84dab74e48bea55919d8b9988c1d/dpdk/config/rte_config.h -I/root/SUSE15-64_K4.12.14_Clang5.0.1/x86_64-native-linuxapp-clang/ff7f84dab74e48bea55919d8b9988c1d/dpdk/lib/librte_eal/include -I/root/SUSE15-64_K4.12.14_Clang5.0.1/x86_64-native-linuxapp-clang/ff7f84dab74e48bea55919d8b9988c1d/dpdk/lib/librte_eal/linux/include -I/root/SUSE15-64_K4.12.14_Clang5.0.1/x86_64-native-linuxapp-clang/ff7f84dab74e48bea55919d8b9988c1d/dpdk/x86_64-native-linuxapp-clang -I/root/SUSE15-64_K4.12.14_Clang5.0.1/x86_64-native-linuxapp-clang/ff7f84dab74e48bea55919d8b9988c1d/dpdk/kernel/linux/kni' modules
make: Entering directory '/usr/src/linux-4.12.14-lp150.12.48-obj/x86_64/default'
  CC [M]  /root/SUSE15-64_K4.12.14_Clang5.0.1/x86_64-native-linuxapp-clang/ff7f84dab74e48bea55919d8b9988c1d/dpdk/x86_64-native-linuxapp-clang/kernel/linux/kni/kni_net.o
In file included from <command-line>:0:0:
/root/SUSE15-64_K4.12.14_Clang5.0.1/x86_64-native-linuxapp-clang/ff7f84dab74e48bea55919d8b9988c1d/dpdk/config/rte_config.h:16:10: fatal error: rte_compatibility_defines.h: No such file or directory
 #include <rte_compatibility_defines.h>
          ^~~~~~~~~~~~~~~~~~~~~~~~~~~~~
compilation terminated.
make[3]: *** [/usr/src/linux-4.12.14-lp150.12.48/scripts/Makefile.build:328: /root/SUSE15-64_K4.12.14_Clang5.0.1/x86_64-native-linuxapp-clang/ff7f84dab74e48bea55919d8b9988c1d/dpdk/x86_64-native-linuxapp-clang/kernel/linux/kni/kni_net.o] Error 1
make[2]: *** [/usr/src/linux-4.12.14-lp150.12.48/Makefile:1562: _module_/root/SUSE15-64_K4.12.14_Clang5.0.1/x86_64-native-linuxapp-clang/ff7f84dab74e48bea55919d8b9988c1d/dpdk/x86_64-native-linuxapp-clang/kernel/linux/kni] Error 2
make[1]: *** [Makefile:152: sub-make] Error 2
make: *** [Makefile:24: __sub-make] Error 2
make: Leaving directory '/usr/src/linux-4.12.14-lp150.12.48-obj/x86_64/default'
[2571/2648] Compiling C object app/test/dpdk-test.p/test_ring_perf.c.o
[2572/2648] Compiling C object drivers/libtmp_rte_event_octeontx2.a.p/event_octeontx2_otx2_worker_dual.c.o
[2573/2648] Compiling C object drivers/libtmp_rte_event_octeontx2.a.p/event_octeontx2_otx2_worker.c.o
ninja: build stopped: subcommand failed




*Build Failed #10:
OS: SUSE15-64
Target: x86_64-native-linuxapp-gcc
FAILED: kernel/linux/kni/rte_kni.ko 
make -j4 -C /lib/modules/4.12.14-lp150.11-default/build M=/root/SUSE15-64_K4.12.14_GCC7.3.1/x86_64-native-linuxapp-gcc/ff7f84dab74e48bea55919d8b9988c1d/dpdk/x86_64-native-linuxapp-gcc/kernel/linux/kni src=/root/SUSE15-64_K4.12.14_GCC7.3.1/x86_64-native-linuxapp-gcc/ff7f84dab74e48bea55919d8b9988c1d/dpdk/kernel/linux/kni 'MODULE_CFLAGS=-include /root/SUSE15-64_K4.12.14_GCC7.3.1/x86_64-native-linuxapp-gcc/ff7f84dab74e48bea55919d8b9988c1d/dpdk/config/rte_config.h -I/root/SUSE15-64_K4.12.14_GCC7.3.1/x86_64-native-linuxapp-gcc/ff7f84dab74e48bea55919d8b9988c1d/dpdk/lib/librte_eal/include -I/root/SUSE15-64_K4.12.14_GCC7.3.1/x86_64-native-linuxapp-gcc/ff7f84dab74e48bea55919d8b9988c1d/dpdk/lib/librte_eal/linux/include -I/root/SUSE15-64_K4.12.14_GCC7.3.1/x86_64-native-linuxapp-gcc/ff7f84dab74e48bea55919d8b9988c1d/dpdk/x86_64-native-linuxapp-gcc -I/root/SUSE15-64_K4.12.14_GCC7.3.1/x86_64-native-linuxapp-gcc/ff7f84dab74e48bea55919d8b9988c1d/dpdk/kernel/linux/kni' modules
make: Entering directory '/usr/src/linux-4.12.14-lp150.12.48-obj/x86_64/default'
  CC [M]  /root/SUSE15-64_K4.12.14_GCC7.3.1/x86_64-native-linuxapp-gcc/ff7f84dab74e48bea55919d8b9988c1d/dpdk/x86_64-native-linuxapp-gcc/kernel/linux/kni/kni_net.o
In file included from <command-line>:0:0:
/root/SUSE15-64_K4.12.14_GCC7.3.1/x86_64-native-linuxapp-gcc/ff7f84dab74e48bea55919d8b9988c1d/dpdk/config/rte_config.h:16:10: fatal error: rte_compatibility_defines.h: No such file or directory
 #include <rte_compatibility_defines.h>
          ^~~~~~~~~~~~~~~~~~~~~~~~~~~~~
compilation terminated.
make[3]: *** [/usr/src/linux-4.12.14-lp150.12.48/scripts/Makefile.build:328: /root/SUSE15-64_K4.12.14_GCC7.3.1/x86_64-native-linuxapp-gcc/ff7f84dab74e48bea55919d8b9988c1d/dpdk/x86_64-native-linuxapp-gcc/kernel/linux/kni/kni_net.o] Error 1
make[2]: *** [/usr/src/linux-4.12.14-lp150.12.48/Makefile:1562: _module_/root/SUSE15-64_K4.12.14_GCC7.3.1/x86_64-native-linuxapp-gcc/ff7f84dab74e48bea55919d8b9988c1d/dpdk/x86_64-native-linuxapp-gcc/kernel/linux/kni] Error 2
make[1]: *** [Makefile:152: sub-make] Error 2
make: *** [Makefile:24: __sub-make] Error 2
make: Leaving directory '/usr/src/linux-4.12.14-lp150.12.48-obj/x86_64/default'
[2569/2647] Compiling C object app/test/dpdk-test.p/test_ring.c.o
[2570/2647] Compiling C object app/test/dpdk-test.p/test_ring_perf.c.o
[2571/2647] Compiling C object drivers/libtmp_rte_event_octeontx2.a.p/event_octeontx2_otx2_worker.c.o
[2572/2647] Compiling C object drivers/libtmp_rte_event_octeontx2.a.p/event_octeontx2_otx2_worker_dual.c.o
ninja: build stopped: subcommand failed




*Build Failed #11:
OS: UB1804-64
Target: x86_64-native-linuxapp-gcc
FAILED: kernel/linux/kni/rte_kni.ko 
make -j4 -C /lib/modules/5.3.0-59-generic/build M=/root/UB1804-64_K4.15.0_GCC7.3.0/x86_64-native-linuxapp-gcc/ff7f84dab74e48bea55919d8b9988c1d/dpdk/x86_64-native-linuxapp-gcc/kernel/linux/kni src=/root/UB1804-64_K4.15.0_GCC7.3.0/x86_64-native-linuxapp-gcc/ff7f84dab74e48bea55919d8b9988c1d/dpdk/kernel/linux/kni 'MODULE_CFLAGS=-include /root/UB1804-64_K4.15.0_GCC7.3.0/x86_64-native-linuxapp-gcc/ff7f84dab74e48bea55919d8b9988c1d/dpdk/config/rte_config.h -I/root/UB1804-64_K4.15.0_GCC7.3.0/x86_64-native-linuxapp-gcc/ff7f84dab74e48bea55919d8b9988c1d/dpdk/lib/librte_eal/include -I/root/UB1804-64_K4.15.0_GCC7.3.0/x86_64-native-linuxapp-gcc/ff7f84dab74e48bea55919d8b9988c1d/dpdk/lib/librte_eal/linux/include -I/root/UB1804-64_K4.15.0_GCC7.3.0/x86_64-native-linuxapp-gcc/ff7f84dab74e48bea55919d8b9988c1d/dpdk/x86_64-native-linuxapp-gcc -I/root/UB1804-64_K4.15.0_GCC7.3.0/x86_64-native-linuxapp-gcc/ff7f84dab74e48bea55919d8b9988c1d/dpdk/kernel/linux/kni' modules
make: Entering directory '/usr/src/linux-headers-5.3.0-59-generic'
  CC [M]  /root/UB1804-64_K4.15.0_GCC7.3.0/x86_64-native-linuxapp-gcc/ff7f84dab74e48bea55919d8b9988c1d/dpdk/x86_64-native-linuxapp-gcc/kernel/linux/kni/kni_net.o
  CC [M]  /root/UB1804-64_K4.15.0_GCC7.3.0/x86_64-native-linuxapp-gcc/ff7f84dab74e48bea55919d8b9988c1d/dpdk/x86_64-native-linuxapp-gcc/kernel/linux/kni/kni_misc.o
In file included from <command-line>:
/root/UB1804-64_K4.15.0_GCC7.3.0/x86_64-native-linuxapp-gcc/ff7f84dab74e48bea55919d8b9988c1d/dpdk/config/rte_config.h:16:10: fatal error: rte_compatibility_defines.h: No such file or directory
 #include <rte_compatibility_defines.h>
          ^~~~~~~~~~~~~~~~~~~~~~~~~~~~~
compilation terminated.
In file included from <command-line>:
/root/UB1804-64_K4.15.0_GCC7.3.0/x86_64-native-linuxapp-gcc/ff7f84dab74e48bea55919d8b9988c1d/dpdk/config/rte_config.h:16:10: fatal error: rte_compatibility_defines.h: No such file or directory
 #include <rte_compatibility_defines.h>
          ^~~~~~~~~~~~~~~~~~~~~~~~~~~~~
compilation terminated.
scripts/Makefile.build:288: recipe for target '/root/UB1804-64_K4.15.0_GCC7.3.0/x86_64-native-linuxapp-gcc/ff7f84dab74e48bea55919d8b9988c1d/dpdk/x86_64-native-linuxapp-gcc/kernel/linux/kni/kni_misc.o' failed
make[1]: *** [/root/UB1804-64_K4.15.0_GCC7.3.0/x86_64-native-linuxapp-gcc/ff7f84dab74e48bea55919d8b9988c1d/dpdk/x86_64-native-linuxapp-gcc/kernel/linux/kni/kni_misc.o] Error 1
make[1]: *** Waiting for unfinished jobs....
scripts/Makefile.build:288: recipe for target '/root/UB1804-64_K4.15.0_GCC7.3.0/x86_64-native-linuxapp-gcc/ff7f84dab74e48bea55919d8b9988c1d/dpdk/x86_64-native-linuxapp-gcc/kernel/linux/kni/kni_net.o' failed
make[1]: *** [/root/UB1804-64_K4.15.0_GCC7.3.0/x86_64-native-linuxapp-gcc/ff7f84dab74e48bea55919d8b9988c1d/dpdk/x86_64-native-linuxapp-gcc/kernel/linux/kni/kni_net.o] Error 1
Makefile:1656: recipe for target '_module_/root/UB1804-64_K4.15.0_GCC7.3.0/x86_64-native-linuxapp-gcc/ff7f84dab74e48bea55919d8b9988c1d/dpdk/x86_64-native-linuxapp-gcc/kernel/linux/kni' failed
make: *** [_module_/root/UB1804-64_K4.15.0_GCC7.3.0/x86_64-native-linuxapp-gcc/ff7f84dab74e48bea55919d8b9988c1d/dpdk/x86_64-native-linuxapp-gcc/kernel/linux/kni] Error 2
make: Leaving directory '/usr/src/linux-headers-5.3.0-59-generic'
[2590/2666] Compiling C object drivers/libtmp_rte_event_octeontx2.a.p/event_octeontx2_otx2_worker.c.o
[2591/2666] Compiling C object drivers/libtmp_rte_event_octeontx2.a.p/event_octeontx2_otx2_worker_dual.c.o
ninja: build stopped: subcommand failed




*Build Failed #12:
OS: UB2004-32
Target: i686-native-linuxapp-gcc
FAILED: kernel/linux/kni/rte_kni.ko 
make -j4 -C /lib/modules/5.4.0-47-generic/build M=/root/UB2004-32_K4.15.0_GCC9.3.0/i686-native-linuxapp-gcc/ff7f84dab74e48bea55919d8b9988c1d/dpdk/i686-native-linuxapp-gcc/kernel/linux/kni src=/root/UB2004-32_K4.15.0_GCC9.3.0/i686-native-linuxapp-gcc/ff7f84dab74e48bea55919d8b9988c1d/dpdk/kernel/linux/kni 'MODULE_CFLAGS=-include /root/UB2004-32_K4.15.0_GCC9.3.0/i686-native-linuxapp-gcc/ff7f84dab74e48bea55919d8b9988c1d/dpdk/config/rte_config.h -I/root/UB2004-32_K4.15.0_GCC9.3.0/i686-native-linuxapp-gcc/ff7f84dab74e48bea55919d8b9988c1d/dpdk/lib/librte_eal/include -I/root/UB2004-32_K4.15.0_GCC9.3.0/i686-native-linuxapp-gcc/ff7f84dab74e48bea55919d8b9988c1d/dpdk/lib/librte_eal/linux/include -I/root/UB2004-32_K4.15.0_GCC9.3.0/i686-native-linuxapp-gcc/ff7f84dab74e48bea55919d8b9988c1d/dpdk/i686-native-linuxapp-gcc -I/root/UB2004-32_K4.15.0_GCC9.3.0/i686-native-linuxapp-gcc/ff7f84dab74e48bea55919d8b9988c1d/dpdk/kernel/linux/kni' modules
make: Entering directory '/usr/src/linux-headers-5.4.0-47-generic'
  CC [M]  /root/UB2004-32_K4.15.0_GCC9.3.0/i686-native-linuxapp-gcc/ff7f84dab74e48bea55919d8b9988c1d/dpdk/i686-native-linuxapp-gcc/kernel/linux/kni/kni_net.o
In file included from <command-line>:
/root/UB2004-32_K4.15.0_GCC9.3.0/i686-native-linuxapp-gcc/ff7f84dab74e48bea55919d8b9988c1d/dpdk/config/rte_config.h:16:10: fatal error: rte_compatibility_defines.h: No such file or directory
   16 | #include <rte_compatibility_defines.h>
      |          ^~~~~~~~~~~~~~~~~~~~~~~~~~~~~
compilation terminated.
  CC [M]  /root/UB2004-32_K4.15.0_GCC9.3.0/i686-native-linuxapp-gcc/ff7f84dab74e48bea55919d8b9988c1d/dpdk/i686-native-linuxapp-gcc/kernel/linux/kni/kni_misc.o
In file included from <command-line>:
/root/UB2004-32_K4.15.0_GCC9.3.0/i686-native-linuxapp-gcc/ff7f84dab74e48bea55919d8b9988c1d/dpdk/config/rte_config.h:16:10: fatal error: rte_compatibility_defines.h: No such file or directory
   16 | #include <rte_compatibility_defines.h>
      |          ^~~~~~~~~~~~~~~~~~~~~~~~~~~~~
compilation terminated.
make[1]: *** [scripts/Makefile.build:275: /root/UB2004-32_K4.15.0_GCC9.3.0/i686-native-linuxapp-gcc/ff7f84dab74e48bea55919d8b9988c1d/dpdk/i686-native-linuxapp-gcc/kernel/linux/kni/kni_net.o] Error 1
make[1]: *** Waiting for unfinished jobs....
make[1]: *** [scripts/Makefile.build:275: /root/UB2004-32_K4.15.0_GCC9.3.0/i686-native-linuxapp-gcc/ff7f84dab74e48bea55919d8b9988c1d/dpdk/i686-native-linuxapp-gcc/kernel/linux/kni/kni_misc.o] Error 1
make: *** [Makefile:1734: /root/UB2004-32_K4.15.0_GCC9.3.0/i686-native-linuxapp-gcc/ff7f84dab74e48bea55919d8b9988c1d/dpdk/i686-native-linuxapp-gcc/kernel/linux/kni] Error 2
make: Leaving directory '/usr/src/linux-headers-5.4.0-47-generic'
[2330/2403] Compiling C object drivers/libtmp_rte_event_octeontx2.a.p/event_octeontx2_otx2_worker.c.o
[2331/2403] Compiling C object drivers/libtmp_rte_event_octeontx2.a.p/event_octeontx2_otx2_worker_dual.c.o
ninja: build stopped: subcommand failed




*Build Failed #13:
OS: UB2004-64N
Target: x86_64-native-linuxapp-gcc
FAILED: kernel/linux/kni/rte_kni.ko 
make -j4 -C /lib/modules/5.8.0-050800-generic/build M=/root/UB2004-64N_K5.7.0_GCC9.3.0/x86_64-native-linuxapp-gcc/ff7f84dab74e48bea55919d8b9988c1d/dpdk/x86_64-native-linuxapp-gcc/kernel/linux/kni src=/root/UB2004-64N_K5.7.0_GCC9.3.0/x86_64-native-linuxapp-gcc/ff7f84dab74e48bea55919d8b9988c1d/dpdk/kernel/linux/kni 'MODULE_CFLAGS=-include /root/UB2004-64N_K5.7.0_GCC9.3.0/x86_64-native-linuxapp-gcc/ff7f84dab74e48bea55919d8b9988c1d/dpdk/config/rte_config.h -I/root/UB2004-64N_K5.7.0_GCC9.3.0/x86_64-native-linuxapp-gcc/ff7f84dab74e48bea55919d8b9988c1d/dpdk/lib/librte_eal/include -I/root/UB2004-64N_K5.7.0_GCC9.3.0/x86_64-native-linuxapp-gcc/ff7f84dab74e48bea55919d8b9988c1d/dpdk/lib/librte_eal/linux/include -I/root/UB2004-64N_K5.7.0_GCC9.3.0/x86_64-native-linuxapp-gcc/ff7f84dab74e48bea55919d8b9988c1d/dpdk/x86_64-native-linuxapp-gcc -I/root/UB2004-64N_K5.7.0_GCC9.3.0/x86_64-native-linuxapp-gcc/ff7f84dab74e48bea55919d8b9988c1d/dpdk/kernel/linux/kni' modules
make: Entering directory '/usr/src/linux-headers-5.8.0-050800-generic'
  CC [M]  /root/UB2004-64N_K5.7.0_GCC9.3.0/x86_64-native-linuxapp-gcc/ff7f84dab74e48bea55919d8b9988c1d/dpdk/x86_64-native-linuxapp-gcc/kernel/linux/kni/kni_net.o
In file included from <command-line>:
/root/UB2004-64N_K5.7.0_GCC9.3.0/x86_64-native-linuxapp-gcc/ff7f84dab74e48bea55919d8b9988c1d/dpdk/config/rte_config.h:16:10: fatal error: rte_compatibility_defines.h: No such file or directory
   16 | #include <rte_compatibility_defines.h>
      |          ^~~~~~~~~~~~~~~~~~~~~~~~~~~~~
compilation terminated.
  CC [M]  /root/UB2004-64N_K5.7.0_GCC9.3.0/x86_64-native-linuxapp-gcc/ff7f84dab74e48bea55919d8b9988c1d/dpdk/x86_64-native-linuxapp-gcc/kernel/linux/kni/kni_misc.o
In file included from <command-line>:
/root/UB2004-64N_K5.7.0_GCC9.3.0/x86_64-native-linuxapp-gcc/ff7f84dab74e48bea55919d8b9988c1d/dpdk/config/rte_config.h:16:10: fatal error: rte_compatibility_defines.h: No such file or directory
   16 | #include <rte_compatibility_defines.h>
      |          ^~~~~~~~~~~~~~~~~~~~~~~~~~~~~
compilation terminated.
make[1]: *** [scripts/Makefile.build:281: /root/UB2004-64N_K5.7.0_GCC9.3.0/x86_64-native-linuxapp-gcc/ff7f84dab74e48bea55919d8b9988c1d/dpdk/x86_64-native-linuxapp-gcc/kernel/linux/kni/kni_misc.o] Error 1
make[1]: *** Waiting for unfinished jobs....
make[1]: *** [scripts/Makefile.build:281: /root/UB2004-64N_K5.7.0_GCC9.3.0/x86_64-native-linuxapp-gcc/ff7f84dab74e48bea55919d8b9988c1d/dpdk/x86_64-native-linuxapp-gcc/kernel/linux/kni/kni_net.o] Error 1
make: *** [Makefile:1756: /root/UB2004-64N_K5.7.0_GCC9.3.0/x86_64-native-linuxapp-gcc/ff7f84dab74e48bea55919d8b9988c1d/dpdk/x86_64-native-linuxapp-gcc/kernel/linux/kni] Error 2
make: Leaving directory '/usr/src/linux-headers-5.8.0-050800-generic'
[2595/2671] Compiling C object drivers/libtmp_rte_event_octeontx2.a.p/event_octeontx2_otx2_worker.c.o
[2596/2671] Compiling C object drivers/libtmp_rte_event_octeontx2.a.p/event_octeontx2_otx2_worker_dual.c.o
ninja: build stopped: subcommand failed




*Build Failed #14:
OS: UB2004-64N
Target: x86_64-native-linuxapp-gcc+shared
FAILED: kernel/linux/kni/rte_kni.ko 
make -j4 -C /lib/modules/5.8.0-050800-generic/build M=/root/UB2004-64N_K5.7.0_GCC9.3.0/x86_64-native-linuxapp-gcc+shared/ff7f84dab74e48bea55919d8b9988c1d/dpdk/x86_64-native-linuxapp-gcc+shared/kernel/linux/kni src=/root/UB2004-64N_K5.7.0_GCC9.3.0/x86_64-native-linuxapp-gcc+shared/ff7f84dab74e48bea55919d8b9988c1d/dpdk/kernel/linux/kni 'MODULE_CFLAGS=-include /root/UB2004-64N_K5.7.0_GCC9.3.0/x86_64-native-linuxapp-gcc+shared/ff7f84dab74e48bea55919d8b9988c1d/dpdk/config/rte_config.h -I/root/UB2004-64N_K5.7.0_GCC9.3.0/x86_64-native-linuxapp-gcc+shared/ff7f84dab74e48bea55919d8b9988c1d/dpdk/lib/librte_eal/include -I/root/UB2004-64N_K5.7.0_GCC9.3.0/x86_64-native-linuxapp-gcc+shared/ff7f84dab74e48bea55919d8b9988c1d/dpdk/lib/librte_eal/linux/include -I/root/UB2004-64N_K5.7.0_GCC9.3.0/x86_64-native-linuxapp-gcc+shared/ff7f84dab74e48bea55919d8b9988c1d/dpdk/x86_64-native-linuxapp-gcc+shared -I/root/UB2004-64N_K5.7.0_GCC9.3.0/x86_64-native-linuxapp-gcc+shared/ff7f84dab74e48bea55919d8b9988c1d/dpdk/kernel/linux/kni' modules
make: Entering directory '/usr/src/linux-headers-5.8.0-050800-generic'
  CC [M]  /root/UB2004-64N_K5.7.0_GCC9.3.0/x86_64-native-linuxapp-gcc+shared/ff7f84dab74e48bea55919d8b9988c1d/dpdk/x86_64-native-linuxapp-gcc+shared/kernel/linux/kni/kni_net.o
  CC [M]  /root/UB2004-64N_K5.7.0_GCC9.3.0/x86_64-native-linuxapp-gcc+shared/ff7f84dab74e48bea55919d8b9988c1d/dpdk/x86_64-native-linuxapp-gcc+shared/kernel/linux/kni/kni_misc.o
In file included from <command-line>:
/root/UB2004-64N_K5.7.0_GCC9.3.0/x86_64-native-linuxapp-gcc+shared/ff7f84dab74e48bea55919d8b9988c1d/dpdk/config/rte_config.h:16:10: fatal error: rte_compatibility_defines.h: No such file or directory
   16 | #include <rte_compatibility_defines.h>
      |          ^~~~~~~~~~~~~~~~~~~~~~~~~~~~~
compilation terminated.
In file included from <command-line>:
/root/UB2004-64N_K5.7.0_GCC9.3.0/x86_64-native-linuxapp-gcc+shared/ff7f84dab74e48bea55919d8b9988c1d/dpdk/config/rte_config.h:16:10: fatal error: rte_compatibility_defines.h: No such file or directory
   16 | #include <rte_compatibility_defines.h>
      |          ^~~~~~~~~~~~~~~~~~~~~~~~~~~~~
compilation terminated.
make[1]: *** [scripts/Makefile.build:281: /root/UB2004-64N_K5.7.0_GCC9.3.0/x86_64-native-linuxapp-gcc+shared/ff7f84dab74e48bea55919d8b9988c1d/dpdk/x86_64-native-linuxapp-gcc+shared/kernel/linux/kni/kni_misc.o] Error 1
make[1]: *** Waiting for unfinished jobs....
make[1]: *** [scripts/Makefile.build:281: /root/UB2004-64N_K5.7.0_GCC9.3.0/x86_64-native-linuxapp-gcc+shared/ff7f84dab74e48bea55919d8b9988c1d/dpdk/x86_64-native-linuxapp-gcc+shared/kernel/linux/kni/kni_net.o] Error 1
make: *** [Makefile:1756: /root/UB2004-64N_K5.7.0_GCC9.3.0/x86_64-native-linuxapp-gcc+shared/ff7f84dab74e48bea55919d8b9988c1d/dpdk/x86_64-native-linuxapp-gcc+shared/kernel/linux/kni] Error 2
make: Leaving directory '/usr/src/linux-headers-5.8.0-050800-generic'
[2489/2502] Compiling C object app/test/dpdk-test.p/test_compressdev.c.o
[2490/2502] Compiling C object app/test/dpdk-test.p/test_trace_perf.c.o
[2491/2502] Compiling C object app/test/dpdk-test.p/test_ring_perf.c.o
[2492/2502] Compiling C object app/test/dpdk-test.p/test_ring.c.o
[2493/2502] Compiling C object drivers/libtmp_rte_event_octeontx2.a.p/event_octeontx2_otx2_worker.c.o
[2494/2502] Compiling C object drivers/libtmp_rte_event_octeontx2.a.p/event_octeontx2_otx2_worker_dual.c.o
ninja: build stopped: subcommand failed




*Build Failed #15:
OS: UB2004-64
Target: x86_64-native-linuxapp-clang
FAILED: kernel/linux/kni/rte_kni.ko 
make -j4 -C /lib/modules/5.4.0-47-generic/build M=/root/UB2004-64_K5.4.0_Clang10.0.0/x86_64-native-linuxapp-clang/ff7f84dab74e48bea55919d8b9988c1d/dpdk/x86_64-native-linuxapp-clang/kernel/linux/kni src=/root/UB2004-64_K5.4.0_Clang10.0.0/x86_64-native-linuxapp-clang/ff7f84dab74e48bea55919d8b9988c1d/dpdk/kernel/linux/kni 'MODULE_CFLAGS=-include /root/UB2004-64_K5.4.0_Clang10.0.0/x86_64-native-linuxapp-clang/ff7f84dab74e48bea55919d8b9988c1d/dpdk/config/rte_config.h -I/root/UB2004-64_K5.4.0_Clang10.0.0/x86_64-native-linuxapp-clang/ff7f84dab74e48bea55919d8b9988c1d/dpdk/lib/librte_eal/include -I/root/UB2004-64_K5.4.0_Clang10.0.0/x86_64-native-linuxapp-clang/ff7f84dab74e48bea55919d8b9988c1d/dpdk/lib/librte_eal/linux/include -I/root/UB2004-64_K5.4.0_Clang10.0.0/x86_64-native-linuxapp-clang/ff7f84dab74e48bea55919d8b9988c1d/dpdk/x86_64-native-linuxapp-clang -I/root/UB2004-64_K5.4.0_Clang10.0.0/x86_64-native-linuxapp-clang/ff7f84dab74e48bea55919d8b9988c1d/dpdk/kernel/linux/kni' modules
make: Entering directory '/usr/src/linux-headers-5.4.0-47-generic'
  CC [M]  /root/UB2004-64_K5.4.0_Clang10.0.0/x86_64-native-linuxapp-clang/ff7f84dab74e48bea55919d8b9988c1d/dpdk/x86_64-native-linuxapp-clang/kernel/linux/kni/kni_net.o
  CC [M]  /root/UB2004-64_K5.4.0_Clang10.0.0/x86_64-native-linuxapp-clang/ff7f84dab74e48bea55919d8b9988c1d/dpdk/x86_64-native-linuxapp-clang/kernel/linux/kni/kni_misc.o
In file included from <command-line>:
/root/UB2004-64_K5.4.0_Clang10.0.0/x86_64-native-linuxapp-clang/ff7f84dab74e48bea55919d8b9988c1d/dpdk/config/rte_config.h:16:10: fatal error: rte_compatibility_defines.h: No such file or directory
   16 | #include <rte_compatibility_defines.h>
      |          ^~~~~~~~~~~~~~~~~~~~~~~~~~~~~
compilation terminated.
In file included from <command-line>:
/root/UB2004-64_K5.4.0_Clang10.0.0/x86_64-native-linuxapp-clang/ff7f84dab74e48bea55919d8b9988c1d/dpdk/config/rte_config.h:16:10: fatal error: rte_compatibility_defines.h: No such file or directory
   16 | #include <rte_compatibility_defines.h>
      |          ^~~~~~~~~~~~~~~~~~~~~~~~~~~~~
compilation terminated.
make[1]: *** [scripts/Makefile.build:275: /root/UB2004-64_K5.4.0_Clang10.0.0/x86_64-native-linuxapp-clang/ff7f84dab74e48bea55919d8b9988c1d/dpdk/x86_64-native-linuxapp-clang/kernel/linux/kni/kni_net.o] Error 1
make[1]: *** Waiting for unfinished jobs....
make[1]: *** [scripts/Makefile.build:275: /root/UB2004-64_K5.4.0_Clang10.0.0/x86_64-native-linuxapp-clang/ff7f84dab74e48bea55919d8b9988c1d/dpdk/x86_64-native-linuxapp-clang/kernel/linux/kni/kni_misc.o] Error 1
make: *** [Makefile:1734: /root/UB2004-64_K5.4.0_Clang10.0.0/x86_64-native-linuxapp-clang/ff7f84dab74e48bea55919d8b9988c1d/dpdk/x86_64-native-linuxapp-clang/kernel/linux/kni] Error 2
make: Leaving directory '/usr/src/linux-headers-5.4.0-47-generic'
[2593/2671] Compiling C object drivers/libtmp_rte_event_octeontx2.a.p/event_octeontx2_otx2_worker.c.o
[2594/2671] Compiling C object drivers/libtmp_rte_event_octeontx2.a.p/event_octeontx2_otx2_worker_dual.c.o
[2595/2671] Compiling C object app/test/dpdk-test.p/test_ring.c.o
[2596/2671] Compiling C object app/test/dpdk-test.p/test_ring_perf.c.o
ninja: build stopped: subcommand failed




*Build Failed #16:
OS: UB2004-64
Target: x86_64-native-linuxapp-gcc
FAILED: kernel/linux/kni/rte_kni.ko 
make -j4 -C /lib/modules/5.4.0-47-generic/build M=/root/UB2004-64_K5.4.0_GCC9.3.0/x86_64-native-linuxapp-gcc/ff7f84dab74e48bea55919d8b9988c1d/dpdk/x86_64-native-linuxapp-gcc/kernel/linux/kni src=/root/UB2004-64_K5.4.0_GCC9.3.0/x86_64-native-linuxapp-gcc/ff7f84dab74e48bea55919d8b9988c1d/dpdk/kernel/linux/kni 'MODULE_CFLAGS=-include /root/UB2004-64_K5.4.0_GCC9.3.0/x86_64-native-linuxapp-gcc/ff7f84dab74e48bea55919d8b9988c1d/dpdk/config/rte_config.h -I/root/UB2004-64_K5.4.0_GCC9.3.0/x86_64-native-linuxapp-gcc/ff7f84dab74e48bea55919d8b9988c1d/dpdk/lib/librte_eal/include -I/root/UB2004-64_K5.4.0_GCC9.3.0/x86_64-native-linuxapp-gcc/ff7f84dab74e48bea55919d8b9988c1d/dpdk/lib/librte_eal/linux/include -I/root/UB2004-64_K5.4.0_GCC9.3.0/x86_64-native-linuxapp-gcc/ff7f84dab74e48bea55919d8b9988c1d/dpdk/x86_64-native-linuxapp-gcc -I/root/UB2004-64_K5.4.0_GCC9.3.0/x86_64-native-linuxapp-gcc/ff7f84dab74e48bea55919d8b9988c1d/dpdk/kernel/linux/kni' modules
make: Entering directory '/usr/src/linux-headers-5.4.0-47-generic'
  CC [M]  /root/UB2004-64_K5.4.0_GCC9.3.0/x86_64-native-linuxapp-gcc/ff7f84dab74e48bea55919d8b9988c1d/dpdk/x86_64-native-linuxapp-gcc/kernel/linux/kni/kni_net.o
  CC [M]  /root/UB2004-64_K5.4.0_GCC9.3.0/x86_64-native-linuxapp-gcc/ff7f84dab74e48bea55919d8b9988c1d/dpdk/x86_64-native-linuxapp-gcc/kernel/linux/kni/kni_misc.o
In file included from <command-line>:
/root/UB2004-64_K5.4.0_GCC9.3.0/x86_64-native-linuxapp-gcc/ff7f84dab74e48bea55919d8b9988c1d/dpdk/config/rte_config.h:16:10: fatal error: rte_compatibility_defines.h: No such file or directory
   16 | #include <rte_compatibility_defines.h>
      |          ^~~~~~~~~~~~~~~~~~~~~~~~~~~~~
compilation terminated.
In file included from <command-line>:
/root/UB2004-64_K5.4.0_GCC9.3.0/x86_64-native-linuxapp-gcc/ff7f84dab74e48bea55919d8b9988c1d/dpdk/config/rte_config.h:16:10: fatal error: rte_compatibility_defines.h: No such file or directory
   16 | #include <rte_compatibility_defines.h>
      |          ^~~~~~~~~~~~~~~~~~~~~~~~~~~~~
compilation terminated.
make[1]: *** [scripts/Makefile.build:275: /root/UB2004-64_K5.4.0_GCC9.3.0/x86_64-native-linuxapp-gcc/ff7f84dab74e48bea55919d8b9988c1d/dpdk/x86_64-native-linuxapp-gcc/kernel/linux/kni/kni_net.o] Error 1
make[1]: *** Waiting for unfinished jobs....
make[1]: *** [scripts/Makefile.build:275: /root/UB2004-64_K5.4.0_GCC9.3.0/x86_64-native-linuxapp-gcc/ff7f84dab74e48bea55919d8b9988c1d/dpdk/x86_64-native-linuxapp-gcc/kernel/linux/kni/kni_misc.o] Error 1
make: *** [Makefile:1734: /root/UB2004-64_K5.4.0_GCC9.3.0/x86_64-native-linuxapp-gcc/ff7f84dab74e48bea55919d8b9988c1d/dpdk/x86_64-native-linuxapp-gcc/kernel/linux/kni] Error 2
make: Leaving directory '/usr/src/linux-headers-5.4.0-47-generic'
[2595/2671] Compiling C object drivers/libtmp_rte_event_octeontx2.a.p/event_octeontx2_otx2_worker.c.o
[2596/2671] Compiling C object drivers/libtmp_rte_event_octeontx2.a.p/event_octeontx2_otx2_worker_dual.c.o
ninja: build stopped: subcommand failed




*Build Failed #17:
OS: UB2004-64
Target: x86_64-native-linuxapp-icc
FAILED: kernel/linux/kni/rte_kni.ko 
make -j4 -C /lib/modules/5.4.0-47-generic/build M=/root/UB2004-64_K5.4.0_ICC19.1.0/x86_64-native-linuxapp-icc/ff7f84dab74e48bea55919d8b9988c1d/dpdk/26/kernel/linux/kni src=/root/UB2004-64_K5.4.0_ICC19.1.0/x86_64-native-linuxapp-icc/ff7f84dab74e48bea55919d8b9988c1d/dpdk/kernel/linux/kni 'MODULE_CFLAGS=-include /root/UB2004-64_K5.4.0_ICC19.1.0/x86_64-native-linuxapp-icc/ff7f84dab74e48bea55919d8b9988c1d/dpdk/config/rte_config.h -I/root/UB2004-64_K5.4.0_ICC19.1.0/x86_64-native-linuxapp-icc/ff7f84dab74e48bea55919d8b9988c1d/dpdk/lib/librte_eal/include -I/root/UB2004-64_K5.4.0_ICC19.1.0/x86_64-native-linuxapp-icc/ff7f84dab74e48bea55919d8b9988c1d/dpdk/lib/librte_eal/linux/include -I/root/UB2004-64_K5.4.0_ICC19.1.0/x86_64-native-linuxapp-icc/ff7f84dab74e48bea55919d8b9988c1d/dpdk/26 -I/root/UB2004-64_K5.4.0_ICC19.1.0/x86_64-native-linuxapp-icc/ff7f84dab74e48bea55919d8b9988c1d/dpdk/kernel/linux/kni' modules
make: Entering directory '/usr/src/linux-headers-5.4.0-47-generic'
  CC [M]  /root/UB2004-64_K5.4.0_ICC19.1.0/x86_64-native-linuxapp-icc/ff7f84dab74e48bea55919d8b9988c1d/dpdk/26/kernel/linux/kni/kni_net.o
In file included from <command-line>:
/root/UB2004-64_K5.4.0_ICC19.1.0/x86_64-native-linuxapp-icc/ff7f84dab74e48bea55919d8b9988c1d/dpdk/config/rte_config.h:16:10: fatal error: rte_compatibility_defines.h: No such file or directory
   16 | #include <rte_compatibility_defines.h>
      |          ^~~~~~~~~~~~~~~~~~~~~~~~~~~~~
compilation terminated.
  CC [M]  /root/UB2004-64_K5.4.0_ICC19.1.0/x86_64-native-linuxapp-icc/ff7f84dab74e48bea55919d8b9988c1d/dpdk/26/kernel/linux/kni/kni_misc.o
make[1]: *** [scripts/Makefile.build:275: /root/UB2004-64_K5.4.0_ICC19.1.0/x86_64-native-linuxapp-icc/ff7f84dab74e48bea55919d8b9988c1d/dpdk/26/kernel/linux/kni/kni_net.o] Error 1
make[1]: *** Waiting for unfinished jobs....
In file included from <command-line>:
/root/UB2004-64_K5.4.0_ICC19.1.0/x86_64-native-linuxapp-icc/ff7f84dab74e48bea55919d8b9988c1d/dpdk/config/rte_config.h:16:10: fatal error: rte_compatibility_defines.h: No such file or directory
   16 | #include <rte_compatibility_defines.h>
      |          ^~~~~~~~~~~~~~~~~~~~~~~~~~~~~
compilation terminated.
make[1]: *** [scripts/Makefile.build:275: /root/UB2004-64_K5.4.0_ICC19.1.0/x86_64-native-linuxapp-icc/ff7f84dab74e48bea55919d8b9988c1d/dpdk/26/kernel/linux/kni/kni_misc.o] Error 1
make: *** [Makefile:1734: /root/UB2004-64_K5.4.0_ICC19.1.0/x86_64-native-linuxapp-icc/ff7f84dab74e48bea55919d8b9988c1d/dpdk/26/kernel/linux/kni] Error 2
make: Leaving directory '/usr/src/linux-headers-5.4.0-47-generic'
[2593/2671] Compiling C object app/test/dpdk-test.p/test_ring_perf.c.o
[2594/2671] Compiling C object app/test/dpdk-test.p/test_memcpy_perf.c.o
[2595/2671] Compiling C object drivers/libtmp_rte_event_octeontx2.a.p/event_octeontx2_otx2_worker.c.o
[2596/2671] Compiling C object drivers/libtmp_rte_event_octeontx2.a.p/event_octeontx2_otx2_worker_dual.c.o
ninja: build stopped: subcommand failed




*Build Failed #18:
OS: UB2004-64
Target: x86_64-native-linuxapp-doc
FAILED: kernel/linux/kni/rte_kni.ko 
make -j4 -C /lib/modules/5.4.0-47-generic/build M=/root/UB2004-64_K5.4.0_GCC9.3.0/x86_64-native-linuxapp-doc/ff7f84dab74e48bea55919d8b9988c1d/dpdk/x86_64-native-linuxapp-doc/kernel/linux/kni src=/root/UB2004-64_K5.4.0_GCC9.3.0/x86_64-native-linuxapp-doc/ff7f84dab74e48bea55919d8b9988c1d/dpdk/kernel/linux/kni 'MODULE_CFLAGS=-include /root/UB2004-64_K5.4.0_GCC9.3.0/x86_64-native-linuxapp-doc/ff7f84dab74e48bea55919d8b9988c1d/dpdk/config/rte_config.h -I/root/UB2004-64_K5.4.0_GCC9.3.0/x86_64-native-linuxapp-doc/ff7f84dab74e48bea55919d8b9988c1d/dpdk/lib/librte_eal/include -I/root/UB2004-64_K5.4.0_GCC9.3.0/x86_64-native-linuxapp-doc/ff7f84dab74e48bea55919d8b9988c1d/dpdk/lib/librte_eal/linux/include -I/root/UB2004-64_K5.4.0_GCC9.3.0/x86_64-native-linuxapp-doc/ff7f84dab74e48bea55919d8b9988c1d/dpdk/x86_64-native-linuxapp-doc -I/root/UB2004-64_K5.4.0_GCC9.3.0/x86_64-native-linuxapp-doc/ff7f84dab74e48bea55919d8b9988c1d/dpdk/kernel/linux/kni' modules
make: Entering directory '/usr/src/linux-headers-5.4.0-47-generic'
  CC [M]  /root/UB2004-64_K5.4.0_GCC9.3.0/x86_64-native-linuxapp-doc/ff7f84dab74e48bea55919d8b9988c1d/dpdk/x86_64-native-linuxapp-doc/kernel/linux/kni/kni_net.o
  CC [M]  /root/UB2004-64_K5.4.0_GCC9.3.0/x86_64-native-linuxapp-doc/ff7f84dab74e48bea55919d8b9988c1d/dpdk/x86_64-native-linuxapp-doc/kernel/linux/kni/kni_misc.o
In file included from <command-line>:
/root/UB2004-64_K5.4.0_GCC9.3.0/x86_64-native-linuxapp-doc/ff7f84dab74e48bea55919d8b9988c1d/dpdk/config/rte_config.h:16:10: fatal error: rte_compatibility_defines.h: No such file or directory
   16 | #include <rte_compatibility_defines.h>
      |          ^~~~~~~~~~~~~~~~~~~~~~~~~~~~~
compilation terminated.
In file included from <command-line>:
/root/UB2004-64_K5.4.0_GCC9.3.0/x86_64-native-linuxapp-doc/ff7f84dab74e48bea55919d8b9988c1d/dpdk/config/rte_config.h:16:10: fatal error: rte_compatibility_defines.h: No such file or directory
   16 | #include <rte_compatibility_defines.h>
      |          ^~~~~~~~~~~~~~~~~~~~~~~~~~~~~
compilation terminated.
make[1]: *** [scripts/Makefile.build:275: /root/UB2004-64_K5.4.0_GCC9.3.0/x86_64-native-linuxapp-doc/ff7f84dab74e48bea55919d8b9988c1d/dpdk/x86_64-native-linuxapp-doc/kernel/linux/kni/kni_net.o] Error 1
make[1]: *** Waiting for unfinished jobs....
make[1]: *** [scripts/Makefile.build:275: /root/UB2004-64_K5.4.0_GCC9.3.0/x86_64-native-linuxapp-doc/ff7f84dab74e48bea55919d8b9988c1d/dpdk/x86_64-native-linuxapp-doc/kernel/linux/kni/kni_misc.o] Error 1
make: *** [Makefile:1734: /root/UB2004-64_K5.4.0_GCC9.3.0/x86_64-native-linuxapp-doc/ff7f84dab74e48bea55919d8b9988c1d/dpdk/x86_64-native-linuxapp-doc/kernel/linux/kni] Error 2
make: Leaving directory '/usr/src/linux-headers-5.4.0-47-generic'
[2497/2524] Compiling C object app/test/dpdk-test.p/test_ring_perf.c.o
[2498/2524] Generating doxygen with a custom command
[2499/2524] Compiling C object app/test/dpdk-test.p/test_ring.c.o
[2500/2524] Compiling C object drivers/libtmp_rte_event_octeontx2.a.p/event_octeontx2_otx2_worker.c.o
[2501/2524] Compiling C object drivers/libtmp_rte_event_octeontx2.a.p/event_octeontx2_otx2_worker_dual.c.o
[2502/2524] Generating html_guides with a custom command
Install the sphinx ReadTheDocs theme for improved html documentation layout: https://sphinx-rtd-theme.readthedocs.io/
ninja: build stopped: subcommand failed


DPDK STV team

             reply	other threads:[~2020-10-20  5:42 UTC|newest]

Thread overview: 14+ messages / expand[flat|nested]  mbox.gz  Atom feed  top
2020-10-20  5:41 sys_stv [this message]
2020-11-03 22:07 sys_stv
2020-11-05 22:08 sys_stv
2021-01-26  6:13 sys_stv
2021-01-26 22:08 sys_stv
2021-01-27 22:07 sys_stv
2021-01-28 22:07 sys_stv
2021-03-22 22:07 sys_stv
2021-05-07  1:05 sys_stv
2021-05-27 22:08 sys_stv
2021-06-29 15:39 sys_stv
2021-08-15 22:10 sys_stv
2021-10-14  3:03 sys_stv
2021-10-22 22:14 sys_stv

Reply instructions:

You may reply publicly to this message via plain-text email
using any one of the following methods:

* Save the following mbox file, import it into your mail client,
  and reply-to-all from there: mbox

  Avoid top-posting and favor interleaved quoting:
  https://en.wikipedia.org/wiki/Posting_style#Interleaved_style

* Reply using the --to, --cc, and --in-reply-to
  switches of git-send-email(1):

  git send-email \
    --in-reply-to='569c58$fs75sd@orsmga005-auth.jf.intel.com' \
    --to=sys_stv@intel.com \
    --cc=dpdk_sw_eng@intel.com \
    --cc=npg.sw.core.tools.prc@intel.com \
    --cc=test-report@dpdk.org \
    --cc=thomas@monjalon.net \
    /path/to/YOUR_REPLY

  https://kernel.org/pub/software/scm/git/docs/git-send-email.html

* If your mail client supports setting the In-Reply-To header
  via mailto: links, try the mailto: link

automatic DPDK test reports

This inbox may be cloned and mirrored by anyone:

	git clone --mirror http://inbox.dpdk.org/test-report/0 test-report/git/0.git

	# If you have public-inbox 1.1+ installed, you may
	# initialize and index your mirror using the following commands:
	public-inbox-init -V2 test-report test-report/ http://inbox.dpdk.org/test-report \
		test-report@dpdk.org
	public-inbox-index test-report

Example config snippet for mirrors.
Newsgroup available over NNTP:
	nntp://inbox.dpdk.org/inbox.dpdk.test-report


AGPL code for this site: git clone https://public-inbox.org/public-inbox.git