automatic DPDK test reports
 help / color / mirror / Atom feed
From: sys_stv@intel.com
To: test-report@dpdk.org, thomas@monjalon.net
Cc: dpdk_sw_eng@intel.com, npg.sw.core.tools.prc@intel.com
Subject: [dpdk-test-report] |FAILURE| dpdk daily Intel builds
Date: 06 May 2021 18:05:43 -0700
Message-ID: <613e7c$cugli1@orsmga008-auth.jf.intel.com> (raw)

[-- Attachment #1: Type: text/plain, Size: 6980 bytes --]


Test-Label: Intel-compilation
Test-Status: FAILURE
_Compilation issues_


commit 7fb41a8cbe2108a7634343c3abb7f9d01aed3777
Author: David Marchand <david.marchand@redhat.com>
Date:   Thu Apr 29 09:00:06 2021 +0200

    doc: fix Arm SoCs list

DPDK git Repo: dpdk 


Meson Build Summary: 24 Builds Done, 23 Successful, 1 Failures, 0 Blocked

+------------------+------------+--------------+------------+------------+-----------+----------+
| os               | gcc-static | clang-static | icc-static | gcc-shared | gcc-debug | document |
+------------------+------------+--------------+------------+------------+-----------+----------+
| UB2004-64        | pass       | pass         | pass       |            |           | pass     |
| RHEL83-64        | pass       |              |            |            |           |          |
| FC33-64          | pass       | pass         |            |            |           |          |
| CentOsStream8-64 | pass       |              |            |            |           |          |
| UB2104-64        | pass       |              |            |            |           |          |
| WIN10-64         |            | pass         |            |            |           |          |
| UB2004-32        | pass       |              |            |            |           |          |
| CENTOS83-64      | pass       | pass         | pass       | pass       | FAIL      |          |
| FreeBSD1201-64   | pass       | pass         |            | pass       | pass      |          |
| SUSE15-64        | pass       | pass         |            |            |           |          |
| UB2004-64N       | pass       |              |            | pass       |           |          |
+------------------+------------+--------------+------------+------------+-----------+----------+
Test environment and configuration as below:


OS: UB2004-64
	Kernel Version: 5.8.0-48-generic
	GCC Version: gcc (Ubuntu 10.2.0-5ubuntu1~20.04) 10.2.0
	Clang Version: 10.0.0-4ubuntu1
	x86_64-native-linuxapp-clang
	x86_64-native-linuxapp-gcc
	x86_64-native-linuxapp-icc
	x86_64-native-linuxapp-doc

OS: RHEL83-64
	Kernel Version: 4.18.0-240.el8.x86_64
	GCC Version: gcc (GCC) 8.3.1 20191121 (Red Hat 8.3.1-5)
	Clang Version: 10.0.1 (Red Hat 10.0.1-1.module+el8.3.0+7459+90c24896)
	x86_64-native-linuxapp-gcc

OS: FC33-64
	Kernel Version: 5.8.16-300.fc33.x86_64
	GCC Version: gcc (GCC) 10.2.1 20201005 (Red Hat 10.2.1-5)
	Clang Version: 11.0.0 (Fedora 11.0.0-1.fc33)
	x86_64-native-linuxapp-gcc
	x86_64-native-linuxapp-clang

OS: CentOsStream8-64
	Kernel Version: 4.18.0-257.el8.x86_64
	GCC Version: gcc (GCC) 8.4.1 20200928 (Red Hat 8.4.1-1)
	Clang Version: 11.0.0 (Red Hat 11.0.0-0.2.rc2.module_el8.4.0+533+50191577)
	x86_64-native-linuxapp-gcc

OS: UB2104-64
	Kernel Version: 5.11.0-16-generic
	GCC Version: gcc (Ubuntu 10.3.0-1ubuntu1) 10.3.0
	Clang Version: 12.0.0-1ubuntu1
	x86_64-native-linuxapp-gcc

OS: WIN10-64
	Kernel Version: N/A
	GCC Version: N/A
	Clang Version: Clang 8.0.0
	x86_64-windows-clang

OS: UB2004-32
	Kernel Version: 5.8.0-48-generic
	GCC Version: gcc (Ubuntu 10.2.0-5ubuntu1~20.04) 10.2.0
	Clang Version: 10.0.0-4ubuntu1
	i686-native-linuxapp-gcc

OS: CENTOS83-64
	Kernel Version: 4.18.0-240.1.1.el8_3.x86_64
	GCC Version: gcc (GCC) 8.3.1 20191121 (Red Hat 8.3.1-5)
	Clang Version: 10.0.1 (Red Hat 10.0.1-1.module_el8.3.0+467+cb298d5b)
	x86_64-native-linuxapp-gcc
	x86_64-native-linuxapp-clang
	x86_64-native-linuxapp-icc
	x86_64-native-linuxapp-gcc+shared
	x86_64-native-linuxapp-gcc+debug

OS: FreeBSD1201-64
	Kernel Version: 12.1-RELEASE
	GCC Version: gcc (FreeBSD Ports Collection) 9.2.0
	Clang Version: 8.0.1 (tags/RELEASE_801/final 366581) (based on LLVM 8.0.1)
	x86_64-native-bsdapp-gcc
	x86_64-native-bsdapp-clang
	x86_64-native-bsdapp-gcc+shared
	x86_64-native-bsdapp-gcc+debug

OS: SUSE15-64
	Kernel Version: 5.3.18-lp152.57-default
	GCC Version: gcc (SUSE Linux) 7.5.0
	Clang Version: 9.0.1
	x86_64-native-linuxapp-clang
	x86_64-native-linuxapp-gcc

OS: UB2004-64N
	Kernel Version: 5.11.0-051100-generic
	GCC Version: gcc (GCC) 10.3.0
	Clang Version: 10.0.0-4ubuntu1
	x86_64-native-linuxapp-gcc
	x86_64-native-linuxapp-gcc+shared



*Build Failed #1:
OS: CENTOS83-64
Target: x86_64-native-linuxapp-gcc+debug
FAILED: drivers/libtmp_rte_net_hns3.a.p/net_hns3_hns3_rxtx.c.o 
gcc -Idrivers/libtmp_rte_net_hns3.a.p -Idrivers -I../drivers -Idrivers/net/hns3 -I../drivers/net/hns3 -Ilib/ethdev -I../lib/ethdev -I. -I.. -Iconfig -I../config -Ilib/eal/include -I../lib/eal/include -Ilib/eal/linux/include -I../lib/eal/linux/include -Ilib/eal/x86/include -I../lib/eal/x86/include -Ilib/eal/common -I../lib/eal/common -Ilib/eal -I../lib/eal -Ilib/kvargs -I../lib/kvargs -Ilib/metrics -I../lib/metrics -Ilib/telemetry -I../lib/telemetry -Ilib/net -I../lib/net -Ilib/mbuf -I../lib/mbuf -Ilib/mempool -I../lib/mempool -Ilib/ring -I../lib/ring -Ilib/meter -I../lib/meter -Idrivers/bus/pci -I../drivers/bus/pci -I../drivers/bus/pci/linux -Ilib/pci -I../lib/pci -Idrivers/bus/vdev -I../drivers/bus/vdev -Ilib/hash -I../lib/hash -Ilib/rcu -I../lib/rcu -fdiagnostics-color=always -pipe -D_FILE_OFFSET_BITS=64 -Wall -Winvalid-pch -Werror -O2 -g -include rte_config.h -Wextra -Wcast-qual -Wdeprecated -Wformat -Wformat-nonliteral -Wformat-security -Wmissing-declarations -Wmissing-prototypes -Wnested-externs -Wold-style-definition -Wpointer-arith -Wsign-compare -Wstrict-prototypes -Wundef -Wwrite-strings -Wno-packed-not-aligned -Wno-missing-field-initializers -D_GNU_SOURCE -fPIC -march=native -DALLOW_EXPERIMENTAL_API -DALLOW_INTERNAL_API -Wno-format-truncation -MD -MQ drivers/libtmp_rte_net_hns3.a.p/net_hns3_hns3_rxtx.c.o -MF drivers/libtmp_rte_net_hns3.a.p/net_hns3_hns3_rxtx.c.o.d -o drivers/libtmp_rte_net_hns3.a.p/net_hns3_hns3_rxtx.c.o -c ../drivers/net/hns3/hns3_rxtx.c
../drivers/net/hns3/hns3_rxtx.c: In function ‘hns3_get_tx_prep_needed’:
../drivers/net/hns3/hns3_rxtx.c:4213:45: error: unused parameter ‘dev’ [-Werror=unused-parameter]
 hns3_get_tx_prep_needed(struct rte_eth_dev *dev)
                         ~~~~~~~~~~~~~~~~~~~~^~~
cc1: all warnings being treated as errors
[1286/2752] Compiling C object drivers/libtmp_rte_net_i40e.a.p/net_i40e_i40e_vf_representor.c.o
[1287/2752] Compiling C object drivers/libtmp_rte_net_i40e.a.p/net_i40e_rte_pmd_i40e.c.o
[1288/2752] Compiling C object drivers/libtmp_rte_net_i40e.a.p/net_i40e_i40e_rxtx.c.o
[1289/2752] Compiling C object drivers/libtmp_rte_net_iavf.a.p/net_iavf_iavf_vchnl.c.o
[1290/2752] Compiling C object drivers/libtmp_rte_net_i40e.a.p/net_i40e_i40e_rxtx_vec_sse.c.o
[1291/2752] Compiling C object drivers/libtmp_rte_net_i40e.a.p/net_i40e_i40e_rxtx_vec_avx2.c.o
[1292/2752] Compiling C object drivers/libtmp_rte_net_i40e.a.p/net_i40e_i40e_ethdev.c.o
[1293/2752] Compiling C object drivers/libtmp_rte_net_iavf.a.p/net_iavf_iavf_rxtx.c.o
[1294/2752] Compiling C object drivers/net/iavf/libiavf_avx512_lib.a.p/iavf_rxtx_vec_avx512.c.o
ninja: build stopped


DPDK STV team

             reply	other threads:[~2021-05-07  1:05 UTC|newest]

Thread overview: 14+ messages / expand[flat|nested]  mbox.gz  Atom feed  top
2021-05-07  1:05 sys_stv [this message]
  -- strict thread matches above, loose matches on Subject: below --
2021-10-22 22:14 sys_stv
2021-10-14  3:03 sys_stv
2021-08-15 22:10 sys_stv
2021-06-29 15:39 sys_stv
2021-05-27 22:08 sys_stv
2021-03-22 22:07 sys_stv
2021-01-28 22:07 sys_stv
2021-01-27 22:07 sys_stv
2021-01-26 22:08 sys_stv
2021-01-26  6:13 sys_stv
2020-11-05 22:08 sys_stv
2020-11-03 22:07 sys_stv
2020-10-20  5:41 sys_stv

Reply instructions:

You may reply publicly to this message via plain-text email
using any one of the following methods:

* Save the following mbox file, import it into your mail client,
  and reply-to-all from there: mbox

  Avoid top-posting and favor interleaved quoting:
  https://en.wikipedia.org/wiki/Posting_style#Interleaved_style

* Reply using the --to, --cc, and --in-reply-to
  switches of git-send-email(1):

  git send-email \
    --in-reply-to='613e7c$cugli1@orsmga008-auth.jf.intel.com' \
    --to=sys_stv@intel.com \
    --cc=dpdk_sw_eng@intel.com \
    --cc=npg.sw.core.tools.prc@intel.com \
    --cc=test-report@dpdk.org \
    --cc=thomas@monjalon.net \
    /path/to/YOUR_REPLY

  https://kernel.org/pub/software/scm/git/docs/git-send-email.html

* If your mail client supports setting the In-Reply-To header
  via mailto: links, try the mailto: link

automatic DPDK test reports

This inbox may be cloned and mirrored by anyone:

	git clone --mirror http://inbox.dpdk.org/test-report/0 test-report/git/0.git

	# If you have public-inbox 1.1+ installed, you may
	# initialize and index your mirror using the following commands:
	public-inbox-init -V2 test-report test-report/ http://inbox.dpdk.org/test-report \
		test-report@dpdk.org
	public-inbox-index test-report

Example config snippet for mirrors.
Newsgroup available over NNTP:
	nntp://inbox.dpdk.org/inbox.dpdk.test-report


AGPL code for this site: git clone https://public-inbox.org/public-inbox.git