automatic DPDK test reports
 help / color / mirror / Atom feed
* |SUCCESS| pw152116 [v5 6/6] test/crypto: add tests for virtio user PMD
       [not found] <ed9c5de18b1be2fb9830c3b4432360079c43d9bb.1740595670.git.gmuthukrishn@marvell.com>
@ 2025-02-26 19:00 ` checkpatch
  2025-02-26 23:25 ` |FAILURE| " 0-day Robot
  2025-02-27  5:50 ` |WARNING| pw152111-152116 [PATCH] [v5, " dpdklab
  2 siblings, 0 replies; 3+ messages in thread
From: checkpatch @ 2025-02-26 19:00 UTC (permalink / raw)
  To: test-report

Test-Label: checkpatch
Test-Status: SUCCESS
http://dpdk.org/patch/152116

_coding style OK_



^ permalink raw reply	[flat|nested] 3+ messages in thread

* |FAILURE| pw152116 [v5 6/6] test/crypto: add tests for virtio user PMD
       [not found] <ed9c5de18b1be2fb9830c3b4432360079c43d9bb.1740595670.git.gmuthukrishn@marvell.com>
  2025-02-26 19:00 ` |SUCCESS| pw152116 [v5 6/6] test/crypto: add tests for virtio user PMD checkpatch
@ 2025-02-26 23:25 ` 0-day Robot
  2025-02-27  5:50 ` |WARNING| pw152111-152116 [PATCH] [v5, " dpdklab
  2 siblings, 0 replies; 3+ messages in thread
From: 0-day Robot @ 2025-02-26 23:25 UTC (permalink / raw)
  To: test-report; +Cc: gmuthukrishn, robot

From: robot@bytheb.org

Test-Label: github-robot: build
Test-Status: FAILURE
http://patchwork.dpdk.org/patch/152116/

_github build: failed_
Build URL: https://github.com/ovsrobot/dpdk/actions/runs/13551817532
Build Logs:
-----------------------Summary of failed steps-----------------------
"ubuntu-22.04-gcc-stdatomic" failed at step Build and test
"ubuntu-22.04-clang-stdatomic" failed at step Build and test
"ubuntu-22.04-gcc-abi+debug+doc+examples+tests" failed at step Build and test
"ubuntu-22.04-clang-asan+doc+tests" failed at step Build and test
"ubuntu-22.04-gcc-static-i386" failed at step Build and test
"ubuntu-22.04-gcc-shared-aarch64" failed at step Build and test
"ubuntu-22.04-gcc-ppc64le" failed at step Build and test
"ubuntu-22.04-gcc-riscv64" failed at step Build and test
"fedora:39-gcc" failed at step Build
"fedora:39-clang" failed at step Build
----------------------End summary of failed steps--------------------

-------------------------------BEGIN LOGS----------------------------
####################################################################################
#### [Begin job log] "ubuntu-22.04-gcc-stdatomic" at step Build and test
####################################################################################
 1604 |                 ret = virtio_crypto_asym_rsa_configure_session(&xform->rsa, para);
      |                                                                             ^~~~
      |                                                                             |
      |                                                                             struct virtio_crypto_akcipher_session_para *
../drivers/crypto/virtio/virtio_cryptodev.c:1530:61: note: expected ‘struct virtio_crypto_akcipher_session_para *’ but argument is of type ‘struct virtio_crypto_akcipher_session_para *’
 1530 |                 struct virtio_crypto_akcipher_session_para *para)
      |                 ~~~~~~~~~~~~~~~~~~~~~~~~~~~~~~~~~~~~~~~~~~~~^~~~
../drivers/crypto/virtio/virtio_cryptodev.c:1616:29: error: ‘union <anonymous>’ has no member named ‘akcipher_create_session’; did you mean ‘hash_create_session’?
 1616 |                 ctrl_req->u.akcipher_create_session.para.keylen = ret;
      |                             ^~~~~~~~~~~~~~~~~~~~~~~
      |                             hash_create_session
../drivers/crypto/virtio/virtio_cryptodev.c:1619:21: error: invalid use of undefined type ‘struct virtio_crypto_akcipher_session_para’
 1619 |                 para->algo = VIRTIO_CRYPTO_NO_AKCIPHER;
      |                     ^~
../drivers/crypto/virtio/virtio_cryptodev.c:1619:30: error: ‘VIRTIO_CRYPTO_NO_AKCIPHER’ undeclared (first use in this function); did you mean ‘VIRTIO_CRYPTO_NO_CIPHER’?
 1619 |                 para->algo = VIRTIO_CRYPTO_NO_AKCIPHER;
      |                              ^~~~~~~~~~~~~~~~~~~~~~~~~
      |                              VIRTIO_CRYPTO_NO_CIPHER
cc1: all warnings being treated as errors
[2549/3231] Generating rte_crypto_scheduler.sym_chk with a custom command (wrapped by meson to capture output)
[2550/3231] Compiling C object drivers/libtmp_rte_crypto_virtio.a.p/crypto_virtio_virtio_pci.c.o
[2551/3231] Compiling C object drivers/libtmp_rte_crypto_cnxk.a.p/crypto_cnxk_cn10k_cryptodev_ops.c.o
[2552/3231] Compiling C object drivers/libtmp_rte_crypto_octeontx.a.p/crypto_octeontx_otx_cryptodev_ops.c.o
ninja: build stopped: subcommand failed.
##[error]Process completed with exit code 1.
####################################################################################
#### [End job log] "ubuntu-22.04-gcc-stdatomic" at step Build and test
####################################################################################




####################################################################################
#### [Begin job log] "ubuntu-22.04-clang-stdatomic" at step Build and test
####################################################################################
                        para->u.rsa.hash_algo = VIRTIO_CRYPTO_RSA_SHA224;
                                                ^
../drivers/crypto/virtio/virtio_cryptodev.c:1550:8: error: incomplete definition of type 'struct virtio_crypto_akcipher_session_para'
                        para->u.rsa.hash_algo = VIRTIO_CRYPTO_RSA_SHA256;
                        ~~~~^
../drivers/crypto/virtio/virtio_cryptodev.c:1530:10: note: forward declaration of 'struct virtio_crypto_akcipher_session_para'
                struct virtio_crypto_akcipher_session_para *para)
                       ^
../drivers/crypto/virtio/virtio_cryptodev.c:1550:28: error: use of undeclared identifier 'VIRTIO_CRYPTO_RSA_SHA256'
                        para->u.rsa.hash_algo = VIRTIO_CRYPTO_RSA_SHA256;
                                                ^
../drivers/crypto/virtio/virtio_cryptodev.c:1553:8: error: incomplete definition of type 'struct virtio_crypto_akcipher_session_para'
                        para->u.rsa.hash_algo = VIRTIO_CRYPTO_RSA_SHA512;
                        ~~~~^
../drivers/crypto/virtio/virtio_cryptodev.c:1530:10: note: forward declaration of 'struct virtio_crypto_akcipher_session_para'
                struct virtio_crypto_akcipher_session_para *para)
                       ^
fatal error: too many errors emitted, stopping now [-ferror-limit=]
20 errors generated.
[2559/3231] Generating rte_crypto_scheduler.sym_chk with a custom command (wrapped by meson to capture output)
[2560/3231] Compiling C object drivers/libtmp_rte_crypto_virtio.a.p/crypto_virtio_virtio_pci.c.o
[2561/3231] Compiling C object drivers/libtmp_rte_crypto_octeontx.a.p/crypto_octeontx_otx_cryptodev_ops.c.o
[2562/3231] Compiling C object drivers/libtmp_rte_crypto_cnxk.a.p/crypto_cnxk_cn10k_cryptodev_ops.c.o
ninja: build stopped: subcommand failed.
##[error]Process completed with exit code 1.
####################################################################################
#### [End job log] "ubuntu-22.04-clang-stdatomic" at step Build and test
####################################################################################




####################################################################################
#### [Begin job log] "ubuntu-22.04-gcc-abi+debug+doc+examples+tests" at step Build and test
####################################################################################
      |                                                                             ^~~~
      |                                                                             |
      |                                                                             struct virtio_crypto_akcipher_session_para *
../drivers/crypto/virtio/virtio_cryptodev.c:1530:61: note: expected ‘struct virtio_crypto_akcipher_session_para *’ but argument is of type ‘struct virtio_crypto_akcipher_session_para *’
 1530 |                 struct virtio_crypto_akcipher_session_para *para)
      |                 ~~~~~~~~~~~~~~~~~~~~~~~~~~~~~~~~~~~~~~~~~~~~^~~~
../drivers/crypto/virtio/virtio_cryptodev.c:1616:29: error: ‘union <anonymous>’ has no member named ‘akcipher_create_session’; did you mean ‘hash_create_session’?
 1616 |                 ctrl_req->u.akcipher_create_session.para.keylen = ret;
      |                             ^~~~~~~~~~~~~~~~~~~~~~~
      |                             hash_create_session
../drivers/crypto/virtio/virtio_cryptodev.c:1619:21: error: invalid use of undefined type ‘struct virtio_crypto_akcipher_session_para’
 1619 |                 para->algo = VIRTIO_CRYPTO_NO_AKCIPHER;
      |                     ^~
../drivers/crypto/virtio/virtio_cryptodev.c:1619:30: error: ‘VIRTIO_CRYPTO_NO_AKCIPHER’ undeclared (first use in this function); did you mean ‘VIRTIO_CRYPTO_NO_CIPHER’?
 1619 |                 para->algo = VIRTIO_CRYPTO_NO_AKCIPHER;
      |                              ^~~~~~~~~~~~~~~~~~~~~~~~~
      |                              VIRTIO_CRYPTO_NO_CIPHER
cc1: all warnings being treated as errors
[2601/6679] Compiling C object drivers/libtmp_rte_crypto_virtio.a.p/crypto_virtio_virtio_pci.c.o
[2602/6679] Generating rte_crypto_scheduler.sym_chk with a custom command (wrapped by meson to capture output)
[2603/6679] Compiling C object drivers/libtmp_rte_crypto_cnxk.a.p/crypto_cnxk_cn9k_cryptodev_ops.c.o
[2604/6679] Compiling C object drivers/libtmp_rte_crypto_octeontx.a.p/crypto_octeontx_otx_cryptodev_ops.c.o
[2605/6679] Compiling C object drivers/libtmp_rte_crypto_cnxk.a.p/crypto_cnxk_cn10k_cryptodev_ops.c.o
ninja: build stopped: subcommand failed.
##[error]Process completed with exit code 1.
####################################################################################
#### [End job log] "ubuntu-22.04-gcc-abi+debug+doc+examples+tests" at step Build and test
####################################################################################




####################################################################################
#### [Begin job log] "ubuntu-22.04-clang-asan+doc+tests" at step Build and test
####################################################################################
                                                ^
../drivers/crypto/virtio/virtio_cryptodev.c:1550:8: error: incomplete definition of type 'struct virtio_crypto_akcipher_session_para'
                        para->u.rsa.hash_algo = VIRTIO_CRYPTO_RSA_SHA256;
                        ~~~~^
../drivers/crypto/virtio/virtio_cryptodev.c:1530:10: note: forward declaration of 'struct virtio_crypto_akcipher_session_para'
                struct virtio_crypto_akcipher_session_para *para)
                       ^
../drivers/crypto/virtio/virtio_cryptodev.c:1550:28: error: use of undeclared identifier 'VIRTIO_CRYPTO_RSA_SHA256'
                        para->u.rsa.hash_algo = VIRTIO_CRYPTO_RSA_SHA256;
                                                ^
../drivers/crypto/virtio/virtio_cryptodev.c:1553:8: error: incomplete definition of type 'struct virtio_crypto_akcipher_session_para'
                        para->u.rsa.hash_algo = VIRTIO_CRYPTO_RSA_SHA512;
                        ~~~~^
../drivers/crypto/virtio/virtio_cryptodev.c:1530:10: note: forward declaration of 'struct virtio_crypto_akcipher_session_para'
                struct virtio_crypto_akcipher_session_para *para)
                       ^
fatal error: too many errors emitted, stopping now [-ferror-limit=]
20 errors generated.
[2588/6679] Compiling C object drivers/libtmp_rte_crypto_scheduler.a.p/crypto_scheduler_scheduler_roundrobin.c.o
[2589/6679] Compiling C object drivers/libtmp_rte_crypto_scheduler.a.p/crypto_scheduler_scheduler_multicore.c.o
[2590/6679] Compiling C object drivers/libtmp_rte_crypto_scheduler.a.p/crypto_scheduler_rte_cryptodev_scheduler.c.o
[2591/6679] Compiling C object drivers/libtmp_rte_crypto_octeontx.a.p/crypto_octeontx_otx_cryptodev_ops.c.o
[2592/6679] Compiling C object drivers/libtmp_rte_crypto_cnxk.a.p/crypto_cnxk_cn10k_cryptodev_ops.c.o
ninja: build stopped: subcommand failed.
##[error]Process completed with exit code 1.
####################################################################################
#### [End job log] "ubuntu-22.04-clang-asan+doc+tests" at step Build and test
####################################################################################




####################################################################################
#### [Begin job log] "ubuntu-22.04-gcc-static-i386" at step Build and test
####################################################################################
      |                                                   ^~~~~~~~~~~~~~~~~~~~~~~~~~~~~~
      |                                                   VIRTIO_CRYPTO_CIPHER_ENCRYPT
../drivers/crypto/virtio/virtio_rxtx.c:615:36: error: ‘union <anonymous>’ has no member named ‘akcipher_req’
  615 |                         req_data->u.akcipher_req.para.src_data_len
      |                                    ^
../drivers/crypto/virtio/virtio_rxtx.c:617:36: error: ‘union <anonymous>’ has no member named ‘akcipher_req’
  617 |                         req_data->u.akcipher_req.para.dst_data_len
      |                                    ^
../drivers/crypto/virtio/virtio_rxtx.c:620:51: error: ‘VIRTIO_CRYPTO_AKCIPHER_DECRYPT’ undeclared (first use in this function); did you mean ‘VIRTIO_CRYPTO_CIPHER_DECRYPT’?
  620 |                         req_data->header.opcode = VIRTIO_CRYPTO_AKCIPHER_DECRYPT;
      |                                                   ^~~~~~~~~~~~~~~~~~~~~~~~~~~~~~
      |                                                   VIRTIO_CRYPTO_CIPHER_DECRYPT
../drivers/crypto/virtio/virtio_rxtx.c:621:36: error: ‘union <anonymous>’ has no member named ‘akcipher_req’
  621 |                         req_data->u.akcipher_req.para.src_data_len
      |                                    ^
../drivers/crypto/virtio/virtio_rxtx.c:623:36: error: ‘union <anonymous>’ has no member named ‘akcipher_req’
  623 |                         req_data->u.akcipher_req.para.dst_data_len
      |                                    ^
../drivers/crypto/virtio/virtio_rxtx.c:631:41: error: ‘VIRTIO_CRYPTO_NO_AKCIPHER’ undeclared (first use in this function); did you mean ‘VIRTIO_CRYPTO_NO_CIPHER’?
  631 |                 req_data->header.algo = VIRTIO_CRYPTO_NO_AKCIPHER;
      |                                         ^~~~~~~~~~~~~~~~~~~~~~~~~
      |                                         VIRTIO_CRYPTO_NO_CIPHER
[1753/5612] Compiling C object drivers/libtmp_rte_crypto_virtio.a.p/crypto_virtio_virtqueue.c.o
ninja: build stopped: subcommand failed.
##[error]Process completed with exit code 1.
####################################################################################
#### [End job log] "ubuntu-22.04-gcc-static-i386" at step Build and test
####################################################################################




####################################################################################
#### [Begin job log] "ubuntu-22.04-gcc-shared-aarch64" at step Build and test
####################################################################################
      |                                                                             ^~~~
      |                                                                             |
      |                                                                             struct virtio_crypto_akcipher_session_para *
../drivers/crypto/virtio/virtio_cryptodev.c:1530:61: note: expected ‘struct virtio_crypto_akcipher_session_para *’ but argument is of type ‘struct virtio_crypto_akcipher_session_para *’
 1530 |                 struct virtio_crypto_akcipher_session_para *para)
      |                 ~~~~~~~~~~~~~~~~~~~~~~~~~~~~~~~~~~~~~~~~~~~~^~~~
../drivers/crypto/virtio/virtio_cryptodev.c:1616:29: error: ‘union <anonymous>’ has no member named ‘akcipher_create_session’; did you mean ‘hash_create_session’?
 1616 |                 ctrl_req->u.akcipher_create_session.para.keylen = ret;
      |                             ^~~~~~~~~~~~~~~~~~~~~~~
      |                             hash_create_session
../drivers/crypto/virtio/virtio_cryptodev.c:1619:21: error: invalid use of undefined type ‘struct virtio_crypto_akcipher_session_para’
 1619 |                 para->algo = VIRTIO_CRYPTO_NO_AKCIPHER;
      |                     ^~
../drivers/crypto/virtio/virtio_cryptodev.c:1619:30: error: ‘VIRTIO_CRYPTO_NO_AKCIPHER’ undeclared (first use in this function); did you mean ‘VIRTIO_CRYPTO_NO_CIPHER’?
 1619 |                 para->algo = VIRTIO_CRYPTO_NO_AKCIPHER;
      |                              ^~~~~~~~~~~~~~~~~~~~~~~~~
      |                              VIRTIO_CRYPTO_NO_CIPHER
cc1: all warnings being treated as errors
[2413/6644] Compiling C object drivers/libtmp_rte_crypto_virtio.a.p/crypto_virtio_virtio_pci.c.o
[2414/6644] Compiling C object drivers/libtmp_rte_crypto_scheduler.a.p/crypto_scheduler_scheduler_multicore.c.o
[2415/6644] Compiling C object drivers/libtmp_rte_crypto_virtio.a.p/crypto_virtio_virtqueue.c.o
[2416/6644] Compiling C object drivers/libtmp_rte_crypto_octeontx.a.p/crypto_octeontx_otx_cryptodev_ops.c.o
[2417/6644] Compiling C object drivers/libtmp_rte_crypto_cnxk.a.p/crypto_cnxk_cn10k_cryptodev_ops.c.o
ninja: build stopped: subcommand failed.
##[error]Process completed with exit code 1.
####################################################################################
#### [End job log] "ubuntu-22.04-gcc-shared-aarch64" at step Build and test
####################################################################################




####################################################################################
#### [Begin job log] "ubuntu-22.04-gcc-ppc64le" at step Build and test
####################################################################################
      |                                                                             ^~~~
      |                                                                             |
      |                                                                             struct virtio_crypto_akcipher_session_para *
../drivers/crypto/virtio/virtio_cryptodev.c:1530:61: note: expected ‘struct virtio_crypto_akcipher_session_para *’ but argument is of type ‘struct virtio_crypto_akcipher_session_para *’
 1530 |                 struct virtio_crypto_akcipher_session_para *para)
      |                 ~~~~~~~~~~~~~~~~~~~~~~~~~~~~~~~~~~~~~~~~~~~~^~~~
../drivers/crypto/virtio/virtio_cryptodev.c:1616:29: error: ‘union <anonymous>’ has no member named ‘akcipher_create_session’; did you mean ‘hash_create_session’?
 1616 |                 ctrl_req->u.akcipher_create_session.para.keylen = ret;
      |                             ^~~~~~~~~~~~~~~~~~~~~~~
      |                             hash_create_session
../drivers/crypto/virtio/virtio_cryptodev.c:1619:21: error: invalid use of undefined type ‘struct virtio_crypto_akcipher_session_para’
 1619 |                 para->algo = VIRTIO_CRYPTO_NO_AKCIPHER;
      |                     ^~
../drivers/crypto/virtio/virtio_cryptodev.c:1619:30: error: ‘VIRTIO_CRYPTO_NO_AKCIPHER’ undeclared (first use in this function); did you mean ‘VIRTIO_CRYPTO_NO_CIPHER’?
 1619 |                 para->algo = VIRTIO_CRYPTO_NO_AKCIPHER;
      |                              ^~~~~~~~~~~~~~~~~~~~~~~~~
      |                              VIRTIO_CRYPTO_NO_CIPHER
cc1: all warnings being treated as errors
[2035/5916] Compiling C object drivers/libtmp_rte_crypto_scheduler.a.p/crypto_scheduler_scheduler_roundrobin.c.o
[2036/5916] Compiling C object drivers/libtmp_rte_crypto_scheduler.a.p/crypto_scheduler_scheduler_multicore.c.o
[2037/5916] Compiling C object drivers/libtmp_rte_crypto_cnxk.a.p/crypto_cnxk_cn9k_cryptodev_ops.c.o
[2038/5916] Compiling C object drivers/libtmp_rte_crypto_octeontx.a.p/crypto_octeontx_otx_cryptodev_ops.c.o
[2039/5916] Compiling C object drivers/libtmp_rte_crypto_cnxk.a.p/crypto_cnxk_cn10k_cryptodev_ops.c.o
ninja: build stopped: subcommand failed.
##[error]Process completed with exit code 1.
####################################################################################
#### [End job log] "ubuntu-22.04-gcc-ppc64le" at step Build and test
####################################################################################




####################################################################################
#### [Begin job log] "ubuntu-22.04-gcc-riscv64" at step Build and test
####################################################################################
      |                                                                             ^~~~
      |                                                                             |
      |                                                                             struct virtio_crypto_akcipher_session_para *
../drivers/crypto/virtio/virtio_cryptodev.c:1530:61: note: expected ‘struct virtio_crypto_akcipher_session_para *’ but argument is of type ‘struct virtio_crypto_akcipher_session_para *’
 1530 |                 struct virtio_crypto_akcipher_session_para *para)
      |                 ~~~~~~~~~~~~~~~~~~~~~~~~~~~~~~~~~~~~~~~~~~~~^~~~
../drivers/crypto/virtio/virtio_cryptodev.c:1616:29: error: ‘union <anonymous>’ has no member named ‘akcipher_create_session’; did you mean ‘hash_create_session’?
 1616 |                 ctrl_req->u.akcipher_create_session.para.keylen = ret;
      |                             ^~~~~~~~~~~~~~~~~~~~~~~
      |                             hash_create_session
../drivers/crypto/virtio/virtio_cryptodev.c:1619:21: error: invalid use of undefined type ‘struct virtio_crypto_akcipher_session_para’
 1619 |                 para->algo = VIRTIO_CRYPTO_NO_AKCIPHER;
      |                     ^~
../drivers/crypto/virtio/virtio_cryptodev.c:1619:30: error: ‘VIRTIO_CRYPTO_NO_AKCIPHER’ undeclared (first use in this function); did you mean ‘VIRTIO_CRYPTO_NO_CIPHER’?
 1619 |                 para->algo = VIRTIO_CRYPTO_NO_AKCIPHER;
      |                              ^~~~~~~~~~~~~~~~~~~~~~~~~
      |                              VIRTIO_CRYPTO_NO_CIPHER
cc1: all warnings being treated as errors
[1999/5887] Compiling C object drivers/libtmp_rte_crypto_virtio.a.p/crypto_virtio_virtio_user_vhost_vdpa.c.o
[2000/5887] Generating rte_crypto_dpaa2_sec.pmd.c with a custom command
[2001/5887] Generating rte_crypto_scheduler.pmd.c with a custom command
[2002/5887] Compiling C object drivers/libtmp_rte_crypto_octeontx.a.p/crypto_octeontx_otx_cryptodev_ops.c.o
[2003/5887] Compiling C object drivers/libtmp_rte_crypto_cnxk.a.p/crypto_cnxk_cn10k_cryptodev_ops.c.o
ninja: build stopped: subcommand failed.
##[error]Process completed with exit code 1.
####################################################################################
#### [End job log] "ubuntu-22.04-gcc-riscv64" at step Build and test
####################################################################################




####################################################################################
#### [Begin job log] "fedora:39-gcc" at step Build
####################################################################################
####################################################################################
#### [End job log] "fedora:39-gcc" at step Build
####################################################################################




####################################################################################
#### [Begin job log] "fedora:39-clang" at step Build
####################################################################################
####################################################################################
#### [End job log] "fedora:39-clang" at step Build
####################################################################################
--------------------------------END LOGS-----------------------------

^ permalink raw reply	[flat|nested] 3+ messages in thread

* |WARNING| pw152111-152116 [PATCH] [v5, 6/6] test/crypto: add tests for virtio user PMD
       [not found] <ed9c5de18b1be2fb9830c3b4432360079c43d9bb.1740595670.git.gmuthukrishn@marvell.com>
  2025-02-26 19:00 ` |SUCCESS| pw152116 [v5 6/6] test/crypto: add tests for virtio user PMD checkpatch
  2025-02-26 23:25 ` |FAILURE| " 0-day Robot
@ 2025-02-27  5:50 ` dpdklab
  2 siblings, 0 replies; 3+ messages in thread
From: dpdklab @ 2025-02-27  5:50 UTC (permalink / raw)
  To: test-report; +Cc: dpdk-test-reports

Test-Label: iol-testing
Test-Status: WARNING
http://dpdk.org/patch/152111

_apply patch failure_

Submitter: Gowrishankar Muthukrishnan <gmuthukrishn@marvell.com>
Date: Wednesday, February 26 2025 18:58:18 
Applied on: CommitID:fab31a03ba98e7457284df95dd9eef2223a4ccaa
Apply patch set 152111-152116 failed:


<!doctype html>
<html lang="en">
<head>
  <title>Not Found</title>
</head>
<body>
  <h1>Not Found</h1><p>The requested resource was not found on this server.</p>
</body>
</html>

https://lab.dpdk.org/results/dashboard/patchsets/32699/

UNH-IOL DPDK Community Lab

^ permalink raw reply	[flat|nested] 3+ messages in thread

end of thread, other threads:[~2025-02-27  5:50 UTC | newest]

Thread overview: 3+ messages (download: mbox.gz / follow: Atom feed)
-- links below jump to the message on this page --
     [not found] <ed9c5de18b1be2fb9830c3b4432360079c43d9bb.1740595670.git.gmuthukrishn@marvell.com>
2025-02-26 19:00 ` |SUCCESS| pw152116 [v5 6/6] test/crypto: add tests for virtio user PMD checkpatch
2025-02-26 23:25 ` |FAILURE| " 0-day Robot
2025-02-27  5:50 ` |WARNING| pw152111-152116 [PATCH] [v5, " dpdklab

This is a public inbox, see mirroring instructions
for how to clone and mirror all data and code used for this inbox;
as well as URLs for NNTP newsgroup(s).