automatic DPDK test reports
 help / color / mirror / Atom feed
From: dpdklab@iol.unh.edu
To: Test Report <test-report@dpdk.org>
Cc: dpdk-test-reports@iol.unh.edu,
	David Marchand <david.marchand@redhat.com>
Subject: |FAILURE| pw152662-152668 [PATCH] [v6,8/8] eal: rework function vers
Date: Fri, 28 Mar 2025 05:23:25 -0700 (PDT)	[thread overview]
Message-ID: <67e694bd.250a0220.b2581.4be9SMTPIN_ADDED_MISSING@mx.google.com> (raw)
In-Reply-To: <20250328105250.3082414-9-david.marchand@redhat.com>

Test-Label: iol-unit-amd64-testing
Test-Status: FAILURE
http://dpdk.org/patch/152668

_Testing issues_

Submitter: David Marchand <david.marchand@redhat.com>
Date: Friday, March 28 2025 10:52:45 
DPDK git baseline: Repo:dpdk
  Branch: master
  CommitID:edd3f4b1265e6da707c46ca9b6c39d332647baea

152662-152668 --> testing issues

Upstream job id: Generic-Unit-Test-DPDK#327345

Test environment and result as below:

+---------------------+----------------+
|     Environment     | dpdk_unit_test |
+=====================+================+
| Debian 12           | PASS           |
+---------------------+----------------+
| Fedora 40           | PASS           |
+---------------------+----------------+
| CentOS Stream 9     | PASS           |
+---------------------+----------------+
| CentOS Stream 10    | PASS           |
+---------------------+----------------+
| Fedora 40 (Clang)   | PASS           |
+---------------------+----------------+
| Fedora 41           | PASS           |
+---------------------+----------------+
| Fedora 41 (Clang)   | FAIL           |
+---------------------+----------------+
| Ubuntu 20.04        | PASS           |
+---------------------+----------------+
| Ubuntu 22.04        | PASS           |
+---------------------+----------------+
| Ubuntu 24.04        | PASS           |
+---------------------+----------------+
| RHEL8               | PASS           |
+---------------------+----------------+
| RHEL9               | PASS           |
+---------------------+----------------+
| Windows Server 2022 | PASS           |
+---------------------+----------------+

==== Unit test summary for Fedora 41 (Clang) (dpdk_unit_test): ====
ninja: Entering directory `/root/workspace/Generic-Unit-Test-DPDK/dpdk/build'
ninja: no work to do.
  1/119 DPDK:fast-tests / acl_autotest                   OK               2.47s
  2/119 DPDK:fast-tests / alarm_autotest                 OK               1.17s
  3/119 DPDK:fast-tests / argparse_autotest              OK               0.17s
  4/119 DPDK:fast-tests / atomic_autotest                OK               0.34s
  5/119 DPDK:fast-tests / bitcount_autotest              OK               0.18s
  6/119 DPDK:fast-tests / bitmap_autotest                OK               0.17s
  7/119 DPDK:fast-tests / bitops_autotest                OK               1.67s
  8/119 DPDK:fast-tests / bitratestats_autotest          OK               0.17s
  9/119 DPDK:fast-tests / bitset_autotest                OK               1.15s
 10/119 DPDK:fast-tests / bpf_autotest                   OK               0.17s
 11/119 DPDK:fast-tests / bpf_convert_autotest           OK               0.17s
 12/119 DPDK:fast-tests / byteorder_autotest             OK               0.17s
 13/119 DPDK:fast-tests / cfgfile_autotest               OK               0.17s
 14/119 DPDK:fast-tests / cksum_autotest                 OK               0.17s
 15/119 DPDK:fast-tests / cmdline_autotest               OK               0.17s
 16/119 DPDK:fast-tests / common_autotest                OK               0.38s
 17/119 DPDK:fast-tests / compressdev_autotest           SKIP             0.14s   exit status 77
 18/119 DPDK:fast-tests / cpuflags_autotest              OK               0.17s
 19/119 DPDK:fast-tests / crc_autotest                   OK               0.17s
 20/119 DPDK:fast-tests / user_delay_us                  OK               0.17s
 21/119 DPDK:fast-tests / debug_autotest                 OK               0.43s
 22/119 DPDK:fast-tests / devargs_autotest               OK               0.17s
 23/119 DPDK:fast-tests / dispatcher_autotest            SKIP             0.14s   exit status 77
 24/119 DPDK:fast-tests / distributor_autotest           OK               0.83s
 25/119 DPDK:fast-tests / eal_flags_c_opt_autotest       OK               0.79s
 26/119 DPDK:fast-tests / eal_flags_main_opt_autotest    OK               0.30s
 27/119 DPDK:fast-tests / eal_flags_n_opt_autotest       OK               0.47s
 28/119 DPDK:fast-tests / eal_flags_hpet_autotest        OK               0.20s
 29/119 DPDK:fast-tests / eal_flags_no_huge_autotest     OK               0.51s
 30/119 DPDK:fast-tests / eal_flags_a_opt_autotest       OK               0.39s
 31/119 DPDK:fast-tests / eal_flags_b_opt_autotest       OK               0.32s
 32/119 DPDK:fast-tests / eal_flags_vdev_opt_autotest    OK               0.57s
 33/119 DPDK:fast-tests / eal_flags_r_opt_autotest       OK               0.26s
 34/119 DPDK:fast-tests / eal_flags_mem_autotest         OK               0.73s
 35/119 DPDK:fast-tests / eal_flags_file_prefix_autotest OK               3.07s
 36/119 DPDK:fast-tests / eal_flags_misc_autotest        FAIL             2.24s   killed by signal 11 SIGSEGV
>>> DPDK_TEST=eal_flags_misc_autotest MALLOC_PERTURB_=168 /root/workspace/Generic-Unit-Test-DPDK/dpdk/build/app/dpdk-test

 37/119 DPDK:fast-tests / eal_fs_autotest                OK               0.18s
 38/119 DPDK:fast-tests / errno_autotest                 OK               0.17s
 39/119 DPDK:fast-tests / ethdev_link_status             OK               0.17s
 40/119 DPDK:fast-tests / event_eth_tx_adapter_autotest  OK               0.47s
 41/119 DPDK:fast-tests / event_ring_autotest            OK               0.17s
 42/119 DPDK:fast-tests / eventdev_common_autotest       OK               0.17s
 43/119 DPDK:fast-tests / eventdev_selftest_sw           OK               0.21s
 44/119 DPDK:fast-tests / fbarray_autotest               OK               0.17s
 45/119 DPDK:fast-tests / fib_autotest                   OK               0.88s
 46/119 DPDK:fast-tests / fib6_autotest                  OK               0.76s
 47/119 DPDK:fast-tests / func_reentrancy_autotest       OK               0.52s
 48/119 DPDK:fast-tests / graph_autotest                 OK               0.17s
 49/119 DPDK:fast-tests / node_list_dump                 OK               0.17s
 50/119 DPDK:fast-tests / hash_autotest                  OK               0.28s
 51/119 DPDK:fast-tests / hash_readwrite_func_autotest   SKIP             0.14s   exit status 77
 52/119 DPDK:fast-tests / interrupt_autotest             OK               1.22s
 53/119 DPDK:fast-tests / ipfrag_autotest                OK               0.14s
 54/119 DPDK:fast-tests / ipsec_autotest                 SKIP             0.17s   exit status 77
 55/119 DPDK:fast-tests / kvargs_autotest                OK               0.17s
 56/119 DPDK:fast-tests / latencystats_autotest          OK               0.17s
 57/119 DPDK:fast-tests / lcore_var_autotest             OK               0.31s
 58/119 DPDK:fast-tests / lcores_autotest                OK               0.72s
 59/119 DPDK:fast-tests / logs_autotest                  OK               0.17s
 60/119 DPDK:fast-tests / lpm_autotest                   OK               2.50s
 61/119 DPDK:fast-tests / lpm6_autotest                  OK               3.75s
 62/119 DPDK:fast-tests / malloc_autotest                OK               0.40s
 63/119 DPDK:fast-tests / mbuf_autotest                  OK               0.22s
 64/119 DPDK:fast-tests / mcslock_autotest               OK               0.92s
 65/119 DPDK:fast-tests / member_autotest                OK               1.39s
 66/119 DPDK:fast-tests / memcpy_autotest                OK               2.84s
 67/119 DPDK:fast-tests / memory_autotest                OK               0.15s
 68/119 DPDK:fast-tests / mempool_autotest               OK               0.47s
 69/119 DPDK:fast-tests / memzone_autotest               OK               0.16s
 70/119 DPDK:fast-tests / meter_autotest                 OK               0.20s
 71/119 DPDK:fast-tests / metrics_autotest               OK               0.19s
 72/119 DPDK:fast-tests / multiprocess_autotest          OK               0.39s
 73/119 DPDK:fast-tests / net_ether_autotest             OK               0.76s
 74/119 DPDK:fast-tests / net_ipv6_autotest              OK               0.19s
 75/119 DPDK:fast-tests / pcapng_autotest                OK               6.93s
 76/119 DPDK:fast-tests / pdcp_autotest                  SKIP             0.15s   exit status 77
 77/119 DPDK:fast-tests / pdump_autotest                 OK               0.42s
 78/119 DPDK:fast-tests / per_lcore_autotest             OK               0.30s
 79/119 DPDK:fast-tests / pflock_autotest                OK               0.30s
 80/119 DPDK:fast-tests / pie_autotest                   OK               0.19s
 81/119 DPDK:fast-tests / ring_pmd_autotest              OK               0.18s
 82/119 DPDK:fast-tests / power_autotest                 OK               0.18s
 83/119 DPDK:fast-tests / power_cpufreq_autotest         SKIP             0.15s   exit status 77
 84/119 DPDK:fast-tests / power_intel_uncore_autotest    SKIP             0.19s   exit status 77
 85/119 DPDK:fast-tests / power_kvm_vm_autotest          SKIP             0.16s   exit status 77
 86/119 DPDK:fast-tests / prefetch_autotest              OK               0.19s
 87/119 DPDK:fast-tests / ptr_compress_autotest          OK               0.18s
 88/119 DPDK:fast-tests / rawdev_autotest                OK               0.18s
 89/119 DPDK:fast-tests / rcu_qsbr_autotest              OK               0.29s
 90/119 DPDK:fast-tests / reorder_autotest               OK               0.42s
 91/119 DPDK:fast-tests / rib_autotest                   OK               8.65s
 92/119 DPDK:fast-tests / rib6_autotest                  OK               8.36s
 93/119 DPDK:fast-tests / ring_autotest                  OK               0.17s
 94/119 DPDK:fast-tests / rwlock_test1_autotest          OK               0.27s
 95/119 DPDK:fast-tests / rwlock_rda_autotest            OK               5.17s
 96/119 DPDK:fast-tests / rwlock_rds_wrm_autotest        OK               5.17s
 97/119 DPDK:fast-tests / rwlock_rde_wro_autotest        OK               5.21s
 98/119 DPDK:fast-tests / sched_autotest                 OK               0.17s
 99/119 DPDK:fast-tests / security_autotest              OK               0.16s
100/119 DPDK:fast-tests / seqlock_autotest               SKIP             0.17s   exit status 77
101/119 DPDK:fast-tests / service_autotest               OK               0.27s
102/119 DPDK:fast-tests / soring_autotest                OK               0.19s
103/119 DPDK:fast-tests / spinlock_autotest              OK               0.19s
104/119 DPDK:fast-tests / stack_autotest                 OK               0.18s
105/119 DPDK:fast-tests / stack_lf_autotest              OK               0.23s
106/119 DPDK:fast-tests / string_autotest                OK               0.19s
107/119 DPDK:fast-tests / table_autotest                 OK               5.31s
108/119 DPDK:fast-tests / tailq_autotest                 OK               0.17s
109/119 DPDK:fast-tests / telemetry_data_autotest        OK               0.16s
110/119 DPDK:fast-tests / telemetry_json_autotest        OK               0.17s
111/119 DPDK:fast-tests / thash_autotest                 OK               0.17s
112/119 DPDK:fast-tests / threads_autotest               OK               0.33s
113/119 DPDK:fast-tests / ticketlock_autotest            OK               0.18s
114/119 DPDK:fast-tests / timer_autotest                 OK               2.48s
115/119 DPDK:fast-tests / trace_autotest                 OK               0.18s
116/119 DPDK:fast-tests / trace_autotest_with_traces     OK               0.18s
117/119 DPDK:fast-tests / vdev_autotest                  OK               0.17s
118/119 DPDK:fast-tests / version_autotest               OK               0.17s
119/119 DPDK:fast-tests / telemetry_all                  SKIP             0.01s   exit status 77


Ok:                 108 
Expected Fail:      0   
Fail:               1   
Unexpected Pass:    0   
Skipped:            10  
Timeout:            0   

Full log written to /root/workspace/Generic-Unit-Test-DPDK/dpdk/build/meson-logs/testlog.txt



Test log output from the failed test eal_flags_misc_autotest:

Sorry, we were not able to find the logs for this test.
Download the log output from the CI site for this test run.
==== End log output ====

Debian 12
	Kernel: Depends on container host
	Compiler: gcc (Debian 12.2.0-14) 12.2.0

Fedora 40
	Kernel: Depends on container host
	Compiler: gcc 14.2.1 20240912 (Red Hat 14.2.1-3)

CentOS Stream 9
	Kernel: Depends on container host
	Compiler: gcc 11.5.0 20240719 (Red Hat 11.5.0-2)

CentOS Stream 10
	Kernel: Depends on container host
	Compiler: gcc 14.2.1 20241104 (Red Hat 14.2.1-6)

Fedora 40 (Clang)
	Kernel: Depends on container host
	Compiler: clang 18.1.8 (Fedora 18.1.8-1.fc40)

Fedora 41
	Kernel: Depends on container host
	Compiler: gcc 14.2.1 20240912 (Red Hat 14.2.1-3)

Fedora 41 (Clang)
	Kernel: Depends on container host
	Compiler: clang 19.1.5 (Fedora 19.1.5-1.fc41)

Ubuntu 20.04
	Kernel: Depends on container host
	Compiler: gcc (Ubuntu 9.4.0-1ubuntu1~20.04.2) 9.4.0

Ubuntu 22.04
	Kernel: Depends on container host
	Compiler: gcc (Ubuntu 11.4.0-1ubuntu1~22.04) 11.4.0

Ubuntu 24.04
	Kernel: Depends on container host
	Compiler: gcc (Ubuntu 13.3.0-6ubuntu2~24.04) 13.3.0

RHEL8
	Kernel: Depends on container host
	Compiler: gcc 8.5.0 20210514 (Red Hat 8.5.0-22)

RHEL9
	Kernel: Depends on container host
	Compiler: gcc 11.5.0 20240719 (Red Hat 11.5.0-2)

Windows Server 2022
	Kernel: 10.0.20348.2031
	Compiler: clang 15.0.7, gcc 14.1.0 (MinGW), and MSVC VS 19.39.33521

To view detailed results, visit:
https://lab.dpdk.org/results/dashboard/patchsets/32909/

UNH-IOL DPDK Community Lab

To manage your email subscriptions, visit: 
https://lab.dpdk.org/results/dashboard/preferences/subscriptions/

  parent reply	other threads:[~2025-03-28 12:23 UTC|newest]

Thread overview: 24+ messages / expand[flat|nested]  mbox.gz  Atom feed  top
     [not found] <20250328105250.3082414-9-david.marchand@redhat.com>
2025-03-28 10:50 ` |SUCCESS| pw152662-152668 [PATCH v6 8/8] eal: rework function versioning macros qemudev
2025-03-28 10:54 ` qemudev
2025-03-28 10:56 ` |WARNING| pw152668 " checkpatch
2025-03-28 11:25 ` |SUCCESS| pw152662-152668 [PATCH] [v6,8/8] eal: rework function vers dpdklab
2025-03-28 11:44 ` dpdklab
2025-03-28 11:46 ` |PENDING| " dpdklab
2025-03-28 11:52 ` dpdklab
2025-03-28 11:57 ` |SUCCESS| " dpdklab
2025-03-28 11:58 ` |PENDING| " dpdklab
2025-03-28 12:02 ` |SUCCESS| " dpdklab
2025-03-28 12:03 ` |SUCCESS| pw152668 [PATCH v6 8/8] eal: rework function versioning macros 0-day Robot
2025-03-28 12:14 ` |SUCCESS| pw152662-152668 [PATCH] [v6,8/8] eal: rework function vers dpdklab
2025-03-28 12:21 ` dpdklab
2025-03-28 12:21 ` dpdklab
2025-03-28 12:21 ` dpdklab
2025-03-28 12:23 ` |FAILURE| " dpdklab
2025-03-28 12:23 ` dpdklab [this message]
2025-03-28 12:31 ` |SUCCESS| " dpdklab
2025-03-28 12:33 ` dpdklab
2025-03-28 12:49 ` dpdklab
2025-03-28 12:50 ` dpdklab
2025-03-28 14:13 ` dpdklab
2025-03-28 21:51 ` dpdklab
2025-03-29  8:59 ` dpdklab

Reply instructions:

You may reply publicly to this message via plain-text email
using any one of the following methods:

* Save the following mbox file, import it into your mail client,
  and reply-to-all from there: mbox

  Avoid top-posting and favor interleaved quoting:
  https://en.wikipedia.org/wiki/Posting_style#Interleaved_style

* Reply using the --to, --cc, and --in-reply-to
  switches of git-send-email(1):

  git send-email \
    --in-reply-to=67e694bd.250a0220.b2581.4be9SMTPIN_ADDED_MISSING@mx.google.com \
    --to=dpdklab@iol.unh.edu \
    --cc=david.marchand@redhat.com \
    --cc=dpdk-test-reports@iol.unh.edu \
    --cc=test-report@dpdk.org \
    /path/to/YOUR_REPLY

  https://kernel.org/pub/software/scm/git/docs/git-send-email.html

* If your mail client supports setting the In-Reply-To header
  via mailto: links, try the mailto: link
Be sure your reply has a Subject: header at the top and a blank line before the message body.
This is a public inbox, see mirroring instructions
for how to clone and mirror all data and code used for this inbox;
as well as URLs for NNTP newsgroup(s).