From: dpdklab@iol.unh.edu
To: Test Report <test-report@dpdk.org>
Cc: dpdk-test-reports@iol.unh.edu,
Nithin Dabilpuram <ndabilpuram@marvell.com>
Subject: |FAILURE| pw152750-152753 [PATCH] [RFC,4/4] net/cnxk: report link ty
Date: Thu, 03 Apr 2025 04:41:25 -0700 (PDT) [thread overview]
Message-ID: <67ee73e5.050a0220.1677ac.2b64SMTPIN_ADDED_MISSING@mx.google.com> (raw)
In-Reply-To: <20250403070837.926292-4-ndabilpuram@marvell.com>
Test-Label: iol-unit-arm64-testing
Test-Status: FAILURE
http://dpdk.org/patch/152753
_Testing issues_
Submitter: Nithin Dabilpuram <ndabilpuram@marvell.com>
Date: Thursday, April 03 2025 07:08:37
DPDK git baseline: Repo:dpdk
Branch: master
CommitID:b40c403777e93242a377c07ff51964480d40b51d
152750-152753 --> testing issues
Upstream job id: Generic-Unit-Test-DPDK#328618
Test environment and result as below:
+-----------------------------+----------------+--------------+------------------------------+---------------------------+
| Environment | dpdk_unit_test | lpm_autotest | cryptodev_sw_snow3g_autotest | cryptodev_sw_zuc_autotest |
+=============================+================+==============+==============================+===========================+
| CentOS Stream 9 (ARM) | FAIL | SKIPPED | SKIPPED | SKIPPED |
+-----------------------------+----------------+--------------+------------------------------+---------------------------+
| Fedora 40 (ARM) | FAIL | SKIPPED | SKIPPED | SKIPPED |
+-----------------------------+----------------+--------------+------------------------------+---------------------------+
| 32-bit Ubuntu 22.04.4 (ARM) | PASS | SKIPPED | SKIPPED | SKIPPED |
+-----------------------------+----------------+--------------+------------------------------+---------------------------+
| CentOS Stream 10 (ARM) | FAIL | SKIPPED | SKIPPED | SKIPPED |
+-----------------------------+----------------+--------------+------------------------------+---------------------------+
| Debian 12 (arm) | FAIL | SKIPPED | PASS | PASS |
+-----------------------------+----------------+--------------+------------------------------+---------------------------+
| Fedora 40 (ARM Clang) | FAIL | SKIPPED | SKIPPED | SKIPPED |
+-----------------------------+----------------+--------------+------------------------------+---------------------------+
| Fedora 41 (ARM) | FAIL | SKIPPED | SKIPPED | SKIPPED |
+-----------------------------+----------------+--------------+------------------------------+---------------------------+
| Fedora 41 (ARM Clang) | FAIL | SKIPPED | SKIPPED | SKIPPED |
+-----------------------------+----------------+--------------+------------------------------+---------------------------+
| Ubuntu 20.04 (ARM) | FAIL | SKIPPED | SKIPPED | SKIPPED |
+-----------------------------+----------------+--------------+------------------------------+---------------------------+
| Ubuntu 22.04 (ARM) | FAIL | SKIPPED | SKIPPED | SKIPPED |
+-----------------------------+----------------+--------------+------------------------------+---------------------------+
| RHEL9 (ARM) | FAIL | SKIPPED | SKIPPED | SKIPPED |
+-----------------------------+----------------+--------------+------------------------------+---------------------------+
| Ubuntu 24.04 (ARM) | FAIL | SKIPPED | SKIPPED | SKIPPED |
+-----------------------------+----------------+--------------+------------------------------+---------------------------+
| Ubuntu 20.04 ARM SVE | SKIPPED | PASS | SKIPPED | SKIPPED |
+-----------------------------+----------------+--------------+------------------------------+---------------------------+
==== Unit test summary for Ubuntu 24.04 (ARM) (dpdk_unit_test): ====
ninja: Entering directory `/home-local/jenkins-local/jenkins-agent/workspace/Generic-Unit-Test-DPDK/dpdk/build'
ninja: no work to do.
1/119 DPDK:fast-tests / acl_autotest OK 6.46s
2/119 DPDK:fast-tests / alarm_autotest OK 1.17s
3/119 DPDK:fast-tests / argparse_autotest OK 0.16s
4/119 DPDK:fast-tests / atomic_autotest OK 4.62s
5/119 DPDK:fast-tests / bitcount_autotest OK 0.18s
6/119 DPDK:fast-tests / bitmap_autotest OK 0.17s
7/119 DPDK:fast-tests / bitops_autotest OK 1.67s
8/119 DPDK:fast-tests / bitratestats_autotest OK 0.17s
9/119 DPDK:fast-tests / bitset_autotest OK 2.71s
10/119 DPDK:fast-tests / bpf_autotest OK 0.16s
11/119 DPDK:fast-tests / bpf_convert_autotest OK 0.17s
12/119 DPDK:fast-tests / byteorder_autotest OK 0.17s
13/119 DPDK:fast-tests / cfgfile_autotest OK 0.16s
14/119 DPDK:fast-tests / cksum_autotest OK 0.16s
15/119 DPDK:fast-tests / cmdline_autotest OK 0.17s
16/119 DPDK:fast-tests / common_autotest OK 1.07s
17/119 DPDK:fast-tests / compressdev_autotest SKIP 0.09s exit status 77
18/119 DPDK:fast-tests / cpuflags_autotest OK 0.19s
19/119 DPDK:fast-tests / crc_autotest OK 0.16s
20/119 DPDK:fast-tests / user_delay_us OK 0.16s
21/119 DPDK:fast-tests / debug_autotest OK 0.90s
22/119 DPDK:fast-tests / devargs_autotest OK 0.17s
23/119 DPDK:fast-tests / dispatcher_autotest OK 2.61s
24/119 DPDK:fast-tests / distributor_autotest OK 0.81s
25/119 DPDK:fast-tests / eal_flags_c_opt_autotest OK 1.72s
26/119 DPDK:fast-tests / eal_flags_main_opt_autotest OK 0.55s
27/119 DPDK:fast-tests / eal_flags_n_opt_autotest OK 0.42s
28/119 DPDK:fast-tests / eal_flags_hpet_autotest OK 0.26s
29/119 DPDK:fast-tests / eal_flags_no_huge_autotest OK 0.47s
30/119 DPDK:fast-tests / eal_flags_a_opt_autotest OK 0.67s
31/119 DPDK:fast-tests / eal_flags_b_opt_autotest OK 0.55s
32/119 DPDK:fast-tests / eal_flags_vdev_opt_autotest OK 0.41s
33/119 DPDK:fast-tests / eal_flags_r_opt_autotest OK 0.40s
34/119 DPDK:fast-tests / eal_flags_mem_autotest OK 0.60s
35/119 DPDK:fast-tests / eal_flags_file_prefix_autotest OK 1.63s
36/119 DPDK:fast-tests / eal_flags_misc_autotest OK 2.15s
37/119 DPDK:fast-tests / eal_fs_autotest OK 0.26s
38/119 DPDK:fast-tests / errno_autotest OK 0.20s
39/119 DPDK:fast-tests / ethdev_link_status FAIL 0.16s (exit status 255 or signal 127 SIGinvalid)
>>> DPDK_TEST=ethdev_link_status MALLOC_PERTURB_=181 /home-local/jenkins-local/jenkins-agent/workspace/Generic-Unit-Test-DPDK/dpdk/build/app/dpdk-test --no-huge -m 2048
40/119 DPDK:fast-tests / event_eth_tx_adapter_autotest OK 1.16s
41/119 DPDK:fast-tests / event_ring_autotest OK 0.24s
42/119 DPDK:fast-tests / eventdev_common_autotest OK 0.21s
43/119 DPDK:fast-tests / eventdev_selftest_sw OK 10.78s
44/119 DPDK:fast-tests / fbarray_autotest OK 0.17s
45/119 DPDK:fast-tests / fib_autotest OK 1.18s
46/119 DPDK:fast-tests / fib6_autotest OK 1.08s
47/119 DPDK:fast-tests / func_reentrancy_autotest OK 0.78s
48/119 DPDK:fast-tests / graph_autotest OK 0.19s
49/119 DPDK:fast-tests / node_list_dump OK 0.18s
50/119 DPDK:fast-tests / hash_autotest OK 0.64s
51/119 DPDK:fast-tests / hash_readwrite_func_autotest OK 8.39s
52/119 DPDK:fast-tests / interrupt_autotest OK 1.21s
53/119 DPDK:fast-tests / ipfrag_autotest OK 0.11s
54/119 DPDK:fast-tests / ipsec_autotest SKIP 0.19s exit status 77
55/119 DPDK:fast-tests / kvargs_autotest OK 0.18s
56/119 DPDK:fast-tests / latencystats_autotest OK 0.19s
57/119 DPDK:fast-tests / lcore_var_autotest OK 0.81s
58/119 DPDK:fast-tests / lcores_autotest OK 4.89s
59/119 DPDK:fast-tests / logs_autotest OK 0.22s
60/119 DPDK:fast-tests / lpm_autotest OK 1.84s
61/119 DPDK:fast-tests / lpm6_autotest OK 6.54s
62/119 DPDK:fast-tests / malloc_autotest OK 0.48s
63/119 DPDK:fast-tests / mbuf_autotest OK 1.94s
64/119 DPDK:fast-tests / mcslock_autotest OK 0.91s
65/119 DPDK:fast-tests / member_autotest OK 2.23s
66/119 DPDK:fast-tests / memcpy_autotest OK 9.71s
67/119 DPDK:fast-tests / memory_autotest OK 0.15s
68/119 DPDK:fast-tests / mempool_autotest OK 0.60s
69/119 DPDK:fast-tests / memzone_autotest OK 0.12s
70/119 DPDK:fast-tests / meter_autotest OK 0.22s
71/119 DPDK:fast-tests / metrics_autotest OK 0.19s
72/119 DPDK:fast-tests / multiprocess_autotest OK 0.43s
73/119 DPDK:fast-tests / net_ether_autotest OK 1.37s
74/119 DPDK:fast-tests / net_ipv6_autotest OK 0.17s
75/119 DPDK:fast-tests / pcapng_autotest OK 7.46s
76/119 DPDK:fast-tests / pdcp_autotest SKIP 0.12s exit status 77
77/119 DPDK:fast-tests / pdump_autotest OK 0.51s
78/119 DPDK:fast-tests / per_lcore_autotest OK 0.33s
79/119 DPDK:fast-tests / pflock_autotest OK 0.55s
80/119 DPDK:fast-tests / pie_autotest OK 0.17s
81/119 DPDK:fast-tests / ring_pmd_autotest OK 0.18s
82/119 DPDK:fast-tests / power_autotest OK 0.17s
83/119 DPDK:fast-tests / power_cpufreq_autotest SKIP 0.10s exit status 77
84/119 DPDK:fast-tests / power_intel_uncore_autotest SKIP 0.23s exit status 77
85/119 DPDK:fast-tests / power_kvm_vm_autotest SKIP 0.10s exit status 77
86/119 DPDK:fast-tests / prefetch_autotest OK 0.23s
87/119 DPDK:fast-tests / ptr_compress_autotest OK 0.19s
88/119 DPDK:fast-tests / rawdev_autotest OK 0.18s
89/119 DPDK:fast-tests / rcu_qsbr_autotest OK 0.73s
90/119 DPDK:fast-tests / reorder_autotest OK 0.45s
91/119 DPDK:fast-tests / rib_autotest OK 4.15s
92/119 DPDK:fast-tests / rib6_autotest OK 4.32s
93/119 DPDK:fast-tests / ring_autotest OK 0.22s
94/119 DPDK:fast-tests / rwlock_test1_autotest OK 0.52s
95/119 DPDK:fast-tests / rwlock_rda_autotest OK 5.19s
96/119 DPDK:fast-tests / rwlock_rds_wrm_autotest OK 5.17s
97/119 DPDK:fast-tests / rwlock_rde_wro_autotest OK 5.18s
98/119 DPDK:fast-tests / sched_autotest OK 0.18s
99/119 DPDK:fast-tests / security_autotest OK 0.11s
100/119 DPDK:fast-tests / seqlock_autotest OK 2.25s
101/119 DPDK:fast-tests / service_autotest OK 3.13s
102/119 DPDK:fast-tests / soring_autotest OK 0.17s
103/119 DPDK:fast-tests / spinlock_autotest OK 0.20s
104/119 DPDK:fast-tests / stack_autotest OK 0.37s
105/119 DPDK:fast-tests / stack_lf_autotest OK 0.34s
106/119 DPDK:fast-tests / string_autotest OK 0.19s
107/119 DPDK:fast-tests / table_autotest OK 7.43s
108/119 DPDK:fast-tests / tailq_autotest OK 0.18s
109/119 DPDK:fast-tests / telemetry_data_autotest OK 0.18s
110/119 DPDK:fast-tests / telemetry_json_autotest OK 0.17s
111/119 DPDK:fast-tests / thash_autotest OK 0.20s
112/119 DPDK:fast-tests / threads_autotest OK 0.35s
113/119 DPDK:fast-tests / ticketlock_autotest OK 0.21s
114/119 DPDK:fast-tests / timer_autotest OK 2.87s
115/119 DPDK:fast-tests / trace_autotest OK 0.22s
116/119 DPDK:fast-tests / trace_autotest_with_traces OK 0.19s
117/119 DPDK:fast-tests / vdev_autotest OK 0.20s
118/119 DPDK:fast-tests / version_autotest OK 0.17s
119/119 DPDK:fast-tests / telemetry_all OK 1.55s
Ok: 112
Expected Fail: 0
Fail: 1
Unexpected Pass: 0
Skipped: 6
Timeout: 0
Full log written to /home-local/jenkins-local/jenkins-agent/workspace/Generic-Unit-Test-DPDK/dpdk/build/meson-logs/testlog.txt
Test log output from the failed test ethdev_link_status:
Sorry, we were not able to find the logs for this test.
Download the log output from the CI site for this test run.
==== End log output ====
CentOS Stream 9 (ARM)
Kernel: Depends on container host
Compiler: gcc 11.5.0 20240719 (Red Hat 11.5.0-2)
Fedora 40 (ARM)
Kernel: Depends on container host
Compiler: gcc 14.2.1 20240912 (Red Hat 14.2.1-3)
32-bit Ubuntu 22.04.4 (ARM)
Kernel: 5.15.83+ aarch64
Compiler: gcc (Ubuntu 11.4.0-1ubuntu1~22.04) 11.4.0
CentOS Stream 10 (ARM)
Kernel: Depends on container host
Compiler: gcc 14.2.1 20241104 (Red Hat 14.2.1-6)
Debian 12 (arm)
Kernel: Depends on container host
Compiler: gcc (Debian 12.2.0-14) 12.2.0
Fedora 40 (ARM Clang)
Kernel: Depends on container host
Compiler: clang 18.1.8 (Fedora 18.1.8-1.fc40)
Fedora 41 (ARM)
Kernel: Depends on container host
Compiler: gcc 14.2.1 20240912 (Red Hat 14.2.1-3)
Fedora 41 (ARM Clang)
Kernel: Depends on container host
Compiler: clang 19.1.5 (Fedora 19.1.5-1.fc41)
Ubuntu 20.04 (ARM)
Kernel: Depends on container host
Compiler: gcc (Ubuntu 9.4.0-1ubuntu1~20.04.2) 9.4.0
Ubuntu 22.04 (ARM)
Kernel: Depends on container host
Compiler: gcc (Ubuntu 11.4.0-1ubuntu1~22.04) 11.4.0
RHEL9 (ARM)
Kernel: Depends on container host
Compiler: gcc 11.5.0 20240719 (Red Hat 11.5.0-2)
Ubuntu 24.04 (ARM)
Kernel: Depends on container host
Compiler: gcc (Ubuntu 13.3.0-6ubuntu2~24.04) 13.3.0
Ubuntu 20.04 ARM SVE
Kernel: Depends on container host
Compiler: gcc (Ubuntu 10.5.0-1ubuntu1~20.04) 10.5.0
To view detailed results, visit:
https://lab.dpdk.org/results/dashboard/patchsets/32939/
UNH-IOL DPDK Community Lab
To manage your email subscriptions, visit:
https://lab.dpdk.org/results/dashboard/preferences/subscriptions/
next prev parent reply other threads:[~2025-04-03 11:41 UTC|newest]
Thread overview: 30+ messages / expand[flat|nested] mbox.gz Atom feed top
[not found] <20250403070837.926292-4-ndabilpuram@marvell.com>
2025-04-03 6:35 ` |SUCCESS| pw152750-152753 [RFC PATCH 4/4] net/cnxk: report link type along with link status qemudev
2025-04-03 6:41 ` |FAILURE| " qemudev
2025-04-03 7:09 ` |SUCCESS| pw152753 " checkpatch
2025-04-03 8:02 ` |FAILURE| " 0-day Robot
2025-04-03 8:33 ` |SUCCESS| pw152750-152753 [PATCH] [RFC,4/4] net/cnxk: report link ty dpdklab
2025-04-03 8:39 ` dpdklab
2025-04-03 8:41 ` dpdklab
2025-04-03 8:55 ` dpdklab
2025-04-03 9:01 ` dpdklab
2025-04-03 9:03 ` dpdklab
2025-04-03 9:26 ` dpdklab
2025-04-03 9:37 ` |PENDING| " dpdklab
2025-04-03 9:48 ` |FAILURE| " dpdklab
2025-04-03 9:52 ` dpdklab
2025-04-03 9:53 ` dpdklab
2025-04-03 9:53 ` dpdklab
2025-04-03 9:58 ` dpdklab
2025-04-03 10:18 ` |PENDING| " dpdklab
2025-04-03 10:41 ` |FAILURE| " dpdklab
2025-04-03 10:50 ` |WARNING| " dpdklab
2025-04-03 11:41 ` dpdklab [this message]
2025-04-03 11:53 ` |SUCCESS| " dpdklab
2025-04-03 12:12 ` |FAILURE| " dpdklab
2025-04-03 12:59 ` dpdklab
2025-04-03 13:29 ` |SUCCESS| " dpdklab
2025-04-03 15:53 ` dpdklab
2025-04-03 19:32 ` dpdklab
2025-04-04 0:15 ` dpdklab
2025-04-04 0:41 ` dpdklab
2025-04-04 16:43 ` dpdklab
Reply instructions:
You may reply publicly to this message via plain-text email
using any one of the following methods:
* Save the following mbox file, import it into your mail client,
and reply-to-all from there: mbox
Avoid top-posting and favor interleaved quoting:
https://en.wikipedia.org/wiki/Posting_style#Interleaved_style
* Reply using the --to, --cc, and --in-reply-to
switches of git-send-email(1):
git send-email \
--in-reply-to=67ee73e5.050a0220.1677ac.2b64SMTPIN_ADDED_MISSING@mx.google.com \
--to=dpdklab@iol.unh.edu \
--cc=dpdk-test-reports@iol.unh.edu \
--cc=ndabilpuram@marvell.com \
--cc=test-report@dpdk.org \
/path/to/YOUR_REPLY
https://kernel.org/pub/software/scm/git/docs/git-send-email.html
* If your mail client supports setting the In-Reply-To header
via mailto: links, try the mailto: link
Be sure your reply has a Subject: header at the top and a blank line
before the message body.
This is a public inbox, see mirroring instructions
for how to clone and mirror all data and code used for this inbox;
as well as URLs for NNTP newsgroup(s).