* |FAILURE| [GIT MASTER] 669ba8067b3c7a1467999e826e396cb97332cbc6
@ 2025-04-05 9:07 dpdklab
0 siblings, 0 replies; 23+ messages in thread
From: dpdklab @ 2025-04-05 9:07 UTC (permalink / raw)
To: Test Report
Cc: dpdk-test-reports, Xueming Li, Christian Ehrhardt, Kevin Traynor,
Luca Boccassi
_Testing issues_
Branch: 23.11-staging
669ba8067b3c7a1467999e826e396cb97332cbc6 --> testing issues
Upstream job id: Generic-VM-Unit-Test-DPDK#27815
Test environment and result as below:
+---------------------+----------------+
| Environment | dpdk_unit_test |
+=====================+================+
| Debian 12 | PEND |
+---------------------+----------------+
| CentOS Stream 9 | PEND |
+---------------------+----------------+
| CentOS Stream 10 | PEND |
+---------------------+----------------+
| Fedora 40 (Clang) | FAIL |
+---------------------+----------------+
| Fedora 40 | PEND |
+---------------------+----------------+
| Fedora 41 | PEND |
+---------------------+----------------+
| Fedora 41 (Clang) | PEND |
+---------------------+----------------+
| Ubuntu 24.04 | PEND |
+---------------------+----------------+
| RHEL9 | PEND |
+---------------------+----------------+
| RHEL8 | PEND |
+---------------------+----------------+
| Ubuntu 22.04 | PEND |
+---------------------+----------------+
| Ubuntu 20.04 | PEND |
+---------------------+----------------+
| Windows Server 2022 | PASS |
+---------------------+----------------+
==== Unit test summary for Fedora 40 (Clang) (dpdk_unit_test): ====
ninja: Entering directory `/home-local/jenkins-local/jenkins-agent/workspace/Generic-Unit-Test-DPDK/dpdk/build'
ninja: no work to do.
1/110 DPDK:fast-tests / acl_autotest OK 2.68 s
2/110 DPDK:fast-tests / atomic_autotest OK 0.42 s
3/110 DPDK:fast-tests / bitcount_autotest OK 0.22 s
4/110 DPDK:fast-tests / bitmap_autotest OK 0.22 s
5/110 DPDK:fast-tests / bitops_autotest OK 0.17 s
6/110 DPDK:fast-tests / bitratestats_autotest OK 0.22 s
7/110 DPDK:fast-tests / bpf_autotest OK 0.22 s
8/110 DPDK:fast-tests / bpf_convert_autotest OK 0.22 s
9/110 DPDK:fast-tests / byteorder_autotest OK 0.17 s
10/110 DPDK:fast-tests / cksum_autotest OK 0.17 s
11/110 DPDK:fast-tests / cmdline_autotest OK 0.17 s
12/110 DPDK:fast-tests / common_autotest OK 0.42 s
13/110 DPDK:fast-tests / compressdev_autotest SKIP 0.17 s
14/110 DPDK:fast-tests / cpuflags_autotest OK 0.22 s
15/110 DPDK:fast-tests / crc_autotest OK 0.22 s
16/110 DPDK:fast-tests / user_delay_us OK 0.17 s
17/110 DPDK:fast-tests / debug_autotest OK 0.47 s
18/110 DPDK:fast-tests / devargs_autotest OK 0.17 s
19/110 DPDK:fast-tests / dispatcher_autotest SKIP 0.17 s
20/110 DPDK:fast-tests / distributor_autotest OK 0.87 s
21/110 DPDK:fast-tests / eal_flags_c_opt_autotest OK 0.67 s
22/110 DPDK:fast-tests / eal_flags_main_opt_autotest OK 0.32 s
23/110 DPDK:fast-tests / eal_flags_n_opt_autotest OK 0.47 s
24/110 DPDK:fast-tests / eal_flags_hpet_autotest OK 0.22 s
25/110 DPDK:fast-tests / eal_flags_no_huge_autotest OK 0.47 s
26/110 DPDK:fast-tests / eal_flags_a_opt_autotest OK 0.32 s
27/110 DPDK:fast-tests / eal_flags_b_opt_autotest OK 0.32 s
28/110 DPDK:fast-tests / eal_flags_vdev_opt_autotest OK 0.57 s
29/110 DPDK:fast-tests / eal_flags_r_opt_autotest OK 0.27 s
30/110 DPDK:fast-tests / eal_flags_mem_autotest OK 0.72 s
31/110 DPDK:fast-tests / eal_flags_file_prefix_autotest OK 4.43 s
32/110 DPDK:fast-tests / eal_flags_misc_autotest OK 1.77 s
33/110 DPDK:fast-tests / eal_fs_autotest OK 0.22 s
34/110 DPDK:fast-tests / errno_autotest OK 0.17 s
35/110 DPDK:fast-tests / ethdev_link_status OK 0.17 s
36/110 DPDK:fast-tests / event_eth_tx_adapter_autotest OK 0.47 s
37/110 DPDK:fast-tests / event_ring_autotest OK 0.22 s
38/110 DPDK:fast-tests / eventdev_common_autotest OK 0.22 s
39/110 DPDK:fast-tests / eventdev_selftest_sw OK 0.22 s
40/110 DPDK:fast-tests / fbarray_autotest OK 0.17 s
41/110 DPDK:fast-tests / fib_autotest OK 0.82 s
42/110 DPDK:fast-tests / fib6_autotest OK 0.62 s
43/110 DPDK:fast-tests / func_reentrancy_autotest OK 0.53 s
44/110 DPDK:fast-tests / graph_autotest OK 0.22 s
45/110 DPDK:fast-tests / node_list_dump OK 0.22 s
46/110 DPDK:fast-tests / hash_autotest OK 0.32 s
47/110 DPDK:fast-tests / hash_readwrite_func_autotest SKIP 0.17 s
48/110 DPDK:fast-tests / interrupt_autotest OK 1.22 s
49/110 DPDK:fast-tests / ipfrag_autotest OK 0.17 s
50/110 DPDK:fast-tests / ipsec_autotest SKIP 0.22 s
51/110 DPDK:fast-tests / kvargs_autotest OK 0.22 s
52/110 DPDK:fast-tests / latencystats_autotest OK 0.22 s
53/110 DPDK:fast-tests / lcores_autotest OK 1.27 s
54/110 DPDK:fast-tests / logs_autotest OK 0.22 s
55/110 DPDK:fast-tests / lpm_autotest OK 1.42 s
56/110 DPDK:fast-tests / lpm6_autotest OK 2.62 s
57/110 DPDK:fast-tests / malloc_autotest OK 0.57 s
58/110 DPDK:fast-tests / mbuf_autotest OK 0.22 s
59/110 DPDK:fast-tests / mcslock_autotest OK 0.42 s
60/110 DPDK:fast-tests / member_autotest OK 0.77 s
61/110 DPDK:fast-tests / memcpy_autotest OK 1.47 s
62/110 DPDK:fast-tests / memory_autotest OK 0.17 s
63/110 DPDK:fast-tests / mempool_autotest OK 0.47 s
64/110 DPDK:fast-tests / memzone_autotest OK 0.17 s
65/110 DPDK:fast-tests / meter_autotest OK 0.22 s
66/110 DPDK:fast-tests / metrics_autotest OK 0.22 s
67/110 DPDK:fast-tests / multiprocess_autotest OK 0.27 s
68/110 DPDK:fast-tests / net_ether_autotest OK 0.52 s
69/110 DPDK:fast-tests / pdcp_autotest SKIP 0.17 s
70/110 DPDK:fast-tests / pdump_autotest OK 0.32 s
71/110 DPDK:fast-tests / per_lcore_autotest OK 0.32 s
72/110 DPDK:fast-tests / pflock_autotest OK 0.32 s
73/110 DPDK:fast-tests / pie_autotest OK 0.22 s
74/110 DPDK:fast-tests / ring_pmd_autotest OK 0.22 s
75/110 DPDK:fast-tests / power_autotest OK 0.17 s
76/110 DPDK:fast-tests / power_cpufreq_autotest SKIP 0.17 s
77/110 DPDK:fast-tests / power_intel_uncore_autotest SKIP 0.22 s
78/110 DPDK:fast-tests / power_kvm_vm_autotest SKIP 0.17 s
79/110 DPDK:fast-tests / prefetch_autotest OK 0.22 s
80/110 DPDK:fast-tests / rawdev_autotest OK 0.22 s
81/110 DPDK:fast-tests / rcu_qsbr_autotest OK 0.32 s
82/110 DPDK:fast-tests / reorder_autotest OK 0.32 s
83/110 DPDK:fast-tests / rib_autotest OK 4.78 s
84/110 DPDK:fast-tests / rib6_autotest OK 4.18 s
85/110 DPDK:fast-tests / ring_autotest OK 0.22 s
86/110 DPDK:fast-tests / rwlock_test1_autotest OK 0.32 s
87/110 DPDK:fast-tests / rwlock_rda_autotest OK 5.18 s
88/110 DPDK:fast-tests / rwlock_rds_wrm_autotest OK 5.17 s
89/110 DPDK:fast-tests / rwlock_rde_wro_autotest OK 5.18 s
90/110 DPDK:fast-tests / sched_autotest OK 0.22 s
91/110 DPDK:fast-tests / security_autotest OK 0.17 s
92/110 DPDK:fast-tests / seqlock_autotest SKIP 0.22 s
93/110 DPDK:fast-tests / service_autotest OK 0.32 s
94/110 DPDK:fast-tests / spinlock_autotest OK 0.22 s
95/110 DPDK:fast-tests / stack_autotest OK 0.22 s
96/110 DPDK:fast-tests / stack_lf_autotest OK 0.27 s
97/110 DPDK:fast-tests / string_autotest OK 0.22 s
98/110 DPDK:fast-tests / table_autotest OK 5.53 s
99/110 DPDK:fast-tests / tailq_autotest OK 0.17 s
100/110 DPDK:fast-tests / telemetry_data_autotest OK 0.22 s
101/110 DPDK:fast-tests / telemetry_json_autotest OK 0.22 s
102/110 DPDK:fast-tests / thash_autotest OK 0.22 s
103/110 DPDK:fast-tests / threads_autotest OK 0.37 s
104/110 DPDK:fast-tests / ticketlock_autotest OK 0.22 s
105/110 DPDK:fast-tests / timer_autotest OK 2.52 s
106/110 DPDK:fast-tests / trace_autotest OK 0.22 s
107/110 DPDK:fast-tests / trace_autotest_with_traces OK 0.22 s
108/110 DPDK:fast-tests / vdev_autotest OK 0.22 s
109/110 DPDK:fast-tests / version_autotest OK 0.22 s
110/110 DPDK:fast-tests / telemetry_all SKIP 0.01 s
Ok: 100
Expected Fail: 0
Fail: 0
Unexpected Pass: 0
Skipped: 10
Timeout: 0
Full log written to /home-local/jenkins-local/jenkins-agent/workspace/Generic-Unit-Test-DPDK/dpdk/build/meson-logs/testlog.txt
ninja: Entering directory `/home-local/jenkins-local/jenkins-agent/workspace/Generic-Unit-Test-DPDK/dpdk/build'
ninja: no work to do.
1/2 DPDK:driver-tests / cryptodev_openssl_autotest FAIL 0.57 s (killed by signal 11 SIGSEGV)
2/2 DPDK:driver-tests / cryptodev_openssl_asym_autotest OK 0.17 s
Ok: 1
Expected Fail: 0
Fail: 1
Unexpected Pass: 0
Skipped: 0
Timeout: 0
Full log written to /home-local/jenkins-local/jenkins-agent/workspace/Generic-Unit-Test-DPDK/dpdk/build/meson-logs/testlog.txt
Test log output from the failed test cryptodev_openssl_autotest:
Sorry, we were not able to find the logs for this test.
Download the log output from the CI site for this test run.
==== End log output ====
Debian 12
Kernel: Depends on container host
Compiler: gcc (Debian 12.2.0-14) 12.2.0
CentOS Stream 9
Kernel: Depends on container host
Compiler: gcc 11.5.0 20240719 (Red Hat 11.5.0-2)
CentOS Stream 10
Kernel: Depends on container host
Compiler: gcc 14.2.1 20241104 (Red Hat 14.2.1-6)
Fedora 40 (Clang)
Kernel: Depends on container host
Compiler: clang 18.1.8 (Fedora 18.1.8-1.fc40)
Fedora 40
Kernel: Depends on container host
Compiler: gcc 14.2.1 20240912 (Red Hat 14.2.1-3)
Fedora 41
Kernel: Depends on container host
Compiler: gcc 14.2.1 20240912 (Red Hat 14.2.1-3)
Fedora 41 (Clang)
Kernel: Depends on container host
Compiler: clang 19.1.5 (Fedora 19.1.5-1.fc41)
Ubuntu 24.04
Kernel: Depends on container host
Compiler: gcc (Ubuntu 13.3.0-6ubuntu2~24.04) 13.3.0
RHEL9
Kernel: Depends on container host
Compiler: gcc 11.5.0 20240719 (Red Hat 11.5.0-2)
RHEL8
Kernel: Depends on container host
Compiler: gcc 8.5.0 20210514 (Red Hat 8.5.0-22)
Ubuntu 22.04
Kernel: Depends on container host
Compiler: gcc (Ubuntu 11.4.0-1ubuntu1~22.04) 11.4.0
Ubuntu 20.04
Kernel: Depends on container host
Compiler: gcc (Ubuntu 9.4.0-1ubuntu1~20.04.2) 9.4.0
Windows Server 2022
Kernel: 10.0.20348.2031
Compiler: clang 15.0.7, gcc 14.1.0 (MinGW), and MSVC VS 19.39.33521
To view detailed results, visit:
https://lab.dpdk.org/results/dashboard/tarballs/33159/
UNH-IOL DPDK Community Lab
To manage your email subscriptions, visit:
https://lab.dpdk.org/results/dashboard/preferences/subscriptions/
^ permalink raw reply [flat|nested] 23+ messages in thread
* |FAILURE| [GIT MASTER] 669ba8067b3c7a1467999e826e396cb97332cbc6
@ 2025-04-05 10:18 dpdklab
0 siblings, 0 replies; 23+ messages in thread
From: dpdklab @ 2025-04-05 10:18 UTC (permalink / raw)
To: Test Report
Cc: dpdk-test-reports, Xueming Li, Christian Ehrhardt, Kevin Traynor,
Luca Boccassi
_Testing issues_
Branch: 23.11-staging
669ba8067b3c7a1467999e826e396cb97332cbc6 --> testing issues
Upstream job id: Generic-Unit-Test-DPDK#329015
Test environment and result as below:
+-----------------------------+----------------+--------------+---------------------------+------------------------------+
| Environment | dpdk_unit_test | lpm_autotest | cryptodev_sw_zuc_autotest | cryptodev_sw_snow3g_autotest |
+=============================+================+==============+===========================+==============================+
| CentOS Stream 10 (ARM) | FAIL | SKIPPED | SKIPPED | SKIPPED |
+-----------------------------+----------------+--------------+---------------------------+------------------------------+
| CentOS Stream 9 (ARM) | FAIL | SKIPPED | SKIPPED | SKIPPED |
+-----------------------------+----------------+--------------+---------------------------+------------------------------+
| Debian 12 (arm) | FAIL | SKIPPED | PASS | PASS |
+-----------------------------+----------------+--------------+---------------------------+------------------------------+
| Fedora 40 (ARM) | FAIL | SKIPPED | SKIPPED | SKIPPED |
+-----------------------------+----------------+--------------+---------------------------+------------------------------+
| Fedora 40 (ARM Clang) | FAIL | SKIPPED | SKIPPED | SKIPPED |
+-----------------------------+----------------+--------------+---------------------------+------------------------------+
| Fedora 41 (ARM) | FAIL | SKIPPED | SKIPPED | SKIPPED |
+-----------------------------+----------------+--------------+---------------------------+------------------------------+
| Fedora 41 (ARM Clang) | FAIL | SKIPPED | SKIPPED | SKIPPED |
+-----------------------------+----------------+--------------+---------------------------+------------------------------+
| Ubuntu 20.04 (ARM) | FAIL | SKIPPED | SKIPPED | SKIPPED |
+-----------------------------+----------------+--------------+---------------------------+------------------------------+
| Ubuntu 22.04 (ARM) | FAIL | SKIPPED | SKIPPED | SKIPPED |
+-----------------------------+----------------+--------------+---------------------------+------------------------------+
| RHEL9 (ARM) | FAIL | SKIPPED | SKIPPED | SKIPPED |
+-----------------------------+----------------+--------------+---------------------------+------------------------------+
| 32-bit Ubuntu 22.04.4 (ARM) | PASS | SKIPPED | SKIPPED | SKIPPED |
+-----------------------------+----------------+--------------+---------------------------+------------------------------+
| Ubuntu 24.04 (ARM) | FAIL | SKIPPED | SKIPPED | SKIPPED |
+-----------------------------+----------------+--------------+---------------------------+------------------------------+
| Ubuntu 20.04 ARM SVE | SKIPPED | PASS | SKIPPED | SKIPPED |
+-----------------------------+----------------+--------------+---------------------------+------------------------------+
==== Unit test summary for Ubuntu 24.04 (ARM) (dpdk_unit_test): ====
ninja: Entering directory `/home-local/jenkins-local/jenkins-agent/workspace/Generic-Unit-Test-DPDK/dpdk/build'
ninja: no work to do.
1/110 DPDK:fast-tests / acl_autotest OK 4.48 s
2/110 DPDK:fast-tests / atomic_autotest OK 4.88 s
3/110 DPDK:fast-tests / bitcount_autotest OK 0.17 s
4/110 DPDK:fast-tests / bitmap_autotest OK 0.17 s
5/110 DPDK:fast-tests / bitops_autotest OK 0.17 s
6/110 DPDK:fast-tests / bitratestats_autotest OK 0.17 s
7/110 DPDK:fast-tests / bpf_autotest OK 0.17 s
8/110 DPDK:fast-tests / bpf_convert_autotest OK 0.17 s
9/110 DPDK:fast-tests / byteorder_autotest OK 0.17 s
10/110 DPDK:fast-tests / cksum_autotest OK 0.17 s
11/110 DPDK:fast-tests / cmdline_autotest OK 0.17 s
12/110 DPDK:fast-tests / common_autotest OK 1.12 s
13/110 DPDK:fast-tests / compressdev_autotest SKIP 0.07 s
14/110 DPDK:fast-tests / cpuflags_autotest OK 0.17 s
15/110 DPDK:fast-tests / crc_autotest OK 0.17 s
16/110 DPDK:fast-tests / user_delay_us OK 0.17 s
17/110 DPDK:fast-tests / debug_autotest OK 0.92 s
18/110 DPDK:fast-tests / devargs_autotest OK 0.17 s
19/110 DPDK:fast-tests / dispatcher_autotest OK 2.22 s
20/110 DPDK:fast-tests / distributor_autotest OK 0.82 s
21/110 DPDK:fast-tests / eal_flags_c_opt_autotest OK 0.82 s
22/110 DPDK:fast-tests / eal_flags_main_opt_autotest OK 0.22 s
23/110 DPDK:fast-tests / eal_flags_n_opt_autotest OK 0.22 s
24/110 DPDK:fast-tests / eal_flags_hpet_autotest OK 0.17 s
25/110 DPDK:fast-tests / eal_flags_no_huge_autotest OK 0.27 s
26/110 DPDK:fast-tests / eal_flags_a_opt_autotest OK 0.42 s
27/110 DPDK:fast-tests / eal_flags_b_opt_autotest OK 0.32 s
28/110 DPDK:fast-tests / eal_flags_vdev_opt_autotest OK 0.22 s
29/110 DPDK:fast-tests / eal_flags_r_opt_autotest OK 0.22 s
30/110 DPDK:fast-tests / eal_flags_mem_autotest OK 0.32 s
31/110 DPDK:fast-tests / eal_flags_file_prefix_autotest OK 1.27 s
32/110 DPDK:fast-tests / eal_flags_misc_autotest OK 0.92 s
33/110 DPDK:fast-tests / eal_fs_autotest OK 0.17 s
34/110 DPDK:fast-tests / errno_autotest OK 0.17 s
35/110 DPDK:fast-tests / ethdev_link_status OK 0.17 s
36/110 DPDK:fast-tests / event_eth_tx_adapter_autotest OK 1.07 s
37/110 DPDK:fast-tests / event_ring_autotest OK 0.17 s
38/110 DPDK:fast-tests / eventdev_common_autotest OK 0.17 s
39/110 DPDK:fast-tests / eventdev_selftest_sw OK 10.19 s
40/110 DPDK:fast-tests / fbarray_autotest OK 0.17 s
41/110 DPDK:fast-tests / fib_autotest OK 0.77 s
42/110 DPDK:fast-tests / fib6_autotest OK 0.87 s
43/110 DPDK:fast-tests / func_reentrancy_autotest OK 0.77 s
44/110 DPDK:fast-tests / graph_autotest OK 0.17 s
45/110 DPDK:fast-tests / node_list_dump OK 0.17 s
46/110 DPDK:fast-tests / hash_autotest OK 0.52 s
47/110 DPDK:fast-tests / hash_readwrite_func_autotest OK 7.39 s
48/110 DPDK:fast-tests / interrupt_autotest OK 1.17 s
49/110 DPDK:fast-tests / ipfrag_autotest OK 0.07 s
50/110 DPDK:fast-tests / ipsec_autotest SKIP 0.17 s
51/110 DPDK:fast-tests / kvargs_autotest OK 0.17 s
52/110 DPDK:fast-tests / latencystats_autotest OK 0.17 s
53/110 DPDK:fast-tests / lcores_autotest OK 3.93 s
54/110 DPDK:fast-tests / logs_autotest OK 0.17 s
55/110 DPDK:fast-tests / lpm_autotest OK 1.57 s
56/110 DPDK:fast-tests / lpm6_autotest OK 4.83 s
57/110 DPDK:fast-tests / malloc_autotest OK 0.42 s
58/110 DPDK:fast-tests / mbuf_autotest OK 4.33 s
59/110 DPDK:fast-tests / mcslock_autotest OK 0.82 s
60/110 DPDK:fast-tests / member_autotest OK 1.42 s
61/110 DPDK:fast-tests / memcpy_autotest OK 5.48 s
62/110 DPDK:fast-tests / memory_autotest OK 0.07 s
63/110 DPDK:fast-tests / mempool_autotest OK 0.47 s
64/110 DPDK:fast-tests / memzone_autotest OK 0.12 s
65/110 DPDK:fast-tests / meter_autotest OK 0.17 s
66/110 DPDK:fast-tests / metrics_autotest OK 0.17 s
67/110 DPDK:fast-tests / multiprocess_autotest OK 0.22 s
68/110 DPDK:fast-tests / net_ether_autotest OK 0.92 s
69/110 DPDK:fast-tests / pdcp_autotest SKIP 0.07 s
70/110 DPDK:fast-tests / pdump_autotest OK 0.37 s
71/110 DPDK:fast-tests / per_lcore_autotest OK 0.27 s
72/110 DPDK:fast-tests / pflock_autotest OK 0.47 s
73/110 DPDK:fast-tests / pie_autotest OK 0.17 s
74/110 DPDK:fast-tests / ring_pmd_autotest OK 0.17 s
75/110 DPDK:fast-tests / power_autotest OK 0.17 s
76/110 DPDK:fast-tests / power_cpufreq_autotest SKIP 0.07 s
77/110 DPDK:fast-tests / power_intel_uncore_autotest SKIP 0.17 s
78/110 DPDK:fast-tests / power_kvm_vm_autotest SKIP 0.07 s
79/110 DPDK:fast-tests / prefetch_autotest OK 0.17 s
80/110 DPDK:fast-tests / rawdev_autotest OK 0.17 s
81/110 DPDK:fast-tests / rcu_qsbr_autotest OK 0.62 s
82/110 DPDK:fast-tests / reorder_autotest OK 0.42 s
83/110 DPDK:fast-tests / rib_autotest OK 3.88 s
84/110 DPDK:fast-tests / rib6_autotest OK 3.93 s
85/110 DPDK:fast-tests / ring_autotest OK 0.17 s
86/110 DPDK:fast-tests / rwlock_test1_autotest OK 0.47 s
87/110 DPDK:fast-tests / rwlock_rda_autotest OK 5.18 s
88/110 DPDK:fast-tests / rwlock_rds_wrm_autotest OK 5.18 s
89/110 DPDK:fast-tests / rwlock_rde_wro_autotest OK 5.18 s
90/110 DPDK:fast-tests / sched_autotest OK 0.17 s
91/110 DPDK:fast-tests / security_autotest OK 0.07 s
92/110 DPDK:fast-tests / seqlock_autotest OK 2.17 s
93/110 DPDK:fast-tests / service_autotest OK 2.87 s
94/110 DPDK:fast-tests / spinlock_autotest OK 0.17 s
95/110 DPDK:fast-tests / stack_autotest OK 0.37 s
96/110 DPDK:fast-tests / stack_lf_autotest OK 0.32 s
97/110 DPDK:fast-tests / string_autotest OK 0.17 s
98/110 DPDK:fast-tests / table_autotest OK 6.93 s
99/110 DPDK:fast-tests / tailq_autotest OK 0.27 s
100/110 DPDK:fast-tests / telemetry_data_autotest OK 0.17 s
101/110 DPDK:fast-tests / telemetry_json_autotest OK 0.17 s
102/110 DPDK:fast-tests / thash_autotest OK 0.17 s
103/110 DPDK:fast-tests / threads_autotest OK 0.32 s
104/110 DPDK:fast-tests / ticketlock_autotest OK 0.17 s
105/110 DPDK:fast-tests / timer_autotest OK 2.82 s
106/110 DPDK:fast-tests / trace_autotest OK 0.17 s
107/110 DPDK:fast-tests / trace_autotest_with_traces OK 0.17 s
108/110 DPDK:fast-tests / vdev_autotest OK 0.17 s
109/110 DPDK:fast-tests / version_autotest OK 0.17 s
110/110 DPDK:fast-tests / telemetry_all OK 1.12 s
Ok: 104
Expected Fail: 0
Fail: 0
Unexpected Pass: 0
Skipped: 6
Timeout: 0
Full log written to /home-local/jenkins-local/jenkins-agent/workspace/Generic-Unit-Test-DPDK/dpdk/build/meson-logs/testlog.txt
ninja: Entering directory `/home-local/jenkins-local/jenkins-agent/workspace/Generic-Unit-Test-DPDK/dpdk/build'
ninja: no work to do.
1/2 DPDK:driver-tests / cryptodev_openssl_autotest FAIL 1.22 s (killed by signal 11 SIGSEGV)
2/2 DPDK:driver-tests / cryptodev_openssl_asym_autotest OK 0.17 s
Ok: 1
Expected Fail: 0
Fail: 1
Unexpected Pass: 0
Skipped: 0
Timeout: 0
Full log written to /home-local/jenkins-local/jenkins-agent/workspace/Generic-Unit-Test-DPDK/dpdk/build/meson-logs/testlog.txt
Test log output from the failed test cryptodev_openssl_autotest:
Sorry, we were not able to find the logs for this test.
Download the log output from the CI site for this test run.
==== End log output ====
CentOS Stream 10 (ARM)
Kernel: Depends on container host
Compiler: gcc 14.2.1 20241104 (Red Hat 14.2.1-6)
CentOS Stream 9 (ARM)
Kernel: Depends on container host
Compiler: gcc 11.5.0 20240719 (Red Hat 11.5.0-2)
Debian 12 (arm)
Kernel: Depends on container host
Compiler: gcc (Debian 12.2.0-14) 12.2.0
Fedora 40 (ARM)
Kernel: Depends on container host
Compiler: gcc 14.2.1 20240912 (Red Hat 14.2.1-3)
Fedora 40 (ARM Clang)
Kernel: Depends on container host
Compiler: clang 18.1.8 (Fedora 18.1.8-1.fc40)
Fedora 41 (ARM)
Kernel: Depends on container host
Compiler: gcc 14.2.1 20240912 (Red Hat 14.2.1-3)
Fedora 41 (ARM Clang)
Kernel: Depends on container host
Compiler: clang 19.1.5 (Fedora 19.1.5-1.fc41)
Ubuntu 20.04 (ARM)
Kernel: Depends on container host
Compiler: gcc (Ubuntu 9.4.0-1ubuntu1~20.04.2) 9.4.0
Ubuntu 22.04 (ARM)
Kernel: Depends on container host
Compiler: gcc (Ubuntu 11.4.0-1ubuntu1~22.04) 11.4.0
RHEL9 (ARM)
Kernel: Depends on container host
Compiler: gcc 11.5.0 20240719 (Red Hat 11.5.0-2)
32-bit Ubuntu 22.04.4 (ARM)
Kernel: 5.15.83+ aarch64
Compiler: gcc (Ubuntu 11.4.0-1ubuntu1~22.04) 11.4.0
Ubuntu 24.04 (ARM)
Kernel: Depends on container host
Compiler: gcc (Ubuntu 13.3.0-6ubuntu2~24.04) 13.3.0
Ubuntu 20.04 ARM SVE
Kernel: Depends on container host
Compiler: gcc (Ubuntu 10.5.0-1ubuntu1~20.04) 10.5.0
To view detailed results, visit:
https://lab.dpdk.org/results/dashboard/tarballs/33159/
UNH-IOL DPDK Community Lab
To manage your email subscriptions, visit:
https://lab.dpdk.org/results/dashboard/preferences/subscriptions/
^ permalink raw reply [flat|nested] 23+ messages in thread
* |FAILURE| [GIT MASTER] 669ba8067b3c7a1467999e826e396cb97332cbc6
@ 2025-04-05 9:51 dpdklab
0 siblings, 0 replies; 23+ messages in thread
From: dpdklab @ 2025-04-05 9:51 UTC (permalink / raw)
To: Test Report
Cc: dpdk-test-reports, Xueming Li, Christian Ehrhardt, Kevin Traynor,
Luca Boccassi
_Testing issues_
Branch: 23.11-staging
669ba8067b3c7a1467999e826e396cb97332cbc6 --> testing issues
Upstream job id: Generic-Unit-Test-DPDK#329006
Test environment and result as below:
+-----------------------------+----------------+--------------+---------------------------+------------------------------+
| Environment | dpdk_unit_test | lpm_autotest | cryptodev_sw_zuc_autotest | cryptodev_sw_snow3g_autotest |
+=============================+================+==============+===========================+==============================+
| CentOS Stream 10 (ARM) | FAIL | SKIPPED | SKIPPED | SKIPPED |
+-----------------------------+----------------+--------------+---------------------------+------------------------------+
| CentOS Stream 9 (ARM) | FAIL | SKIPPED | SKIPPED | SKIPPED |
+-----------------------------+----------------+--------------+---------------------------+------------------------------+
| Debian 12 (arm) | FAIL | SKIPPED | PEND | PEND |
+-----------------------------+----------------+--------------+---------------------------+------------------------------+
| Fedora 40 (ARM) | FAIL | SKIPPED | SKIPPED | SKIPPED |
+-----------------------------+----------------+--------------+---------------------------+------------------------------+
| Fedora 40 (ARM Clang) | FAIL | SKIPPED | SKIPPED | SKIPPED |
+-----------------------------+----------------+--------------+---------------------------+------------------------------+
| Fedora 41 (ARM) | FAIL | SKIPPED | SKIPPED | SKIPPED |
+-----------------------------+----------------+--------------+---------------------------+------------------------------+
| Fedora 41 (ARM Clang) | FAIL | SKIPPED | SKIPPED | SKIPPED |
+-----------------------------+----------------+--------------+---------------------------+------------------------------+
| Ubuntu 20.04 (ARM) | PEND | SKIPPED | SKIPPED | SKIPPED |
+-----------------------------+----------------+--------------+---------------------------+------------------------------+
| Ubuntu 22.04 (ARM) | PEND | SKIPPED | SKIPPED | SKIPPED |
+-----------------------------+----------------+--------------+---------------------------+------------------------------+
| RHEL9 (ARM) | FAIL | SKIPPED | SKIPPED | SKIPPED |
+-----------------------------+----------------+--------------+---------------------------+------------------------------+
| 32-bit Ubuntu 22.04.4 (ARM) | PASS | SKIPPED | SKIPPED | SKIPPED |
+-----------------------------+----------------+--------------+---------------------------+------------------------------+
| Ubuntu 24.04 (ARM) | PEND | SKIPPED | SKIPPED | SKIPPED |
+-----------------------------+----------------+--------------+---------------------------+------------------------------+
| Ubuntu 20.04 ARM SVE | SKIPPED | PEND | SKIPPED | SKIPPED |
+-----------------------------+----------------+--------------+---------------------------+------------------------------+
==== Unit test summary for RHEL9 (ARM) (dpdk_unit_test): ====
ninja: Entering directory `/home-local/jenkins-local/jenkins-agent/workspace/Generic-Unit-Test-DPDK/dpdk/build'
ninja: no work to do.
1/110 DPDK:fast-tests / acl_autotest OK 6.13 s
2/110 DPDK:fast-tests / atomic_autotest OK 5.13 s
3/110 DPDK:fast-tests / bitcount_autotest OK 0.17 s
4/110 DPDK:fast-tests / bitmap_autotest OK 0.17 s
5/110 DPDK:fast-tests / bitops_autotest OK 0.17 s
6/110 DPDK:fast-tests / bitratestats_autotest OK 0.17 s
7/110 DPDK:fast-tests / bpf_autotest OK 0.17 s
8/110 DPDK:fast-tests / bpf_convert_autotest OK 0.17 s
9/110 DPDK:fast-tests / byteorder_autotest OK 0.17 s
10/110 DPDK:fast-tests / cksum_autotest OK 0.17 s
11/110 DPDK:fast-tests / cmdline_autotest OK 0.17 s
12/110 DPDK:fast-tests / common_autotest OK 0.92 s
13/110 DPDK:fast-tests / compressdev_autotest SKIP 0.07 s
14/110 DPDK:fast-tests / cpuflags_autotest OK 0.22 s
15/110 DPDK:fast-tests / crc_autotest OK 0.17 s
16/110 DPDK:fast-tests / user_delay_us OK 0.17 s
17/110 DPDK:fast-tests / debug_autotest OK 0.92 s
18/110 DPDK:fast-tests / devargs_autotest OK 0.17 s
19/110 DPDK:fast-tests / dispatcher_autotest OK 2.63 s
20/110 DPDK:fast-tests / distributor_autotest OK 0.82 s
21/110 DPDK:fast-tests / eal_flags_c_opt_autotest OK 0.82 s
22/110 DPDK:fast-tests / eal_flags_main_opt_autotest OK 0.22 s
23/110 DPDK:fast-tests / eal_flags_n_opt_autotest OK 0.22 s
24/110 DPDK:fast-tests / eal_flags_hpet_autotest OK 0.17 s
25/110 DPDK:fast-tests / eal_flags_no_huge_autotest OK 0.27 s
26/110 DPDK:fast-tests / eal_flags_a_opt_autotest OK 0.32 s
27/110 DPDK:fast-tests / eal_flags_b_opt_autotest OK 0.27 s
28/110 DPDK:fast-tests / eal_flags_vdev_opt_autotest OK 0.27 s
29/110 DPDK:fast-tests / eal_flags_r_opt_autotest OK 0.22 s
30/110 DPDK:fast-tests / eal_flags_mem_autotest OK 0.32 s
31/110 DPDK:fast-tests / eal_flags_file_prefix_autotest OK 1.32 s
32/110 DPDK:fast-tests / eal_flags_misc_autotest OK 0.97 s
33/110 DPDK:fast-tests / eal_fs_autotest OK 0.17 s
34/110 DPDK:fast-tests / errno_autotest OK 0.17 s
35/110 DPDK:fast-tests / ethdev_link_status OK 0.17 s
36/110 DPDK:fast-tests / event_eth_tx_adapter_autotest OK 1.07 s
37/110 DPDK:fast-tests / event_ring_autotest OK 0.17 s
38/110 DPDK:fast-tests / eventdev_common_autotest OK 0.17 s
39/110 DPDK:fast-tests / eventdev_selftest_sw OK 7.33 s
40/110 DPDK:fast-tests / fbarray_autotest OK 0.17 s
41/110 DPDK:fast-tests / fib_autotest OK 0.82 s
42/110 DPDK:fast-tests / fib6_autotest OK 0.92 s
43/110 DPDK:fast-tests / func_reentrancy_autotest OK 0.82 s
44/110 DPDK:fast-tests / graph_autotest OK 0.17 s
45/110 DPDK:fast-tests / node_list_dump OK 0.17 s
46/110 DPDK:fast-tests / hash_autotest OK 0.57 s
47/110 DPDK:fast-tests / hash_readwrite_func_autotest OK 7.89 s
48/110 DPDK:fast-tests / interrupt_autotest OK 1.17 s
49/110 DPDK:fast-tests / ipfrag_autotest OK 0.07 s
50/110 DPDK:fast-tests / ipsec_autotest SKIP 0.17 s
51/110 DPDK:fast-tests / kvargs_autotest OK 0.17 s
52/110 DPDK:fast-tests / latencystats_autotest OK 0.17 s
53/110 DPDK:fast-tests / lcores_autotest OK 3.93 s
54/110 DPDK:fast-tests / logs_autotest OK 0.17 s
55/110 DPDK:fast-tests / lpm_autotest OK 1.67 s
56/110 DPDK:fast-tests / lpm6_autotest OK 4.88 s
57/110 DPDK:fast-tests / malloc_autotest OK 0.42 s
58/110 DPDK:fast-tests / mbuf_autotest OK 2.92 s
59/110 DPDK:fast-tests / mcslock_autotest OK 0.87 s
60/110 DPDK:fast-tests / member_autotest OK 1.47 s
61/110 DPDK:fast-tests / memcpy_autotest OK 5.48 s
62/110 DPDK:fast-tests / memory_autotest OK 0.07 s
63/110 DPDK:fast-tests / mempool_autotest OK 0.42 s
64/110 DPDK:fast-tests / memzone_autotest OK 0.12 s
65/110 DPDK:fast-tests / meter_autotest OK 0.17 s
66/110 DPDK:fast-tests / metrics_autotest OK 0.17 s
67/110 DPDK:fast-tests / multiprocess_autotest OK 0.27 s
68/110 DPDK:fast-tests / net_ether_autotest OK 1.02 s
69/110 DPDK:fast-tests / pdcp_autotest SKIP 0.07 s
70/110 DPDK:fast-tests / pdump_autotest OK 0.37 s
71/110 DPDK:fast-tests / per_lcore_autotest OK 0.27 s
72/110 DPDK:fast-tests / pflock_autotest OK 0.47 s
73/110 DPDK:fast-tests / pie_autotest OK 0.17 s
74/110 DPDK:fast-tests / ring_pmd_autotest OK 0.17 s
75/110 DPDK:fast-tests / power_autotest OK 0.17 s
76/110 DPDK:fast-tests / power_cpufreq_autotest SKIP 0.07 s
77/110 DPDK:fast-tests / power_intel_uncore_autotest SKIP 0.17 s
78/110 DPDK:fast-tests / power_kvm_vm_autotest SKIP 0.07 s
79/110 DPDK:fast-tests / prefetch_autotest OK 0.17 s
80/110 DPDK:fast-tests / rawdev_autotest OK 0.17 s
81/110 DPDK:fast-tests / rcu_qsbr_autotest OK 0.62 s
82/110 DPDK:fast-tests / reorder_autotest OK 0.42 s
83/110 DPDK:fast-tests / rib_autotest OK 3.98 s
84/110 DPDK:fast-tests / rib6_autotest OK 3.98 s
85/110 DPDK:fast-tests / ring_autotest OK 0.17 s
86/110 DPDK:fast-tests / rwlock_test1_autotest OK 0.47 s
87/110 DPDK:fast-tests / rwlock_rda_autotest OK 5.18 s
88/110 DPDK:fast-tests / rwlock_rds_wrm_autotest OK 5.18 s
89/110 DPDK:fast-tests / rwlock_rde_wro_autotest OK 5.18 s
90/110 DPDK:fast-tests / sched_autotest OK 0.17 s
91/110 DPDK:fast-tests / security_autotest OK 0.07 s
92/110 DPDK:fast-tests / seqlock_autotest OK 2.17 s
93/110 DPDK:fast-tests / service_autotest OK 2.88 s
94/110 DPDK:fast-tests / spinlock_autotest OK 0.18 s
95/110 DPDK:fast-tests / stack_autotest OK 0.37 s
96/110 DPDK:fast-tests / stack_lf_autotest OK 0.32 s
97/110 DPDK:fast-tests / string_autotest OK 0.17 s
98/110 DPDK:fast-tests / table_autotest OK 7.18 s
99/110 DPDK:fast-tests / tailq_autotest OK 0.17 s
100/110 DPDK:fast-tests / telemetry_data_autotest OK 0.17 s
101/110 DPDK:fast-tests / telemetry_json_autotest OK 0.17 s
102/110 DPDK:fast-tests / thash_autotest OK 0.17 s
103/110 DPDK:fast-tests / threads_autotest OK 0.32 s
104/110 DPDK:fast-tests / ticketlock_autotest OK 0.22 s
105/110 DPDK:fast-tests / timer_autotest OK 2.83 s
106/110 DPDK:fast-tests / trace_autotest OK 0.22 s
107/110 DPDK:fast-tests / trace_autotest_with_traces OK 0.17 s
108/110 DPDK:fast-tests / vdev_autotest OK 0.17 s
109/110 DPDK:fast-tests / version_autotest OK 0.17 s
110/110 DPDK:fast-tests / telemetry_all SKIP 0.07 s
Ok: 103
Expected Fail: 0
Fail: 0
Unexpected Pass: 0
Skipped: 7
Timeout: 0
Full log written to /home-local/jenkins-local/jenkins-agent/workspace/Generic-Unit-Test-DPDK/dpdk/build/meson-logs/testlog.txt
ninja: Entering directory `/home-local/jenkins-local/jenkins-agent/workspace/Generic-Unit-Test-DPDK/dpdk/build'
ninja: no work to do.
1/2 DPDK:driver-tests / cryptodev_openssl_autotest FAIL 1.42 s (killed by signal 11 SIGSEGV)
2/2 DPDK:driver-tests / cryptodev_openssl_asym_autotest OK 0.12 s
Ok: 1
Expected Fail: 0
Fail: 1
Unexpected Pass: 0
Skipped: 0
Timeout: 0
Full log written to /home-local/jenkins-local/jenkins-agent/workspace/Generic-Unit-Test-DPDK/dpdk/build/meson-logs/testlog.txt
Test log output from the failed test cryptodev_openssl_autotest:
Sorry, we were not able to find the logs for this test.
Download the log output from the CI site for this test run.
==== End log output ====
CentOS Stream 10 (ARM)
Kernel: Depends on container host
Compiler: gcc 14.2.1 20241104 (Red Hat 14.2.1-6)
CentOS Stream 9 (ARM)
Kernel: Depends on container host
Compiler: gcc 11.5.0 20240719 (Red Hat 11.5.0-2)
Debian 12 (arm)
Kernel: Depends on container host
Compiler: gcc (Debian 12.2.0-14) 12.2.0
Fedora 40 (ARM)
Kernel: Depends on container host
Compiler: gcc 14.2.1 20240912 (Red Hat 14.2.1-3)
Fedora 40 (ARM Clang)
Kernel: Depends on container host
Compiler: clang 18.1.8 (Fedora 18.1.8-1.fc40)
Fedora 41 (ARM)
Kernel: Depends on container host
Compiler: gcc 14.2.1 20240912 (Red Hat 14.2.1-3)
Fedora 41 (ARM Clang)
Kernel: Depends on container host
Compiler: clang 19.1.5 (Fedora 19.1.5-1.fc41)
Ubuntu 20.04 (ARM)
Kernel: Depends on container host
Compiler: gcc (Ubuntu 9.4.0-1ubuntu1~20.04.2) 9.4.0
Ubuntu 22.04 (ARM)
Kernel: Depends on container host
Compiler: gcc (Ubuntu 11.4.0-1ubuntu1~22.04) 11.4.0
RHEL9 (ARM)
Kernel: Depends on container host
Compiler: gcc 11.5.0 20240719 (Red Hat 11.5.0-2)
32-bit Ubuntu 22.04.4 (ARM)
Kernel: 5.15.83+ aarch64
Compiler: gcc (Ubuntu 11.4.0-1ubuntu1~22.04) 11.4.0
Ubuntu 24.04 (ARM)
Kernel: Depends on container host
Compiler: gcc (Ubuntu 13.3.0-6ubuntu2~24.04) 13.3.0
Ubuntu 20.04 ARM SVE
Kernel: Depends on container host
Compiler: gcc (Ubuntu 10.5.0-1ubuntu1~20.04) 10.5.0
To view detailed results, visit:
https://lab.dpdk.org/results/dashboard/tarballs/33159/
UNH-IOL DPDK Community Lab
To manage your email subscriptions, visit:
https://lab.dpdk.org/results/dashboard/preferences/subscriptions/
^ permalink raw reply [flat|nested] 23+ messages in thread
* |FAILURE| [GIT MASTER] 669ba8067b3c7a1467999e826e396cb97332cbc6
@ 2025-04-05 9:49 dpdklab
0 siblings, 0 replies; 23+ messages in thread
From: dpdklab @ 2025-04-05 9:49 UTC (permalink / raw)
To: Test Report
Cc: dpdk-test-reports, Xueming Li, Christian Ehrhardt, Kevin Traynor,
Luca Boccassi
_Testing issues_
Branch: 23.11-staging
669ba8067b3c7a1467999e826e396cb97332cbc6 --> testing issues
Upstream job id: Generic-Unit-Test-DPDK#329001
Test environment and result as below:
+-----------------------------+----------------+--------------+---------------------------+------------------------------+
| Environment | dpdk_unit_test | lpm_autotest | cryptodev_sw_zuc_autotest | cryptodev_sw_snow3g_autotest |
+=============================+================+==============+===========================+==============================+
| CentOS Stream 10 (ARM) | FAIL | SKIPPED | SKIPPED | SKIPPED |
+-----------------------------+----------------+--------------+---------------------------+------------------------------+
| CentOS Stream 9 (ARM) | FAIL | SKIPPED | SKIPPED | SKIPPED |
+-----------------------------+----------------+--------------+---------------------------+------------------------------+
| Debian 12 (arm) | FAIL | SKIPPED | PEND | PEND |
+-----------------------------+----------------+--------------+---------------------------+------------------------------+
| Fedora 40 (ARM) | FAIL | SKIPPED | SKIPPED | SKIPPED |
+-----------------------------+----------------+--------------+---------------------------+------------------------------+
| Fedora 40 (ARM Clang) | FAIL | SKIPPED | SKIPPED | SKIPPED |
+-----------------------------+----------------+--------------+---------------------------+------------------------------+
| Fedora 41 (ARM) | FAIL | SKIPPED | SKIPPED | SKIPPED |
+-----------------------------+----------------+--------------+---------------------------+------------------------------+
| Fedora 41 (ARM Clang) | FAIL | SKIPPED | SKIPPED | SKIPPED |
+-----------------------------+----------------+--------------+---------------------------+------------------------------+
| Ubuntu 20.04 (ARM) | PEND | SKIPPED | SKIPPED | SKIPPED |
+-----------------------------+----------------+--------------+---------------------------+------------------------------+
| Ubuntu 22.04 (ARM) | PEND | SKIPPED | SKIPPED | SKIPPED |
+-----------------------------+----------------+--------------+---------------------------+------------------------------+
| RHEL9 (ARM) | PEND | SKIPPED | SKIPPED | SKIPPED |
+-----------------------------+----------------+--------------+---------------------------+------------------------------+
| 32-bit Ubuntu 22.04.4 (ARM) | PASS | SKIPPED | SKIPPED | SKIPPED |
+-----------------------------+----------------+--------------+---------------------------+------------------------------+
| Ubuntu 24.04 (ARM) | PEND | SKIPPED | SKIPPED | SKIPPED |
+-----------------------------+----------------+--------------+---------------------------+------------------------------+
| Ubuntu 20.04 ARM SVE | SKIPPED | PEND | SKIPPED | SKIPPED |
+-----------------------------+----------------+--------------+---------------------------+------------------------------+
==== Unit test summary for Fedora 41 (ARM Clang) (dpdk_unit_test): ====
ninja: Entering directory `/home-local/jenkins-local/jenkins-agent/workspace/Generic-Unit-Test-DPDK/dpdk/build'
ninja: no work to do.
1/110 DPDK:fast-tests / acl_autotest OK 5.08 s
2/110 DPDK:fast-tests / atomic_autotest OK 4.98 s
3/110 DPDK:fast-tests / bitcount_autotest OK 0.17 s
4/110 DPDK:fast-tests / bitmap_autotest OK 0.17 s
5/110 DPDK:fast-tests / bitops_autotest OK 0.17 s
6/110 DPDK:fast-tests / bitratestats_autotest OK 0.17 s
7/110 DPDK:fast-tests / bpf_autotest OK 0.17 s
8/110 DPDK:fast-tests / bpf_convert_autotest OK 0.17 s
9/110 DPDK:fast-tests / byteorder_autotest OK 0.17 s
10/110 DPDK:fast-tests / cksum_autotest OK 0.17 s
11/110 DPDK:fast-tests / cmdline_autotest OK 0.17 s
12/110 DPDK:fast-tests / common_autotest OK 1.07 s
13/110 DPDK:fast-tests / compressdev_autotest SKIP 0.07 s
14/110 DPDK:fast-tests / cpuflags_autotest OK 0.17 s
15/110 DPDK:fast-tests / crc_autotest OK 0.17 s
16/110 DPDK:fast-tests / user_delay_us OK 0.17 s
17/110 DPDK:fast-tests / debug_autotest OK 0.87 s
18/110 DPDK:fast-tests / devargs_autotest OK 0.17 s
19/110 DPDK:fast-tests / dispatcher_autotest OK 2.33 s
20/110 DPDK:fast-tests / distributor_autotest OK 0.77 s
21/110 DPDK:fast-tests / eal_flags_c_opt_autotest OK 0.82 s
22/110 DPDK:fast-tests / eal_flags_main_opt_autotest OK 0.27 s
23/110 DPDK:fast-tests / eal_flags_n_opt_autotest OK 0.22 s
24/110 DPDK:fast-tests / eal_flags_hpet_autotest OK 0.17 s
25/110 DPDK:fast-tests / eal_flags_no_huge_autotest OK 0.32 s
26/110 DPDK:fast-tests / eal_flags_a_opt_autotest OK 0.37 s
27/110 DPDK:fast-tests / eal_flags_b_opt_autotest OK 0.32 s
28/110 DPDK:fast-tests / eal_flags_vdev_opt_autotest OK 0.27 s
29/110 DPDK:fast-tests / eal_flags_r_opt_autotest OK 0.22 s
30/110 DPDK:fast-tests / eal_flags_mem_autotest OK 0.37 s
31/110 DPDK:fast-tests / eal_flags_file_prefix_autotest OK 1.28 s
32/110 DPDK:fast-tests / eal_flags_misc_autotest OK 1.02 s
33/110 DPDK:fast-tests / eal_fs_autotest OK 0.22 s
34/110 DPDK:fast-tests / errno_autotest OK 0.17 s
35/110 DPDK:fast-tests / ethdev_link_status OK 0.17 s
36/110 DPDK:fast-tests / event_eth_tx_adapter_autotest OK 1.17 s
37/110 DPDK:fast-tests / event_ring_autotest OK 0.17 s
38/110 DPDK:fast-tests / eventdev_common_autotest OK 0.17 s
39/110 DPDK:fast-tests / eventdev_selftest_sw OK 6.42 s
40/110 DPDK:fast-tests / fbarray_autotest OK 0.17 s
41/110 DPDK:fast-tests / fib_autotest OK 0.82 s
42/110 DPDK:fast-tests / fib6_autotest OK 0.92 s
43/110 DPDK:fast-tests / func_reentrancy_autotest OK 0.77 s
44/110 DPDK:fast-tests / graph_autotest OK 0.22 s
45/110 DPDK:fast-tests / node_list_dump OK 0.17 s
46/110 DPDK:fast-tests / hash_autotest OK 0.62 s
47/110 DPDK:fast-tests / hash_readwrite_func_autotest OK 8.44 s
48/110 DPDK:fast-tests / interrupt_autotest OK 1.17 s
49/110 DPDK:fast-tests / ipfrag_autotest OK 0.07 s
50/110 DPDK:fast-tests / ipsec_autotest SKIP 0.17 s
51/110 DPDK:fast-tests / kvargs_autotest OK 0.17 s
52/110 DPDK:fast-tests / latencystats_autotest OK 0.17 s
53/110 DPDK:fast-tests / lcores_autotest OK 3.12 s
54/110 DPDK:fast-tests / logs_autotest OK 0.17 s
55/110 DPDK:fast-tests / lpm_autotest OK 1.67 s
56/110 DPDK:fast-tests / lpm6_autotest OK 5.08 s
57/110 DPDK:fast-tests / malloc_autotest OK 0.42 s
58/110 DPDK:fast-tests / mbuf_autotest OK 3.02 s
59/110 DPDK:fast-tests / mcslock_autotest OK 0.87 s
60/110 DPDK:fast-tests / member_autotest OK 1.64 s
61/110 DPDK:fast-tests / memcpy_autotest OK 5.63 s
62/110 DPDK:fast-tests / memory_autotest OK 0.07 s
63/110 DPDK:fast-tests / mempool_autotest OK 0.42 s
64/110 DPDK:fast-tests / memzone_autotest OK 0.12 s
65/110 DPDK:fast-tests / meter_autotest OK 0.17 s
66/110 DPDK:fast-tests / metrics_autotest OK 0.17 s
67/110 DPDK:fast-tests / multiprocess_autotest OK 0.22 s
68/110 DPDK:fast-tests / net_ether_autotest OK 0.93 s
69/110 DPDK:fast-tests / pdcp_autotest SKIP 0.12 s
70/110 DPDK:fast-tests / pdump_autotest OK 0.37 s
71/110 DPDK:fast-tests / per_lcore_autotest OK 0.27 s
72/110 DPDK:fast-tests / pflock_autotest OK 0.47 s
73/110 DPDK:fast-tests / pie_autotest OK 0.17 s
74/110 DPDK:fast-tests / ring_pmd_autotest OK 0.17 s
75/110 DPDK:fast-tests / power_autotest OK 0.17 s
76/110 DPDK:fast-tests / power_cpufreq_autotest SKIP 0.07 s
77/110 DPDK:fast-tests / power_intel_uncore_autotest SKIP 0.17 s
78/110 DPDK:fast-tests / power_kvm_vm_autotest SKIP 0.07 s
79/110 DPDK:fast-tests / prefetch_autotest OK 0.17 s
80/110 DPDK:fast-tests / rawdev_autotest OK 0.17 s
81/110 DPDK:fast-tests / rcu_qsbr_autotest OK 0.62 s
82/110 DPDK:fast-tests / reorder_autotest OK 0.42 s
83/110 DPDK:fast-tests / rib_autotest OK 3.98 s
84/110 DPDK:fast-tests / rib6_autotest OK 3.88 s
85/110 DPDK:fast-tests / ring_autotest OK 0.17 s
86/110 DPDK:fast-tests / rwlock_test1_autotest OK 0.52 s
87/110 DPDK:fast-tests / rwlock_rda_autotest OK 5.18 s
88/110 DPDK:fast-tests / rwlock_rds_wrm_autotest OK 5.19 s
89/110 DPDK:fast-tests / rwlock_rde_wro_autotest OK 5.15 s
90/110 DPDK:fast-tests / sched_autotest OK 0.17 s
91/110 DPDK:fast-tests / security_autotest OK 0.07 s
92/110 DPDK:fast-tests / seqlock_autotest OK 2.22 s
93/110 DPDK:fast-tests / service_autotest OK 2.87 s
94/110 DPDK:fast-tests / spinlock_autotest OK 0.17 s
95/110 DPDK:fast-tests / stack_autotest OK 0.37 s
96/110 DPDK:fast-tests / stack_lf_autotest OK 0.32 s
97/110 DPDK:fast-tests / string_autotest OK 0.17 s
98/110 DPDK:fast-tests / table_autotest OK 7.24 s
99/110 DPDK:fast-tests / tailq_autotest OK 0.13 s
100/110 DPDK:fast-tests / telemetry_data_autotest OK 0.17 s
101/110 DPDK:fast-tests / telemetry_json_autotest OK 0.17 s
102/110 DPDK:fast-tests / thash_autotest OK 0.17 s
103/110 DPDK:fast-tests / threads_autotest OK 0.37 s
104/110 DPDK:fast-tests / ticketlock_autotest OK 0.22 s
105/110 DPDK:fast-tests / timer_autotest OK 2.84 s
106/110 DPDK:fast-tests / trace_autotest OK 0.17 s
107/110 DPDK:fast-tests / trace_autotest_with_traces OK 0.22 s
108/110 DPDK:fast-tests / vdev_autotest OK 0.17 s
109/110 DPDK:fast-tests / version_autotest OK 0.17 s
110/110 DPDK:fast-tests / telemetry_all SKIP 0.01 s
Ok: 103
Expected Fail: 0
Fail: 0
Unexpected Pass: 0
Skipped: 7
Timeout: 0
Full log written to /home-local/jenkins-local/jenkins-agent/workspace/Generic-Unit-Test-DPDK/dpdk/build/meson-logs/testlog.txt
ninja: Entering directory `/home-local/jenkins-local/jenkins-agent/workspace/Generic-Unit-Test-DPDK/dpdk/build'
ninja: no work to do.
1/2 DPDK:driver-tests / cryptodev_openssl_autotest FAIL 1.41 s (killed by signal 11 SIGSEGV)
2/2 DPDK:driver-tests / cryptodev_openssl_asym_autotest OK 0.17 s
Ok: 1
Expected Fail: 0
Fail: 1
Unexpected Pass: 0
Skipped: 0
Timeout: 0
Full log written to /home-local/jenkins-local/jenkins-agent/workspace/Generic-Unit-Test-DPDK/dpdk/build/meson-logs/testlog.txt
Test log output from the failed test cryptodev_openssl_autotest:
Sorry, we were not able to find the logs for this test.
Download the log output from the CI site for this test run.
==== End log output ====
CentOS Stream 10 (ARM)
Kernel: Depends on container host
Compiler: gcc 14.2.1 20241104 (Red Hat 14.2.1-6)
CentOS Stream 9 (ARM)
Kernel: Depends on container host
Compiler: gcc 11.5.0 20240719 (Red Hat 11.5.0-2)
Debian 12 (arm)
Kernel: Depends on container host
Compiler: gcc (Debian 12.2.0-14) 12.2.0
Fedora 40 (ARM)
Kernel: Depends on container host
Compiler: gcc 14.2.1 20240912 (Red Hat 14.2.1-3)
Fedora 40 (ARM Clang)
Kernel: Depends on container host
Compiler: clang 18.1.8 (Fedora 18.1.8-1.fc40)
Fedora 41 (ARM)
Kernel: Depends on container host
Compiler: gcc 14.2.1 20240912 (Red Hat 14.2.1-3)
Fedora 41 (ARM Clang)
Kernel: Depends on container host
Compiler: clang 19.1.5 (Fedora 19.1.5-1.fc41)
Ubuntu 20.04 (ARM)
Kernel: Depends on container host
Compiler: gcc (Ubuntu 9.4.0-1ubuntu1~20.04.2) 9.4.0
Ubuntu 22.04 (ARM)
Kernel: Depends on container host
Compiler: gcc (Ubuntu 11.4.0-1ubuntu1~22.04) 11.4.0
RHEL9 (ARM)
Kernel: Depends on container host
Compiler: gcc 11.5.0 20240719 (Red Hat 11.5.0-2)
32-bit Ubuntu 22.04.4 (ARM)
Kernel: 5.15.83+ aarch64
Compiler: gcc (Ubuntu 11.4.0-1ubuntu1~22.04) 11.4.0
Ubuntu 24.04 (ARM)
Kernel: Depends on container host
Compiler: gcc (Ubuntu 13.3.0-6ubuntu2~24.04) 13.3.0
Ubuntu 20.04 ARM SVE
Kernel: Depends on container host
Compiler: gcc (Ubuntu 10.5.0-1ubuntu1~20.04) 10.5.0
To view detailed results, visit:
https://lab.dpdk.org/results/dashboard/tarballs/33159/
UNH-IOL DPDK Community Lab
To manage your email subscriptions, visit:
https://lab.dpdk.org/results/dashboard/preferences/subscriptions/
^ permalink raw reply [flat|nested] 23+ messages in thread
* |FAILURE| [GIT MASTER] 669ba8067b3c7a1467999e826e396cb97332cbc6
@ 2025-04-05 9:45 dpdklab
0 siblings, 0 replies; 23+ messages in thread
From: dpdklab @ 2025-04-05 9:45 UTC (permalink / raw)
To: Test Report
Cc: dpdk-test-reports, Xueming Li, Christian Ehrhardt, Kevin Traynor,
Luca Boccassi
_Testing issues_
Branch: 23.11-staging
669ba8067b3c7a1467999e826e396cb97332cbc6 --> testing issues
Upstream job id: Generic-Unit-Test-DPDK#329003
Test environment and result as below:
+-----------------------------+----------------+--------------+---------------------------+------------------------------+
| Environment | dpdk_unit_test | lpm_autotest | cryptodev_sw_zuc_autotest | cryptodev_sw_snow3g_autotest |
+=============================+================+==============+===========================+==============================+
| CentOS Stream 10 (ARM) | FAIL | SKIPPED | SKIPPED | SKIPPED |
+-----------------------------+----------------+--------------+---------------------------+------------------------------+
| CentOS Stream 9 (ARM) | FAIL | SKIPPED | SKIPPED | SKIPPED |
+-----------------------------+----------------+--------------+---------------------------+------------------------------+
| Debian 12 (arm) | FAIL | SKIPPED | PEND | PEND |
+-----------------------------+----------------+--------------+---------------------------+------------------------------+
| Fedora 40 (ARM) | FAIL | SKIPPED | SKIPPED | SKIPPED |
+-----------------------------+----------------+--------------+---------------------------+------------------------------+
| Fedora 40 (ARM Clang) | FAIL | SKIPPED | SKIPPED | SKIPPED |
+-----------------------------+----------------+--------------+---------------------------+------------------------------+
| Fedora 41 (ARM) | PEND | SKIPPED | SKIPPED | SKIPPED |
+-----------------------------+----------------+--------------+---------------------------+------------------------------+
| Fedora 41 (ARM Clang) | FAIL | SKIPPED | SKIPPED | SKIPPED |
+-----------------------------+----------------+--------------+---------------------------+------------------------------+
| Ubuntu 20.04 (ARM) | PEND | SKIPPED | SKIPPED | SKIPPED |
+-----------------------------+----------------+--------------+---------------------------+------------------------------+
| Ubuntu 22.04 (ARM) | PEND | SKIPPED | SKIPPED | SKIPPED |
+-----------------------------+----------------+--------------+---------------------------+------------------------------+
| RHEL9 (ARM) | PEND | SKIPPED | SKIPPED | SKIPPED |
+-----------------------------+----------------+--------------+---------------------------+------------------------------+
| 32-bit Ubuntu 22.04.4 (ARM) | PASS | SKIPPED | SKIPPED | SKIPPED |
+-----------------------------+----------------+--------------+---------------------------+------------------------------+
| Ubuntu 24.04 (ARM) | PEND | SKIPPED | SKIPPED | SKIPPED |
+-----------------------------+----------------+--------------+---------------------------+------------------------------+
| Ubuntu 20.04 ARM SVE | SKIPPED | PEND | SKIPPED | SKIPPED |
+-----------------------------+----------------+--------------+---------------------------+------------------------------+
==== Unit test summary for Fedora 41 (ARM Clang) (dpdk_unit_test): ====
ninja: Entering directory `/home-local/jenkins-local/jenkins-agent/workspace/Generic-Unit-Test-DPDK/dpdk/build'
ninja: no work to do.
1/110 DPDK:fast-tests / acl_autotest OK 5.08 s
2/110 DPDK:fast-tests / atomic_autotest OK 4.98 s
3/110 DPDK:fast-tests / bitcount_autotest OK 0.17 s
4/110 DPDK:fast-tests / bitmap_autotest OK 0.17 s
5/110 DPDK:fast-tests / bitops_autotest OK 0.17 s
6/110 DPDK:fast-tests / bitratestats_autotest OK 0.17 s
7/110 DPDK:fast-tests / bpf_autotest OK 0.17 s
8/110 DPDK:fast-tests / bpf_convert_autotest OK 0.17 s
9/110 DPDK:fast-tests / byteorder_autotest OK 0.17 s
10/110 DPDK:fast-tests / cksum_autotest OK 0.17 s
11/110 DPDK:fast-tests / cmdline_autotest OK 0.17 s
12/110 DPDK:fast-tests / common_autotest OK 1.07 s
13/110 DPDK:fast-tests / compressdev_autotest SKIP 0.07 s
14/110 DPDK:fast-tests / cpuflags_autotest OK 0.17 s
15/110 DPDK:fast-tests / crc_autotest OK 0.17 s
16/110 DPDK:fast-tests / user_delay_us OK 0.17 s
17/110 DPDK:fast-tests / debug_autotest OK 0.87 s
18/110 DPDK:fast-tests / devargs_autotest OK 0.17 s
19/110 DPDK:fast-tests / dispatcher_autotest OK 2.33 s
20/110 DPDK:fast-tests / distributor_autotest OK 0.77 s
21/110 DPDK:fast-tests / eal_flags_c_opt_autotest OK 0.82 s
22/110 DPDK:fast-tests / eal_flags_main_opt_autotest OK 0.27 s
23/110 DPDK:fast-tests / eal_flags_n_opt_autotest OK 0.22 s
24/110 DPDK:fast-tests / eal_flags_hpet_autotest OK 0.17 s
25/110 DPDK:fast-tests / eal_flags_no_huge_autotest OK 0.32 s
26/110 DPDK:fast-tests / eal_flags_a_opt_autotest OK 0.37 s
27/110 DPDK:fast-tests / eal_flags_b_opt_autotest OK 0.32 s
28/110 DPDK:fast-tests / eal_flags_vdev_opt_autotest OK 0.27 s
29/110 DPDK:fast-tests / eal_flags_r_opt_autotest OK 0.22 s
30/110 DPDK:fast-tests / eal_flags_mem_autotest OK 0.37 s
31/110 DPDK:fast-tests / eal_flags_file_prefix_autotest OK 1.28 s
32/110 DPDK:fast-tests / eal_flags_misc_autotest OK 1.02 s
33/110 DPDK:fast-tests / eal_fs_autotest OK 0.22 s
34/110 DPDK:fast-tests / errno_autotest OK 0.17 s
35/110 DPDK:fast-tests / ethdev_link_status OK 0.17 s
36/110 DPDK:fast-tests / event_eth_tx_adapter_autotest OK 1.17 s
37/110 DPDK:fast-tests / event_ring_autotest OK 0.17 s
38/110 DPDK:fast-tests / eventdev_common_autotest OK 0.17 s
39/110 DPDK:fast-tests / eventdev_selftest_sw OK 6.42 s
40/110 DPDK:fast-tests / fbarray_autotest OK 0.17 s
41/110 DPDK:fast-tests / fib_autotest OK 0.82 s
42/110 DPDK:fast-tests / fib6_autotest OK 0.92 s
43/110 DPDK:fast-tests / func_reentrancy_autotest OK 0.77 s
44/110 DPDK:fast-tests / graph_autotest OK 0.22 s
45/110 DPDK:fast-tests / node_list_dump OK 0.17 s
46/110 DPDK:fast-tests / hash_autotest OK 0.62 s
47/110 DPDK:fast-tests / hash_readwrite_func_autotest OK 8.44 s
48/110 DPDK:fast-tests / interrupt_autotest OK 1.17 s
49/110 DPDK:fast-tests / ipfrag_autotest OK 0.07 s
50/110 DPDK:fast-tests / ipsec_autotest SKIP 0.17 s
51/110 DPDK:fast-tests / kvargs_autotest OK 0.17 s
52/110 DPDK:fast-tests / latencystats_autotest OK 0.17 s
53/110 DPDK:fast-tests / lcores_autotest OK 3.12 s
54/110 DPDK:fast-tests / logs_autotest OK 0.17 s
55/110 DPDK:fast-tests / lpm_autotest OK 1.67 s
56/110 DPDK:fast-tests / lpm6_autotest OK 5.08 s
57/110 DPDK:fast-tests / malloc_autotest OK 0.42 s
58/110 DPDK:fast-tests / mbuf_autotest OK 3.02 s
59/110 DPDK:fast-tests / mcslock_autotest OK 0.87 s
60/110 DPDK:fast-tests / member_autotest OK 1.64 s
61/110 DPDK:fast-tests / memcpy_autotest OK 5.63 s
62/110 DPDK:fast-tests / memory_autotest OK 0.07 s
63/110 DPDK:fast-tests / mempool_autotest OK 0.42 s
64/110 DPDK:fast-tests / memzone_autotest OK 0.12 s
65/110 DPDK:fast-tests / meter_autotest OK 0.17 s
66/110 DPDK:fast-tests / metrics_autotest OK 0.17 s
67/110 DPDK:fast-tests / multiprocess_autotest OK 0.22 s
68/110 DPDK:fast-tests / net_ether_autotest OK 0.93 s
69/110 DPDK:fast-tests / pdcp_autotest SKIP 0.12 s
70/110 DPDK:fast-tests / pdump_autotest OK 0.37 s
71/110 DPDK:fast-tests / per_lcore_autotest OK 0.27 s
72/110 DPDK:fast-tests / pflock_autotest OK 0.47 s
73/110 DPDK:fast-tests / pie_autotest OK 0.17 s
74/110 DPDK:fast-tests / ring_pmd_autotest OK 0.17 s
75/110 DPDK:fast-tests / power_autotest OK 0.17 s
76/110 DPDK:fast-tests / power_cpufreq_autotest SKIP 0.07 s
77/110 DPDK:fast-tests / power_intel_uncore_autotest SKIP 0.17 s
78/110 DPDK:fast-tests / power_kvm_vm_autotest SKIP 0.07 s
79/110 DPDK:fast-tests / prefetch_autotest OK 0.17 s
80/110 DPDK:fast-tests / rawdev_autotest OK 0.17 s
81/110 DPDK:fast-tests / rcu_qsbr_autotest OK 0.62 s
82/110 DPDK:fast-tests / reorder_autotest OK 0.42 s
83/110 DPDK:fast-tests / rib_autotest OK 3.98 s
84/110 DPDK:fast-tests / rib6_autotest OK 3.88 s
85/110 DPDK:fast-tests / ring_autotest OK 0.17 s
86/110 DPDK:fast-tests / rwlock_test1_autotest OK 0.52 s
87/110 DPDK:fast-tests / rwlock_rda_autotest OK 5.18 s
88/110 DPDK:fast-tests / rwlock_rds_wrm_autotest OK 5.19 s
89/110 DPDK:fast-tests / rwlock_rde_wro_autotest OK 5.15 s
90/110 DPDK:fast-tests / sched_autotest OK 0.17 s
91/110 DPDK:fast-tests / security_autotest OK 0.07 s
92/110 DPDK:fast-tests / seqlock_autotest OK 2.22 s
93/110 DPDK:fast-tests / service_autotest OK 2.87 s
94/110 DPDK:fast-tests / spinlock_autotest OK 0.17 s
95/110 DPDK:fast-tests / stack_autotest OK 0.37 s
96/110 DPDK:fast-tests / stack_lf_autotest OK 0.32 s
97/110 DPDK:fast-tests / string_autotest OK 0.17 s
98/110 DPDK:fast-tests / table_autotest OK 7.24 s
99/110 DPDK:fast-tests / tailq_autotest OK 0.13 s
100/110 DPDK:fast-tests / telemetry_data_autotest OK 0.17 s
101/110 DPDK:fast-tests / telemetry_json_autotest OK 0.17 s
102/110 DPDK:fast-tests / thash_autotest OK 0.17 s
103/110 DPDK:fast-tests / threads_autotest OK 0.37 s
104/110 DPDK:fast-tests / ticketlock_autotest OK 0.22 s
105/110 DPDK:fast-tests / timer_autotest OK 2.84 s
106/110 DPDK:fast-tests / trace_autotest OK 0.17 s
107/110 DPDK:fast-tests / trace_autotest_with_traces OK 0.22 s
108/110 DPDK:fast-tests / vdev_autotest OK 0.17 s
109/110 DPDK:fast-tests / version_autotest OK 0.17 s
110/110 DPDK:fast-tests / telemetry_all SKIP 0.01 s
Ok: 103
Expected Fail: 0
Fail: 0
Unexpected Pass: 0
Skipped: 7
Timeout: 0
Full log written to /home-local/jenkins-local/jenkins-agent/workspace/Generic-Unit-Test-DPDK/dpdk/build/meson-logs/testlog.txt
ninja: Entering directory `/home-local/jenkins-local/jenkins-agent/workspace/Generic-Unit-Test-DPDK/dpdk/build'
ninja: no work to do.
1/2 DPDK:driver-tests / cryptodev_openssl_autotest FAIL 1.41 s (killed by signal 11 SIGSEGV)
2/2 DPDK:driver-tests / cryptodev_openssl_asym_autotest OK 0.17 s
Ok: 1
Expected Fail: 0
Fail: 1
Unexpected Pass: 0
Skipped: 0
Timeout: 0
Full log written to /home-local/jenkins-local/jenkins-agent/workspace/Generic-Unit-Test-DPDK/dpdk/build/meson-logs/testlog.txt
Test log output from the failed test cryptodev_openssl_autotest:
Sorry, we were not able to find the logs for this test.
Download the log output from the CI site for this test run.
==== End log output ====
CentOS Stream 10 (ARM)
Kernel: Depends on container host
Compiler: gcc 14.2.1 20241104 (Red Hat 14.2.1-6)
CentOS Stream 9 (ARM)
Kernel: Depends on container host
Compiler: gcc 11.5.0 20240719 (Red Hat 11.5.0-2)
Debian 12 (arm)
Kernel: Depends on container host
Compiler: gcc (Debian 12.2.0-14) 12.2.0
Fedora 40 (ARM)
Kernel: Depends on container host
Compiler: gcc 14.2.1 20240912 (Red Hat 14.2.1-3)
Fedora 40 (ARM Clang)
Kernel: Depends on container host
Compiler: clang 18.1.8 (Fedora 18.1.8-1.fc40)
Fedora 41 (ARM)
Kernel: Depends on container host
Compiler: gcc 14.2.1 20240912 (Red Hat 14.2.1-3)
Fedora 41 (ARM Clang)
Kernel: Depends on container host
Compiler: clang 19.1.5 (Fedora 19.1.5-1.fc41)
Ubuntu 20.04 (ARM)
Kernel: Depends on container host
Compiler: gcc (Ubuntu 9.4.0-1ubuntu1~20.04.2) 9.4.0
Ubuntu 22.04 (ARM)
Kernel: Depends on container host
Compiler: gcc (Ubuntu 11.4.0-1ubuntu1~22.04) 11.4.0
RHEL9 (ARM)
Kernel: Depends on container host
Compiler: gcc 11.5.0 20240719 (Red Hat 11.5.0-2)
32-bit Ubuntu 22.04.4 (ARM)
Kernel: 5.15.83+ aarch64
Compiler: gcc (Ubuntu 11.4.0-1ubuntu1~22.04) 11.4.0
Ubuntu 24.04 (ARM)
Kernel: Depends on container host
Compiler: gcc (Ubuntu 13.3.0-6ubuntu2~24.04) 13.3.0
Ubuntu 20.04 ARM SVE
Kernel: Depends on container host
Compiler: gcc (Ubuntu 10.5.0-1ubuntu1~20.04) 10.5.0
To view detailed results, visit:
https://lab.dpdk.org/results/dashboard/tarballs/33159/
UNH-IOL DPDK Community Lab
To manage your email subscriptions, visit:
https://lab.dpdk.org/results/dashboard/preferences/subscriptions/
^ permalink raw reply [flat|nested] 23+ messages in thread
* |FAILURE| [GIT MASTER] 669ba8067b3c7a1467999e826e396cb97332cbc6
@ 2025-04-05 9:42 dpdklab
0 siblings, 0 replies; 23+ messages in thread
From: dpdklab @ 2025-04-05 9:42 UTC (permalink / raw)
To: Test Report
Cc: dpdk-test-reports, Xueming Li, Christian Ehrhardt, Kevin Traynor,
Luca Boccassi
_Testing issues_
Branch: 23.11-staging
669ba8067b3c7a1467999e826e396cb97332cbc6 --> testing issues
Upstream job id: Generic-VM-Unit-Test-DPDK#27816
Test environment and result as below:
+---------------------+----------------+
| Environment | dpdk_unit_test |
+=====================+================+
| Debian 12 | FAIL |
+---------------------+----------------+
| CentOS Stream 9 | FAIL |
+---------------------+----------------+
| CentOS Stream 10 | FAIL |
+---------------------+----------------+
| Fedora 40 (Clang) | FAIL |
+---------------------+----------------+
| Fedora 40 | FAIL |
+---------------------+----------------+
| Fedora 41 | FAIL |
+---------------------+----------------+
| Fedora 41 (Clang) | FAIL |
+---------------------+----------------+
| Ubuntu 24.04 | FAIL |
+---------------------+----------------+
| RHEL9 | FAIL |
+---------------------+----------------+
| RHEL8 | FAIL |
+---------------------+----------------+
| Ubuntu 22.04 | FAIL |
+---------------------+----------------+
| Ubuntu 20.04 | PASS |
+---------------------+----------------+
| Windows Server 2022 | PASS |
+---------------------+----------------+
==== Unit test summary for Ubuntu 22.04 (dpdk_unit_test): ====
ninja: Entering directory `/home-local/jenkins-local/jenkins-agent/workspace/Generic-Unit-Test-DPDK/dpdk/build'
ninja: no work to do.
1/110 DPDK:fast-tests / acl_autotest OK 2.58 s
2/110 DPDK:fast-tests / atomic_autotest OK 0.37 s
3/110 DPDK:fast-tests / bitcount_autotest OK 0.22 s
4/110 DPDK:fast-tests / bitmap_autotest OK 0.22 s
5/110 DPDK:fast-tests / bitops_autotest OK 0.22 s
6/110 DPDK:fast-tests / bitratestats_autotest OK 0.22 s
7/110 DPDK:fast-tests / bpf_autotest OK 0.22 s
8/110 DPDK:fast-tests / bpf_convert_autotest OK 0.22 s
9/110 DPDK:fast-tests / byteorder_autotest OK 0.22 s
10/110 DPDK:fast-tests / cksum_autotest OK 0.22 s
11/110 DPDK:fast-tests / cmdline_autotest OK 0.22 s
12/110 DPDK:fast-tests / common_autotest OK 0.47 s
13/110 DPDK:fast-tests / compressdev_autotest SKIP 0.17 s
14/110 DPDK:fast-tests / cpuflags_autotest OK 0.22 s
15/110 DPDK:fast-tests / crc_autotest OK 0.22 s
16/110 DPDK:fast-tests / user_delay_us OK 0.22 s
17/110 DPDK:fast-tests / debug_autotest OK 0.47 s
18/110 DPDK:fast-tests / devargs_autotest OK 0.22 s
19/110 DPDK:fast-tests / dispatcher_autotest SKIP 0.17 s
20/110 DPDK:fast-tests / distributor_autotest OK 0.87 s
21/110 DPDK:fast-tests / eal_flags_c_opt_autotest OK 0.72 s
22/110 DPDK:fast-tests / eal_flags_main_opt_autotest OK 0.32 s
23/110 DPDK:fast-tests / eal_flags_n_opt_autotest OK 0.47 s
24/110 DPDK:fast-tests / eal_flags_hpet_autotest OK 0.22 s
25/110 DPDK:fast-tests / eal_flags_no_huge_autotest OK 0.52 s
26/110 DPDK:fast-tests / eal_flags_a_opt_autotest OK 0.37 s
27/110 DPDK:fast-tests / eal_flags_b_opt_autotest OK 0.33 s
28/110 DPDK:fast-tests / eal_flags_vdev_opt_autotest OK 0.57 s
29/110 DPDK:fast-tests / eal_flags_r_opt_autotest OK 0.27 s
30/110 DPDK:fast-tests / eal_flags_mem_autotest OK 0.72 s
31/110 DPDK:fast-tests / eal_flags_file_prefix_autotest OK 2.12 s
32/110 DPDK:fast-tests / eal_flags_misc_autotest OK 1.83 s
33/110 DPDK:fast-tests / eal_fs_autotest OK 0.22 s
34/110 DPDK:fast-tests / errno_autotest OK 0.22 s
35/110 DPDK:fast-tests / ethdev_link_status OK 0.22 s
36/110 DPDK:fast-tests / event_eth_tx_adapter_autotest OK 0.47 s
37/110 DPDK:fast-tests / event_ring_autotest OK 0.22 s
38/110 DPDK:fast-tests / eventdev_common_autotest OK 0.22 s
39/110 DPDK:fast-tests / eventdev_selftest_sw OK 0.27 s
40/110 DPDK:fast-tests / fbarray_autotest OK 0.22 s
41/110 DPDK:fast-tests / fib_autotest OK 0.62 s
42/110 DPDK:fast-tests / fib6_autotest OK 0.62 s
43/110 DPDK:fast-tests / func_reentrancy_autotest OK 0.52 s
44/110 DPDK:fast-tests / graph_autotest OK 0.22 s
45/110 DPDK:fast-tests / node_list_dump OK 0.22 s
46/110 DPDK:fast-tests / hash_autotest OK 0.32 s
47/110 DPDK:fast-tests / hash_readwrite_func_autotest SKIP 0.17 s
48/110 DPDK:fast-tests / interrupt_autotest OK 1.22 s
49/110 DPDK:fast-tests / ipfrag_autotest OK 0.17 s
50/110 DPDK:fast-tests / ipsec_autotest SKIP 0.22 s
51/110 DPDK:fast-tests / kvargs_autotest OK 0.22 s
52/110 DPDK:fast-tests / latencystats_autotest OK 0.22 s
53/110 DPDK:fast-tests / lcores_autotest OK 1.52 s
54/110 DPDK:fast-tests / logs_autotest OK 0.22 s
55/110 DPDK:fast-tests / lpm_autotest OK 1.43 s
56/110 DPDK:fast-tests / lpm6_autotest OK 2.53 s
57/110 DPDK:fast-tests / malloc_autotest OK 0.57 s
58/110 DPDK:fast-tests / mbuf_autotest OK 0.22 s
59/110 DPDK:fast-tests / mcslock_autotest OK 0.47 s
60/110 DPDK:fast-tests / member_autotest OK 0.77 s
61/110 DPDK:fast-tests / memcpy_autotest OK 1.87 s
62/110 DPDK:fast-tests / memory_autotest OK 0.17 s
63/110 DPDK:fast-tests / mempool_autotest OK 0.47 s
64/110 DPDK:fast-tests / memzone_autotest OK 0.17 s
65/110 DPDK:fast-tests / meter_autotest OK 0.22 s
66/110 DPDK:fast-tests / metrics_autotest OK 0.22 s
67/110 DPDK:fast-tests / multiprocess_autotest OK 0.27 s
68/110 DPDK:fast-tests / net_ether_autotest OK 0.52 s
69/110 DPDK:fast-tests / pdcp_autotest SKIP 0.17 s
70/110 DPDK:fast-tests / pdump_autotest OK 0.32 s
71/110 DPDK:fast-tests / per_lcore_autotest OK 0.32 s
72/110 DPDK:fast-tests / pflock_autotest OK 0.32 s
73/110 DPDK:fast-tests / pie_autotest OK 0.22 s
74/110 DPDK:fast-tests / ring_pmd_autotest OK 0.22 s
75/110 DPDK:fast-tests / power_autotest OK 0.22 s
76/110 DPDK:fast-tests / power_cpufreq_autotest SKIP 0.17 s
77/110 DPDK:fast-tests / power_intel_uncore_autotest SKIP 0.22 s
78/110 DPDK:fast-tests / power_kvm_vm_autotest SKIP 0.17 s
79/110 DPDK:fast-tests / prefetch_autotest OK 0.22 s
80/110 DPDK:fast-tests / rawdev_autotest OK 0.22 s
81/110 DPDK:fast-tests / rcu_qsbr_autotest OK 0.32 s
82/110 DPDK:fast-tests / reorder_autotest OK 0.32 s
83/110 DPDK:fast-tests / rib_autotest OK 4.39 s
84/110 DPDK:fast-tests / rib6_autotest OK 4.28 s
85/110 DPDK:fast-tests / ring_autotest OK 0.22 s
86/110 DPDK:fast-tests / rwlock_test1_autotest OK 0.32 s
87/110 DPDK:fast-tests / rwlock_rda_autotest OK 5.18 s
88/110 DPDK:fast-tests / rwlock_rds_wrm_autotest OK 5.18 s
89/110 DPDK:fast-tests / rwlock_rde_wro_autotest OK 5.18 s
90/110 DPDK:fast-tests / sched_autotest OK 0.22 s
91/110 DPDK:fast-tests / security_autotest OK 0.17 s
92/110 DPDK:fast-tests / seqlock_autotest SKIP 0.22 s
93/110 DPDK:fast-tests / service_autotest OK 0.32 s
94/110 DPDK:fast-tests / spinlock_autotest OK 0.22 s
95/110 DPDK:fast-tests / stack_autotest OK 0.22 s
96/110 DPDK:fast-tests / stack_lf_autotest OK 0.27 s
97/110 DPDK:fast-tests / string_autotest OK 0.22 s
98/110 DPDK:fast-tests / table_autotest OK 5.68 s
99/110 DPDK:fast-tests / tailq_autotest OK 0.22 s
100/110 DPDK:fast-tests / telemetry_data_autotest OK 0.22 s
101/110 DPDK:fast-tests / telemetry_json_autotest OK 0.22 s
102/110 DPDK:fast-tests / thash_autotest OK 0.22 s
103/110 DPDK:fast-tests / threads_autotest OK 0.37 s
104/110 DPDK:fast-tests / ticketlock_autotest OK 0.22 s
105/110 DPDK:fast-tests / timer_autotest OK 2.52 s
106/110 DPDK:fast-tests / trace_autotest OK 0.22 s
107/110 DPDK:fast-tests / trace_autotest_with_traces OK 0.22 s
108/110 DPDK:fast-tests / vdev_autotest OK 0.22 s
109/110 DPDK:fast-tests / version_autotest OK 0.22 s
110/110 DPDK:fast-tests / telemetry_all OK 1.07 s
Ok: 101
Expected Fail: 0
Fail: 0
Unexpected Pass: 0
Skipped: 9
Timeout: 0
Full log written to /home-local/jenkins-local/jenkins-agent/workspace/Generic-Unit-Test-DPDK/dpdk/build/meson-logs/testlog.txt
ninja: Entering directory `/home-local/jenkins-local/jenkins-agent/workspace/Generic-Unit-Test-DPDK/dpdk/build'
ninja: no work to do.
1/2 DPDK:driver-tests / cryptodev_openssl_autotest FAIL 0.62 s (killed by signal 11 SIGSEGV)
2/2 DPDK:driver-tests / cryptodev_openssl_asym_autotest OK 0.17 s
Ok: 1
Expected Fail: 0
Fail: 1
Unexpected Pass: 0
Skipped: 0
Timeout: 0
Full log written to /home-local/jenkins-local/jenkins-agent/workspace/Generic-Unit-Test-DPDK/dpdk/build/meson-logs/testlog.txt
Test log output from the failed test cryptodev_openssl_autotest:
Sorry, we were not able to find the logs for this test.
Download the log output from the CI site for this test run.
==== End log output ====
Debian 12
Kernel: Depends on container host
Compiler: gcc (Debian 12.2.0-14) 12.2.0
CentOS Stream 9
Kernel: Depends on container host
Compiler: gcc 11.5.0 20240719 (Red Hat 11.5.0-2)
CentOS Stream 10
Kernel: Depends on container host
Compiler: gcc 14.2.1 20241104 (Red Hat 14.2.1-6)
Fedora 40 (Clang)
Kernel: Depends on container host
Compiler: clang 18.1.8 (Fedora 18.1.8-1.fc40)
Fedora 40
Kernel: Depends on container host
Compiler: gcc 14.2.1 20240912 (Red Hat 14.2.1-3)
Fedora 41
Kernel: Depends on container host
Compiler: gcc 14.2.1 20240912 (Red Hat 14.2.1-3)
Fedora 41 (Clang)
Kernel: Depends on container host
Compiler: clang 19.1.5 (Fedora 19.1.5-1.fc41)
Ubuntu 24.04
Kernel: Depends on container host
Compiler: gcc (Ubuntu 13.3.0-6ubuntu2~24.04) 13.3.0
RHEL9
Kernel: Depends on container host
Compiler: gcc 11.5.0 20240719 (Red Hat 11.5.0-2)
RHEL8
Kernel: Depends on container host
Compiler: gcc 8.5.0 20210514 (Red Hat 8.5.0-22)
Ubuntu 22.04
Kernel: Depends on container host
Compiler: gcc (Ubuntu 11.4.0-1ubuntu1~22.04) 11.4.0
Ubuntu 20.04
Kernel: Depends on container host
Compiler: gcc (Ubuntu 9.4.0-1ubuntu1~20.04.2) 9.4.0
Windows Server 2022
Kernel: 10.0.20348.2031
Compiler: clang 15.0.7, gcc 14.1.0 (MinGW), and MSVC VS 19.39.33521
To view detailed results, visit:
https://lab.dpdk.org/results/dashboard/tarballs/33159/
UNH-IOL DPDK Community Lab
To manage your email subscriptions, visit:
https://lab.dpdk.org/results/dashboard/preferences/subscriptions/
^ permalink raw reply [flat|nested] 23+ messages in thread
* |FAILURE| [GIT MASTER] 669ba8067b3c7a1467999e826e396cb97332cbc6
@ 2025-04-05 9:42 dpdklab
0 siblings, 0 replies; 23+ messages in thread
From: dpdklab @ 2025-04-05 9:42 UTC (permalink / raw)
To: Test Report
Cc: dpdk-test-reports, Xueming Li, Christian Ehrhardt, Kevin Traynor,
Luca Boccassi
_Testing issues_
Branch: 23.11-staging
669ba8067b3c7a1467999e826e396cb97332cbc6 --> testing issues
Upstream job id: Generic-Unit-Test-DPDK#328999
Test environment and result as below:
+-----------------------------+----------------+--------------+---------------------------+------------------------------+
| Environment | dpdk_unit_test | lpm_autotest | cryptodev_sw_zuc_autotest | cryptodev_sw_snow3g_autotest |
+=============================+================+==============+===========================+==============================+
| CentOS Stream 10 (ARM) | FAIL | SKIPPED | SKIPPED | SKIPPED |
+-----------------------------+----------------+--------------+---------------------------+------------------------------+
| CentOS Stream 9 (ARM) | FAIL | SKIPPED | SKIPPED | SKIPPED |
+-----------------------------+----------------+--------------+---------------------------+------------------------------+
| Debian 12 (arm) | FAIL | SKIPPED | PEND | PEND |
+-----------------------------+----------------+--------------+---------------------------+------------------------------+
| Fedora 40 (ARM) | FAIL | SKIPPED | SKIPPED | SKIPPED |
+-----------------------------+----------------+--------------+---------------------------+------------------------------+
| Fedora 40 (ARM Clang) | FAIL | SKIPPED | SKIPPED | SKIPPED |
+-----------------------------+----------------+--------------+---------------------------+------------------------------+
| Fedora 41 (ARM) | PEND | SKIPPED | SKIPPED | SKIPPED |
+-----------------------------+----------------+--------------+---------------------------+------------------------------+
| Fedora 41 (ARM Clang) | PEND | SKIPPED | SKIPPED | SKIPPED |
+-----------------------------+----------------+--------------+---------------------------+------------------------------+
| Ubuntu 20.04 (ARM) | PEND | SKIPPED | SKIPPED | SKIPPED |
+-----------------------------+----------------+--------------+---------------------------+------------------------------+
| Ubuntu 22.04 (ARM) | PEND | SKIPPED | SKIPPED | SKIPPED |
+-----------------------------+----------------+--------------+---------------------------+------------------------------+
| RHEL9 (ARM) | PEND | SKIPPED | SKIPPED | SKIPPED |
+-----------------------------+----------------+--------------+---------------------------+------------------------------+
| 32-bit Ubuntu 22.04.4 (ARM) | PASS | SKIPPED | SKIPPED | SKIPPED |
+-----------------------------+----------------+--------------+---------------------------+------------------------------+
| Ubuntu 24.04 (ARM) | PEND | SKIPPED | SKIPPED | SKIPPED |
+-----------------------------+----------------+--------------+---------------------------+------------------------------+
| Ubuntu 20.04 ARM SVE | SKIPPED | PEND | SKIPPED | SKIPPED |
+-----------------------------+----------------+--------------+---------------------------+------------------------------+
==== Unit test summary for Fedora 40 (ARM Clang) (dpdk_unit_test): ====
ninja: Entering directory `/home-local/jenkins-local/jenkins-agent/workspace/Generic-Unit-Test-DPDK/dpdk/build'
ninja: no work to do.
1/110 DPDK:fast-tests / acl_autotest OK 5.64 s
2/110 DPDK:fast-tests / atomic_autotest OK 5.30 s
3/110 DPDK:fast-tests / bitcount_autotest OK 0.22 s
4/110 DPDK:fast-tests / bitmap_autotest OK 0.17 s
5/110 DPDK:fast-tests / bitops_autotest OK 0.17 s
6/110 DPDK:fast-tests / bitratestats_autotest OK 0.17 s
7/110 DPDK:fast-tests / bpf_autotest OK 0.17 s
8/110 DPDK:fast-tests / bpf_convert_autotest OK 0.17 s
9/110 DPDK:fast-tests / byteorder_autotest OK 0.17 s
10/110 DPDK:fast-tests / cksum_autotest OK 0.17 s
11/110 DPDK:fast-tests / cmdline_autotest OK 0.22 s
12/110 DPDK:fast-tests / common_autotest OK 1.07 s
13/110 DPDK:fast-tests / compressdev_autotest SKIP 0.12 s
14/110 DPDK:fast-tests / cpuflags_autotest OK 0.17 s
15/110 DPDK:fast-tests / crc_autotest OK 0.17 s
16/110 DPDK:fast-tests / user_delay_us OK 0.17 s
17/110 DPDK:fast-tests / debug_autotest OK 0.92 s
18/110 DPDK:fast-tests / devargs_autotest OK 0.17 s
19/110 DPDK:fast-tests / dispatcher_autotest OK 2.12 s
20/110 DPDK:fast-tests / distributor_autotest OK 0.82 s
21/110 DPDK:fast-tests / eal_flags_c_opt_autotest OK 1.17 s
22/110 DPDK:fast-tests / eal_flags_main_opt_autotest OK 0.32 s
23/110 DPDK:fast-tests / eal_flags_n_opt_autotest OK 0.57 s
24/110 DPDK:fast-tests / eal_flags_hpet_autotest OK 0.22 s
25/110 DPDK:fast-tests / eal_flags_no_huge_autotest OK 0.37 s
26/110 DPDK:fast-tests / eal_flags_a_opt_autotest OK 0.52 s
27/110 DPDK:fast-tests / eal_flags_b_opt_autotest OK 0.42 s
28/110 DPDK:fast-tests / eal_flags_vdev_opt_autotest OK 0.32 s
29/110 DPDK:fast-tests / eal_flags_r_opt_autotest OK 0.27 s
30/110 DPDK:fast-tests / eal_flags_mem_autotest OK 0.52 s
31/110 DPDK:fast-tests / eal_flags_file_prefix_autotest OK 1.67 s
32/110 DPDK:fast-tests / eal_flags_misc_autotest OK 1.52 s
33/110 DPDK:fast-tests / eal_fs_autotest OK 4.03 s
34/110 DPDK:fast-tests / errno_autotest OK 0.22 s
35/110 DPDK:fast-tests / ethdev_link_status OK 0.17 s
36/110 DPDK:fast-tests / event_eth_tx_adapter_autotest OK 1.23 s
37/110 DPDK:fast-tests / event_ring_autotest OK 0.17 s
38/110 DPDK:fast-tests / eventdev_common_autotest OK 0.17 s
39/110 DPDK:fast-tests / eventdev_selftest_sw OK 6.76 s
40/110 DPDK:fast-tests / fbarray_autotest OK 0.17 s
41/110 DPDK:fast-tests / fib_autotest OK 0.77 s
42/110 DPDK:fast-tests / fib6_autotest OK 0.87 s
43/110 DPDK:fast-tests / func_reentrancy_autotest OK 0.87 s
44/110 DPDK:fast-tests / graph_autotest OK 0.17 s
45/110 DPDK:fast-tests / node_list_dump OK 0.17 s
46/110 DPDK:fast-tests / hash_autotest OK 0.57 s
47/110 DPDK:fast-tests / hash_readwrite_func_autotest OK 8.43 s
48/110 DPDK:fast-tests / interrupt_autotest OK 1.22 s
49/110 DPDK:fast-tests / ipfrag_autotest OK 0.07 s
50/110 DPDK:fast-tests / ipsec_autotest SKIP 0.17 s
51/110 DPDK:fast-tests / kvargs_autotest OK 0.17 s
52/110 DPDK:fast-tests / latencystats_autotest OK 0.17 s
53/110 DPDK:fast-tests / lcores_autotest OK 3.23 s
54/110 DPDK:fast-tests / logs_autotest OK 0.17 s
55/110 DPDK:fast-tests / lpm_autotest OK 1.67 s
56/110 DPDK:fast-tests / lpm6_autotest OK 4.88 s
57/110 DPDK:fast-tests / malloc_autotest OK 0.43 s
58/110 DPDK:fast-tests / mbuf_autotest OK 4.23 s
59/110 DPDK:fast-tests / mcslock_autotest OK 0.92 s
60/110 DPDK:fast-tests / member_autotest OK 1.57 s
61/110 DPDK:fast-tests / memcpy_autotest OK 6.23 s
62/110 DPDK:fast-tests / memory_autotest OK 0.12 s
63/110 DPDK:fast-tests / mempool_autotest OK 0.57 s
64/110 DPDK:fast-tests / memzone_autotest OK 0.13 s
65/110 DPDK:fast-tests / meter_autotest OK 0.18 s
66/110 DPDK:fast-tests / metrics_autotest OK 0.17 s
67/110 DPDK:fast-tests / multiprocess_autotest OK 0.32 s
68/110 DPDK:fast-tests / net_ether_autotest OK 1.32 s
69/110 DPDK:fast-tests / pdcp_autotest SKIP 0.07 s
70/110 DPDK:fast-tests / pdump_autotest OK 0.47 s
71/110 DPDK:fast-tests / per_lcore_autotest OK 0.28 s
72/110 DPDK:fast-tests / pflock_autotest OK 0.52 s
73/110 DPDK:fast-tests / pie_autotest OK 0.17 s
74/110 DPDK:fast-tests / ring_pmd_autotest OK 0.17 s
75/110 DPDK:fast-tests / power_autotest OK 0.17 s
76/110 DPDK:fast-tests / power_cpufreq_autotest SKIP 0.07 s
77/110 DPDK:fast-tests / power_intel_uncore_autotest SKIP 0.17 s
78/110 DPDK:fast-tests / power_kvm_vm_autotest SKIP 0.12 s
79/110 DPDK:fast-tests / prefetch_autotest OK 0.22 s
80/110 DPDK:fast-tests / rawdev_autotest OK 0.17 s
81/110 DPDK:fast-tests / rcu_qsbr_autotest OK 0.67 s
82/110 DPDK:fast-tests / reorder_autotest OK 0.52 s
83/110 DPDK:fast-tests / rib_autotest OK 3.83 s
84/110 DPDK:fast-tests / rib6_autotest OK 3.84 s
85/110 DPDK:fast-tests / ring_autotest OK 0.17 s
86/110 DPDK:fast-tests / rwlock_test1_autotest OK 0.47 s
87/110 DPDK:fast-tests / rwlock_rda_autotest OK 5.18 s
88/110 DPDK:fast-tests / rwlock_rds_wrm_autotest OK 5.18 s
89/110 DPDK:fast-tests / rwlock_rde_wro_autotest OK 5.18 s
90/110 DPDK:fast-tests / sched_autotest OK 0.17 s
91/110 DPDK:fast-tests / security_autotest OK 0.12 s
92/110 DPDK:fast-tests / seqlock_autotest OK 2.22 s
93/110 DPDK:fast-tests / service_autotest OK 2.88 s
94/110 DPDK:fast-tests / spinlock_autotest OK 0.17 s
95/110 DPDK:fast-tests / stack_autotest OK 0.37 s
96/110 DPDK:fast-tests / stack_lf_autotest OK 0.32 s
97/110 DPDK:fast-tests / string_autotest OK 0.17 s
98/110 DPDK:fast-tests / table_autotest OK 7.09 s
99/110 DPDK:fast-tests / tailq_autotest OK 0.18 s
100/110 DPDK:fast-tests / telemetry_data_autotest OK 0.17 s
101/110 DPDK:fast-tests / telemetry_json_autotest OK 0.17 s
102/110 DPDK:fast-tests / thash_autotest OK 0.17 s
103/110 DPDK:fast-tests / threads_autotest OK 0.32 s
104/110 DPDK:fast-tests / ticketlock_autotest OK 0.22 s
105/110 DPDK:fast-tests / timer_autotest OK 2.82 s
106/110 DPDK:fast-tests / trace_autotest OK 0.17 s
107/110 DPDK:fast-tests / trace_autotest_with_traces OK 0.17 s
108/110 DPDK:fast-tests / vdev_autotest OK 0.17 s
109/110 DPDK:fast-tests / version_autotest OK 0.17 s
110/110 DPDK:fast-tests / telemetry_all SKIP 0.01 s
Ok: 103
Expected Fail: 0
Fail: 0
Unexpected Pass: 0
Skipped: 7
Timeout: 0
Full log written to /home-local/jenkins-local/jenkins-agent/workspace/Generic-Unit-Test-DPDK/dpdk/build/meson-logs/testlog.txt
ninja: Entering directory `/home-local/jenkins-local/jenkins-agent/workspace/Generic-Unit-Test-DPDK/dpdk/build'
ninja: no work to do.
1/2 DPDK:driver-tests / cryptodev_openssl_autotest FAIL 1.17 s (killed by signal 11 SIGSEGV)
2/2 DPDK:driver-tests / cryptodev_openssl_asym_autotest OK 0.17 s
Ok: 1
Expected Fail: 0
Fail: 1
Unexpected Pass: 0
Skipped: 0
Timeout: 0
Full log written to /home-local/jenkins-local/jenkins-agent/workspace/Generic-Unit-Test-DPDK/dpdk/build/meson-logs/testlog.txt
Test log output from the failed test cryptodev_openssl_autotest:
Sorry, we were not able to find the logs for this test.
Download the log output from the CI site for this test run.
==== End log output ====
CentOS Stream 10 (ARM)
Kernel: Depends on container host
Compiler: gcc 14.2.1 20241104 (Red Hat 14.2.1-6)
CentOS Stream 9 (ARM)
Kernel: Depends on container host
Compiler: gcc 11.5.0 20240719 (Red Hat 11.5.0-2)
Debian 12 (arm)
Kernel: Depends on container host
Compiler: gcc (Debian 12.2.0-14) 12.2.0
Fedora 40 (ARM)
Kernel: Depends on container host
Compiler: gcc 14.2.1 20240912 (Red Hat 14.2.1-3)
Fedora 40 (ARM Clang)
Kernel: Depends on container host
Compiler: clang 18.1.8 (Fedora 18.1.8-1.fc40)
Fedora 41 (ARM)
Kernel: Depends on container host
Compiler: gcc 14.2.1 20240912 (Red Hat 14.2.1-3)
Fedora 41 (ARM Clang)
Kernel: Depends on container host
Compiler: clang 19.1.5 (Fedora 19.1.5-1.fc41)
Ubuntu 20.04 (ARM)
Kernel: Depends on container host
Compiler: gcc (Ubuntu 9.4.0-1ubuntu1~20.04.2) 9.4.0
Ubuntu 22.04 (ARM)
Kernel: Depends on container host
Compiler: gcc (Ubuntu 11.4.0-1ubuntu1~22.04) 11.4.0
RHEL9 (ARM)
Kernel: Depends on container host
Compiler: gcc 11.5.0 20240719 (Red Hat 11.5.0-2)
32-bit Ubuntu 22.04.4 (ARM)
Kernel: 5.15.83+ aarch64
Compiler: gcc (Ubuntu 11.4.0-1ubuntu1~22.04) 11.4.0
Ubuntu 24.04 (ARM)
Kernel: Depends on container host
Compiler: gcc (Ubuntu 13.3.0-6ubuntu2~24.04) 13.3.0
Ubuntu 20.04 ARM SVE
Kernel: Depends on container host
Compiler: gcc (Ubuntu 10.5.0-1ubuntu1~20.04) 10.5.0
To view detailed results, visit:
https://lab.dpdk.org/results/dashboard/tarballs/33159/
UNH-IOL DPDK Community Lab
To manage your email subscriptions, visit:
https://lab.dpdk.org/results/dashboard/preferences/subscriptions/
^ permalink raw reply [flat|nested] 23+ messages in thread
* |FAILURE| [GIT MASTER] 669ba8067b3c7a1467999e826e396cb97332cbc6
@ 2025-04-05 9:40 dpdklab
0 siblings, 0 replies; 23+ messages in thread
From: dpdklab @ 2025-04-05 9:40 UTC (permalink / raw)
To: Test Report
Cc: dpdk-test-reports, Xueming Li, Christian Ehrhardt, Kevin Traynor,
Luca Boccassi
_Testing issues_
Branch: 23.11-staging
669ba8067b3c7a1467999e826e396cb97332cbc6 --> testing issues
Upstream job id: Generic-Unit-Test-DPDK#329005
Test environment and result as below:
+---------------------+----------------+
| Environment | dpdk_unit_test |
+=====================+================+
| Debian 12 | FAIL |
+---------------------+----------------+
| CentOS Stream 9 | FAIL |
+---------------------+----------------+
| CentOS Stream 10 | FAIL |
+---------------------+----------------+
| Fedora 40 (Clang) | FAIL |
+---------------------+----------------+
| Fedora 40 | FAIL |
+---------------------+----------------+
| Fedora 41 | FAIL |
+---------------------+----------------+
| Fedora 41 (Clang) | FAIL |
+---------------------+----------------+
| Ubuntu 24.04 | FAIL |
+---------------------+----------------+
| RHEL9 | FAIL |
+---------------------+----------------+
| RHEL8 | FAIL |
+---------------------+----------------+
| Ubuntu 22.04 | FAIL |
+---------------------+----------------+
| Ubuntu 20.04 | PASS |
+---------------------+----------------+
| Windows Server 2022 | PASS |
+---------------------+----------------+
==== Unit test summary for Ubuntu 22.04 (dpdk_unit_test): ====
ninja: Entering directory `/home-local/jenkins-local/jenkins-agent/workspace/Generic-Unit-Test-DPDK/dpdk/build'
ninja: no work to do.
1/110 DPDK:fast-tests / acl_autotest OK 2.58 s
2/110 DPDK:fast-tests / atomic_autotest OK 0.37 s
3/110 DPDK:fast-tests / bitcount_autotest OK 0.22 s
4/110 DPDK:fast-tests / bitmap_autotest OK 0.22 s
5/110 DPDK:fast-tests / bitops_autotest OK 0.22 s
6/110 DPDK:fast-tests / bitratestats_autotest OK 0.22 s
7/110 DPDK:fast-tests / bpf_autotest OK 0.22 s
8/110 DPDK:fast-tests / bpf_convert_autotest OK 0.22 s
9/110 DPDK:fast-tests / byteorder_autotest OK 0.22 s
10/110 DPDK:fast-tests / cksum_autotest OK 0.22 s
11/110 DPDK:fast-tests / cmdline_autotest OK 0.22 s
12/110 DPDK:fast-tests / common_autotest OK 0.47 s
13/110 DPDK:fast-tests / compressdev_autotest SKIP 0.17 s
14/110 DPDK:fast-tests / cpuflags_autotest OK 0.22 s
15/110 DPDK:fast-tests / crc_autotest OK 0.22 s
16/110 DPDK:fast-tests / user_delay_us OK 0.22 s
17/110 DPDK:fast-tests / debug_autotest OK 0.47 s
18/110 DPDK:fast-tests / devargs_autotest OK 0.22 s
19/110 DPDK:fast-tests / dispatcher_autotest SKIP 0.17 s
20/110 DPDK:fast-tests / distributor_autotest OK 0.87 s
21/110 DPDK:fast-tests / eal_flags_c_opt_autotest OK 0.72 s
22/110 DPDK:fast-tests / eal_flags_main_opt_autotest OK 0.32 s
23/110 DPDK:fast-tests / eal_flags_n_opt_autotest OK 0.47 s
24/110 DPDK:fast-tests / eal_flags_hpet_autotest OK 0.22 s
25/110 DPDK:fast-tests / eal_flags_no_huge_autotest OK 0.52 s
26/110 DPDK:fast-tests / eal_flags_a_opt_autotest OK 0.37 s
27/110 DPDK:fast-tests / eal_flags_b_opt_autotest OK 0.33 s
28/110 DPDK:fast-tests / eal_flags_vdev_opt_autotest OK 0.57 s
29/110 DPDK:fast-tests / eal_flags_r_opt_autotest OK 0.27 s
30/110 DPDK:fast-tests / eal_flags_mem_autotest OK 0.72 s
31/110 DPDK:fast-tests / eal_flags_file_prefix_autotest OK 2.12 s
32/110 DPDK:fast-tests / eal_flags_misc_autotest OK 1.83 s
33/110 DPDK:fast-tests / eal_fs_autotest OK 0.22 s
34/110 DPDK:fast-tests / errno_autotest OK 0.22 s
35/110 DPDK:fast-tests / ethdev_link_status OK 0.22 s
36/110 DPDK:fast-tests / event_eth_tx_adapter_autotest OK 0.47 s
37/110 DPDK:fast-tests / event_ring_autotest OK 0.22 s
38/110 DPDK:fast-tests / eventdev_common_autotest OK 0.22 s
39/110 DPDK:fast-tests / eventdev_selftest_sw OK 0.27 s
40/110 DPDK:fast-tests / fbarray_autotest OK 0.22 s
41/110 DPDK:fast-tests / fib_autotest OK 0.62 s
42/110 DPDK:fast-tests / fib6_autotest OK 0.62 s
43/110 DPDK:fast-tests / func_reentrancy_autotest OK 0.52 s
44/110 DPDK:fast-tests / graph_autotest OK 0.22 s
45/110 DPDK:fast-tests / node_list_dump OK 0.22 s
46/110 DPDK:fast-tests / hash_autotest OK 0.32 s
47/110 DPDK:fast-tests / hash_readwrite_func_autotest SKIP 0.17 s
48/110 DPDK:fast-tests / interrupt_autotest OK 1.22 s
49/110 DPDK:fast-tests / ipfrag_autotest OK 0.17 s
50/110 DPDK:fast-tests / ipsec_autotest SKIP 0.22 s
51/110 DPDK:fast-tests / kvargs_autotest OK 0.22 s
52/110 DPDK:fast-tests / latencystats_autotest OK 0.22 s
53/110 DPDK:fast-tests / lcores_autotest OK 1.52 s
54/110 DPDK:fast-tests / logs_autotest OK 0.22 s
55/110 DPDK:fast-tests / lpm_autotest OK 1.43 s
56/110 DPDK:fast-tests / lpm6_autotest OK 2.53 s
57/110 DPDK:fast-tests / malloc_autotest OK 0.57 s
58/110 DPDK:fast-tests / mbuf_autotest OK 0.22 s
59/110 DPDK:fast-tests / mcslock_autotest OK 0.47 s
60/110 DPDK:fast-tests / member_autotest OK 0.77 s
61/110 DPDK:fast-tests / memcpy_autotest OK 1.87 s
62/110 DPDK:fast-tests / memory_autotest OK 0.17 s
63/110 DPDK:fast-tests / mempool_autotest OK 0.47 s
64/110 DPDK:fast-tests / memzone_autotest OK 0.17 s
65/110 DPDK:fast-tests / meter_autotest OK 0.22 s
66/110 DPDK:fast-tests / metrics_autotest OK 0.22 s
67/110 DPDK:fast-tests / multiprocess_autotest OK 0.27 s
68/110 DPDK:fast-tests / net_ether_autotest OK 0.52 s
69/110 DPDK:fast-tests / pdcp_autotest SKIP 0.17 s
70/110 DPDK:fast-tests / pdump_autotest OK 0.32 s
71/110 DPDK:fast-tests / per_lcore_autotest OK 0.32 s
72/110 DPDK:fast-tests / pflock_autotest OK 0.32 s
73/110 DPDK:fast-tests / pie_autotest OK 0.22 s
74/110 DPDK:fast-tests / ring_pmd_autotest OK 0.22 s
75/110 DPDK:fast-tests / power_autotest OK 0.22 s
76/110 DPDK:fast-tests / power_cpufreq_autotest SKIP 0.17 s
77/110 DPDK:fast-tests / power_intel_uncore_autotest SKIP 0.22 s
78/110 DPDK:fast-tests / power_kvm_vm_autotest SKIP 0.17 s
79/110 DPDK:fast-tests / prefetch_autotest OK 0.22 s
80/110 DPDK:fast-tests / rawdev_autotest OK 0.22 s
81/110 DPDK:fast-tests / rcu_qsbr_autotest OK 0.32 s
82/110 DPDK:fast-tests / reorder_autotest OK 0.32 s
83/110 DPDK:fast-tests / rib_autotest OK 4.39 s
84/110 DPDK:fast-tests / rib6_autotest OK 4.28 s
85/110 DPDK:fast-tests / ring_autotest OK 0.22 s
86/110 DPDK:fast-tests / rwlock_test1_autotest OK 0.32 s
87/110 DPDK:fast-tests / rwlock_rda_autotest OK 5.18 s
88/110 DPDK:fast-tests / rwlock_rds_wrm_autotest OK 5.18 s
89/110 DPDK:fast-tests / rwlock_rde_wro_autotest OK 5.18 s
90/110 DPDK:fast-tests / sched_autotest OK 0.22 s
91/110 DPDK:fast-tests / security_autotest OK 0.17 s
92/110 DPDK:fast-tests / seqlock_autotest SKIP 0.22 s
93/110 DPDK:fast-tests / service_autotest OK 0.32 s
94/110 DPDK:fast-tests / spinlock_autotest OK 0.22 s
95/110 DPDK:fast-tests / stack_autotest OK 0.22 s
96/110 DPDK:fast-tests / stack_lf_autotest OK 0.27 s
97/110 DPDK:fast-tests / string_autotest OK 0.22 s
98/110 DPDK:fast-tests / table_autotest OK 5.68 s
99/110 DPDK:fast-tests / tailq_autotest OK 0.22 s
100/110 DPDK:fast-tests / telemetry_data_autotest OK 0.22 s
101/110 DPDK:fast-tests / telemetry_json_autotest OK 0.22 s
102/110 DPDK:fast-tests / thash_autotest OK 0.22 s
103/110 DPDK:fast-tests / threads_autotest OK 0.37 s
104/110 DPDK:fast-tests / ticketlock_autotest OK 0.22 s
105/110 DPDK:fast-tests / timer_autotest OK 2.52 s
106/110 DPDK:fast-tests / trace_autotest OK 0.22 s
107/110 DPDK:fast-tests / trace_autotest_with_traces OK 0.22 s
108/110 DPDK:fast-tests / vdev_autotest OK 0.22 s
109/110 DPDK:fast-tests / version_autotest OK 0.22 s
110/110 DPDK:fast-tests / telemetry_all OK 1.07 s
Ok: 101
Expected Fail: 0
Fail: 0
Unexpected Pass: 0
Skipped: 9
Timeout: 0
Full log written to /home-local/jenkins-local/jenkins-agent/workspace/Generic-Unit-Test-DPDK/dpdk/build/meson-logs/testlog.txt
ninja: Entering directory `/home-local/jenkins-local/jenkins-agent/workspace/Generic-Unit-Test-DPDK/dpdk/build'
ninja: no work to do.
1/2 DPDK:driver-tests / cryptodev_openssl_autotest FAIL 0.62 s (killed by signal 11 SIGSEGV)
2/2 DPDK:driver-tests / cryptodev_openssl_asym_autotest OK 0.17 s
Ok: 1
Expected Fail: 0
Fail: 1
Unexpected Pass: 0
Skipped: 0
Timeout: 0
Full log written to /home-local/jenkins-local/jenkins-agent/workspace/Generic-Unit-Test-DPDK/dpdk/build/meson-logs/testlog.txt
Test log output from the failed test cryptodev_openssl_autotest:
Sorry, we were not able to find the logs for this test.
Download the log output from the CI site for this test run.
==== End log output ====
Debian 12
Kernel: Depends on container host
Compiler: gcc (Debian 12.2.0-14) 12.2.0
CentOS Stream 9
Kernel: Depends on container host
Compiler: gcc 11.5.0 20240719 (Red Hat 11.5.0-2)
CentOS Stream 10
Kernel: Depends on container host
Compiler: gcc 14.2.1 20241104 (Red Hat 14.2.1-6)
Fedora 40 (Clang)
Kernel: Depends on container host
Compiler: clang 18.1.8 (Fedora 18.1.8-1.fc40)
Fedora 40
Kernel: Depends on container host
Compiler: gcc 14.2.1 20240912 (Red Hat 14.2.1-3)
Fedora 41
Kernel: Depends on container host
Compiler: gcc 14.2.1 20240912 (Red Hat 14.2.1-3)
Fedora 41 (Clang)
Kernel: Depends on container host
Compiler: clang 19.1.5 (Fedora 19.1.5-1.fc41)
Ubuntu 24.04
Kernel: Depends on container host
Compiler: gcc (Ubuntu 13.3.0-6ubuntu2~24.04) 13.3.0
RHEL9
Kernel: Depends on container host
Compiler: gcc 11.5.0 20240719 (Red Hat 11.5.0-2)
RHEL8
Kernel: Depends on container host
Compiler: gcc 8.5.0 20210514 (Red Hat 8.5.0-22)
Ubuntu 22.04
Kernel: Depends on container host
Compiler: gcc (Ubuntu 11.4.0-1ubuntu1~22.04) 11.4.0
Ubuntu 20.04
Kernel: Depends on container host
Compiler: gcc (Ubuntu 9.4.0-1ubuntu1~20.04.2) 9.4.0
Windows Server 2022
Kernel: 10.0.20348.2031
Compiler: clang 15.0.7, gcc 14.1.0 (MinGW), and MSVC VS 19.39.33521
To view detailed results, visit:
https://lab.dpdk.org/results/dashboard/tarballs/33159/
UNH-IOL DPDK Community Lab
To manage your email subscriptions, visit:
https://lab.dpdk.org/results/dashboard/preferences/subscriptions/
^ permalink raw reply [flat|nested] 23+ messages in thread
* |FAILURE| [GIT MASTER] 669ba8067b3c7a1467999e826e396cb97332cbc6
@ 2025-04-05 9:35 dpdklab
0 siblings, 0 replies; 23+ messages in thread
From: dpdklab @ 2025-04-05 9:35 UTC (permalink / raw)
To: Test Report
Cc: dpdk-test-reports, Xueming Li, Christian Ehrhardt, Kevin Traynor,
Luca Boccassi
_Testing issues_
Branch: 23.11-staging
669ba8067b3c7a1467999e826e396cb97332cbc6 --> testing issues
Upstream job id: Generic-Unit-Test-DPDK#329009
Test environment and result as below:
+---------------------+----------------+
| Environment | dpdk_unit_test |
+=====================+================+
| Debian 12 | FAIL |
+---------------------+----------------+
| CentOS Stream 9 | FAIL |
+---------------------+----------------+
| CentOS Stream 10 | FAIL |
+---------------------+----------------+
| Fedora 40 (Clang) | FAIL |
+---------------------+----------------+
| Fedora 40 | FAIL |
+---------------------+----------------+
| Fedora 41 | FAIL |
+---------------------+----------------+
| Fedora 41 (Clang) | FAIL |
+---------------------+----------------+
| Ubuntu 24.04 | FAIL |
+---------------------+----------------+
| RHEL9 | PEND |
+---------------------+----------------+
| RHEL8 | FAIL |
+---------------------+----------------+
| Ubuntu 22.04 | FAIL |
+---------------------+----------------+
| Ubuntu 20.04 | PEND |
+---------------------+----------------+
| Windows Server 2022 | PASS |
+---------------------+----------------+
==== Unit test summary for Ubuntu 22.04 (dpdk_unit_test): ====
ninja: Entering directory `/home-local/jenkins-local/jenkins-agent/workspace/Generic-Unit-Test-DPDK/dpdk/build'
ninja: no work to do.
1/110 DPDK:fast-tests / acl_autotest OK 2.58 s
2/110 DPDK:fast-tests / atomic_autotest OK 0.37 s
3/110 DPDK:fast-tests / bitcount_autotest OK 0.22 s
4/110 DPDK:fast-tests / bitmap_autotest OK 0.22 s
5/110 DPDK:fast-tests / bitops_autotest OK 0.22 s
6/110 DPDK:fast-tests / bitratestats_autotest OK 0.22 s
7/110 DPDK:fast-tests / bpf_autotest OK 0.22 s
8/110 DPDK:fast-tests / bpf_convert_autotest OK 0.22 s
9/110 DPDK:fast-tests / byteorder_autotest OK 0.22 s
10/110 DPDK:fast-tests / cksum_autotest OK 0.22 s
11/110 DPDK:fast-tests / cmdline_autotest OK 0.22 s
12/110 DPDK:fast-tests / common_autotest OK 0.47 s
13/110 DPDK:fast-tests / compressdev_autotest SKIP 0.17 s
14/110 DPDK:fast-tests / cpuflags_autotest OK 0.22 s
15/110 DPDK:fast-tests / crc_autotest OK 0.22 s
16/110 DPDK:fast-tests / user_delay_us OK 0.22 s
17/110 DPDK:fast-tests / debug_autotest OK 0.47 s
18/110 DPDK:fast-tests / devargs_autotest OK 0.22 s
19/110 DPDK:fast-tests / dispatcher_autotest SKIP 0.17 s
20/110 DPDK:fast-tests / distributor_autotest OK 0.87 s
21/110 DPDK:fast-tests / eal_flags_c_opt_autotest OK 0.72 s
22/110 DPDK:fast-tests / eal_flags_main_opt_autotest OK 0.32 s
23/110 DPDK:fast-tests / eal_flags_n_opt_autotest OK 0.47 s
24/110 DPDK:fast-tests / eal_flags_hpet_autotest OK 0.22 s
25/110 DPDK:fast-tests / eal_flags_no_huge_autotest OK 0.52 s
26/110 DPDK:fast-tests / eal_flags_a_opt_autotest OK 0.37 s
27/110 DPDK:fast-tests / eal_flags_b_opt_autotest OK 0.33 s
28/110 DPDK:fast-tests / eal_flags_vdev_opt_autotest OK 0.57 s
29/110 DPDK:fast-tests / eal_flags_r_opt_autotest OK 0.27 s
30/110 DPDK:fast-tests / eal_flags_mem_autotest OK 0.72 s
31/110 DPDK:fast-tests / eal_flags_file_prefix_autotest OK 2.12 s
32/110 DPDK:fast-tests / eal_flags_misc_autotest OK 1.83 s
33/110 DPDK:fast-tests / eal_fs_autotest OK 0.22 s
34/110 DPDK:fast-tests / errno_autotest OK 0.22 s
35/110 DPDK:fast-tests / ethdev_link_status OK 0.22 s
36/110 DPDK:fast-tests / event_eth_tx_adapter_autotest OK 0.47 s
37/110 DPDK:fast-tests / event_ring_autotest OK 0.22 s
38/110 DPDK:fast-tests / eventdev_common_autotest OK 0.22 s
39/110 DPDK:fast-tests / eventdev_selftest_sw OK 0.27 s
40/110 DPDK:fast-tests / fbarray_autotest OK 0.22 s
41/110 DPDK:fast-tests / fib_autotest OK 0.62 s
42/110 DPDK:fast-tests / fib6_autotest OK 0.62 s
43/110 DPDK:fast-tests / func_reentrancy_autotest OK 0.52 s
44/110 DPDK:fast-tests / graph_autotest OK 0.22 s
45/110 DPDK:fast-tests / node_list_dump OK 0.22 s
46/110 DPDK:fast-tests / hash_autotest OK 0.32 s
47/110 DPDK:fast-tests / hash_readwrite_func_autotest SKIP 0.17 s
48/110 DPDK:fast-tests / interrupt_autotest OK 1.22 s
49/110 DPDK:fast-tests / ipfrag_autotest OK 0.17 s
50/110 DPDK:fast-tests / ipsec_autotest SKIP 0.22 s
51/110 DPDK:fast-tests / kvargs_autotest OK 0.22 s
52/110 DPDK:fast-tests / latencystats_autotest OK 0.22 s
53/110 DPDK:fast-tests / lcores_autotest OK 1.52 s
54/110 DPDK:fast-tests / logs_autotest OK 0.22 s
55/110 DPDK:fast-tests / lpm_autotest OK 1.43 s
56/110 DPDK:fast-tests / lpm6_autotest OK 2.53 s
57/110 DPDK:fast-tests / malloc_autotest OK 0.57 s
58/110 DPDK:fast-tests / mbuf_autotest OK 0.22 s
59/110 DPDK:fast-tests / mcslock_autotest OK 0.47 s
60/110 DPDK:fast-tests / member_autotest OK 0.77 s
61/110 DPDK:fast-tests / memcpy_autotest OK 1.87 s
62/110 DPDK:fast-tests / memory_autotest OK 0.17 s
63/110 DPDK:fast-tests / mempool_autotest OK 0.47 s
64/110 DPDK:fast-tests / memzone_autotest OK 0.17 s
65/110 DPDK:fast-tests / meter_autotest OK 0.22 s
66/110 DPDK:fast-tests / metrics_autotest OK 0.22 s
67/110 DPDK:fast-tests / multiprocess_autotest OK 0.27 s
68/110 DPDK:fast-tests / net_ether_autotest OK 0.52 s
69/110 DPDK:fast-tests / pdcp_autotest SKIP 0.17 s
70/110 DPDK:fast-tests / pdump_autotest OK 0.32 s
71/110 DPDK:fast-tests / per_lcore_autotest OK 0.32 s
72/110 DPDK:fast-tests / pflock_autotest OK 0.32 s
73/110 DPDK:fast-tests / pie_autotest OK 0.22 s
74/110 DPDK:fast-tests / ring_pmd_autotest OK 0.22 s
75/110 DPDK:fast-tests / power_autotest OK 0.22 s
76/110 DPDK:fast-tests / power_cpufreq_autotest SKIP 0.17 s
77/110 DPDK:fast-tests / power_intel_uncore_autotest SKIP 0.22 s
78/110 DPDK:fast-tests / power_kvm_vm_autotest SKIP 0.17 s
79/110 DPDK:fast-tests / prefetch_autotest OK 0.22 s
80/110 DPDK:fast-tests / rawdev_autotest OK 0.22 s
81/110 DPDK:fast-tests / rcu_qsbr_autotest OK 0.32 s
82/110 DPDK:fast-tests / reorder_autotest OK 0.32 s
83/110 DPDK:fast-tests / rib_autotest OK 4.39 s
84/110 DPDK:fast-tests / rib6_autotest OK 4.28 s
85/110 DPDK:fast-tests / ring_autotest OK 0.22 s
86/110 DPDK:fast-tests / rwlock_test1_autotest OK 0.32 s
87/110 DPDK:fast-tests / rwlock_rda_autotest OK 5.18 s
88/110 DPDK:fast-tests / rwlock_rds_wrm_autotest OK 5.18 s
89/110 DPDK:fast-tests / rwlock_rde_wro_autotest OK 5.18 s
90/110 DPDK:fast-tests / sched_autotest OK 0.22 s
91/110 DPDK:fast-tests / security_autotest OK 0.17 s
92/110 DPDK:fast-tests / seqlock_autotest SKIP 0.22 s
93/110 DPDK:fast-tests / service_autotest OK 0.32 s
94/110 DPDK:fast-tests / spinlock_autotest OK 0.22 s
95/110 DPDK:fast-tests / stack_autotest OK 0.22 s
96/110 DPDK:fast-tests / stack_lf_autotest OK 0.27 s
97/110 DPDK:fast-tests / string_autotest OK 0.22 s
98/110 DPDK:fast-tests / table_autotest OK 5.68 s
99/110 DPDK:fast-tests / tailq_autotest OK 0.22 s
100/110 DPDK:fast-tests / telemetry_data_autotest OK 0.22 s
101/110 DPDK:fast-tests / telemetry_json_autotest OK 0.22 s
102/110 DPDK:fast-tests / thash_autotest OK 0.22 s
103/110 DPDK:fast-tests / threads_autotest OK 0.37 s
104/110 DPDK:fast-tests / ticketlock_autotest OK 0.22 s
105/110 DPDK:fast-tests / timer_autotest OK 2.52 s
106/110 DPDK:fast-tests / trace_autotest OK 0.22 s
107/110 DPDK:fast-tests / trace_autotest_with_traces OK 0.22 s
108/110 DPDK:fast-tests / vdev_autotest OK 0.22 s
109/110 DPDK:fast-tests / version_autotest OK 0.22 s
110/110 DPDK:fast-tests / telemetry_all OK 1.07 s
Ok: 101
Expected Fail: 0
Fail: 0
Unexpected Pass: 0
Skipped: 9
Timeout: 0
Full log written to /home-local/jenkins-local/jenkins-agent/workspace/Generic-Unit-Test-DPDK/dpdk/build/meson-logs/testlog.txt
ninja: Entering directory `/home-local/jenkins-local/jenkins-agent/workspace/Generic-Unit-Test-DPDK/dpdk/build'
ninja: no work to do.
1/2 DPDK:driver-tests / cryptodev_openssl_autotest FAIL 0.62 s (killed by signal 11 SIGSEGV)
2/2 DPDK:driver-tests / cryptodev_openssl_asym_autotest OK 0.17 s
Ok: 1
Expected Fail: 0
Fail: 1
Unexpected Pass: 0
Skipped: 0
Timeout: 0
Full log written to /home-local/jenkins-local/jenkins-agent/workspace/Generic-Unit-Test-DPDK/dpdk/build/meson-logs/testlog.txt
Test log output from the failed test cryptodev_openssl_autotest:
Sorry, we were not able to find the logs for this test.
Download the log output from the CI site for this test run.
==== End log output ====
Debian 12
Kernel: Depends on container host
Compiler: gcc (Debian 12.2.0-14) 12.2.0
CentOS Stream 9
Kernel: Depends on container host
Compiler: gcc 11.5.0 20240719 (Red Hat 11.5.0-2)
CentOS Stream 10
Kernel: Depends on container host
Compiler: gcc 14.2.1 20241104 (Red Hat 14.2.1-6)
Fedora 40 (Clang)
Kernel: Depends on container host
Compiler: clang 18.1.8 (Fedora 18.1.8-1.fc40)
Fedora 40
Kernel: Depends on container host
Compiler: gcc 14.2.1 20240912 (Red Hat 14.2.1-3)
Fedora 41
Kernel: Depends on container host
Compiler: gcc 14.2.1 20240912 (Red Hat 14.2.1-3)
Fedora 41 (Clang)
Kernel: Depends on container host
Compiler: clang 19.1.5 (Fedora 19.1.5-1.fc41)
Ubuntu 24.04
Kernel: Depends on container host
Compiler: gcc (Ubuntu 13.3.0-6ubuntu2~24.04) 13.3.0
RHEL9
Kernel: Depends on container host
Compiler: gcc 11.5.0 20240719 (Red Hat 11.5.0-2)
RHEL8
Kernel: Depends on container host
Compiler: gcc 8.5.0 20210514 (Red Hat 8.5.0-22)
Ubuntu 22.04
Kernel: Depends on container host
Compiler: gcc (Ubuntu 11.4.0-1ubuntu1~22.04) 11.4.0
Ubuntu 20.04
Kernel: Depends on container host
Compiler: gcc (Ubuntu 9.4.0-1ubuntu1~20.04.2) 9.4.0
Windows Server 2022
Kernel: 10.0.20348.2031
Compiler: clang 15.0.7, gcc 14.1.0 (MinGW), and MSVC VS 19.39.33521
To view detailed results, visit:
https://lab.dpdk.org/results/dashboard/tarballs/33159/
UNH-IOL DPDK Community Lab
To manage your email subscriptions, visit:
https://lab.dpdk.org/results/dashboard/preferences/subscriptions/
^ permalink raw reply [flat|nested] 23+ messages in thread
* |FAILURE| [GIT MASTER] 669ba8067b3c7a1467999e826e396cb97332cbc6
@ 2025-04-05 9:35 dpdklab
0 siblings, 0 replies; 23+ messages in thread
From: dpdklab @ 2025-04-05 9:35 UTC (permalink / raw)
To: Test Report
Cc: dpdk-test-reports, Xueming Li, Christian Ehrhardt, Kevin Traynor,
Luca Boccassi
_Testing issues_
Branch: 23.11-staging
669ba8067b3c7a1467999e826e396cb97332cbc6 --> testing issues
Upstream job id: Generic-Unit-Test-DPDK#329007
Test environment and result as below:
+---------------------+----------------+
| Environment | dpdk_unit_test |
+=====================+================+
| Debian 12 | FAIL |
+---------------------+----------------+
| CentOS Stream 9 | FAIL |
+---------------------+----------------+
| CentOS Stream 10 | FAIL |
+---------------------+----------------+
| Fedora 40 (Clang) | FAIL |
+---------------------+----------------+
| Fedora 40 | FAIL |
+---------------------+----------------+
| Fedora 41 | FAIL |
+---------------------+----------------+
| Fedora 41 (Clang) | FAIL |
+---------------------+----------------+
| Ubuntu 24.04 | FAIL |
+---------------------+----------------+
| RHEL9 | PEND |
+---------------------+----------------+
| RHEL8 | FAIL |
+---------------------+----------------+
| Ubuntu 22.04 | FAIL |
+---------------------+----------------+
| Ubuntu 20.04 | PEND |
+---------------------+----------------+
| Windows Server 2022 | PASS |
+---------------------+----------------+
==== Unit test summary for Ubuntu 22.04 (dpdk_unit_test): ====
ninja: Entering directory `/home-local/jenkins-local/jenkins-agent/workspace/Generic-Unit-Test-DPDK/dpdk/build'
ninja: no work to do.
1/110 DPDK:fast-tests / acl_autotest OK 2.58 s
2/110 DPDK:fast-tests / atomic_autotest OK 0.37 s
3/110 DPDK:fast-tests / bitcount_autotest OK 0.22 s
4/110 DPDK:fast-tests / bitmap_autotest OK 0.22 s
5/110 DPDK:fast-tests / bitops_autotest OK 0.22 s
6/110 DPDK:fast-tests / bitratestats_autotest OK 0.22 s
7/110 DPDK:fast-tests / bpf_autotest OK 0.22 s
8/110 DPDK:fast-tests / bpf_convert_autotest OK 0.22 s
9/110 DPDK:fast-tests / byteorder_autotest OK 0.22 s
10/110 DPDK:fast-tests / cksum_autotest OK 0.22 s
11/110 DPDK:fast-tests / cmdline_autotest OK 0.22 s
12/110 DPDK:fast-tests / common_autotest OK 0.47 s
13/110 DPDK:fast-tests / compressdev_autotest SKIP 0.17 s
14/110 DPDK:fast-tests / cpuflags_autotest OK 0.22 s
15/110 DPDK:fast-tests / crc_autotest OK 0.22 s
16/110 DPDK:fast-tests / user_delay_us OK 0.22 s
17/110 DPDK:fast-tests / debug_autotest OK 0.47 s
18/110 DPDK:fast-tests / devargs_autotest OK 0.22 s
19/110 DPDK:fast-tests / dispatcher_autotest SKIP 0.17 s
20/110 DPDK:fast-tests / distributor_autotest OK 0.87 s
21/110 DPDK:fast-tests / eal_flags_c_opt_autotest OK 0.72 s
22/110 DPDK:fast-tests / eal_flags_main_opt_autotest OK 0.32 s
23/110 DPDK:fast-tests / eal_flags_n_opt_autotest OK 0.47 s
24/110 DPDK:fast-tests / eal_flags_hpet_autotest OK 0.22 s
25/110 DPDK:fast-tests / eal_flags_no_huge_autotest OK 0.52 s
26/110 DPDK:fast-tests / eal_flags_a_opt_autotest OK 0.37 s
27/110 DPDK:fast-tests / eal_flags_b_opt_autotest OK 0.33 s
28/110 DPDK:fast-tests / eal_flags_vdev_opt_autotest OK 0.57 s
29/110 DPDK:fast-tests / eal_flags_r_opt_autotest OK 0.27 s
30/110 DPDK:fast-tests / eal_flags_mem_autotest OK 0.72 s
31/110 DPDK:fast-tests / eal_flags_file_prefix_autotest OK 2.12 s
32/110 DPDK:fast-tests / eal_flags_misc_autotest OK 1.83 s
33/110 DPDK:fast-tests / eal_fs_autotest OK 0.22 s
34/110 DPDK:fast-tests / errno_autotest OK 0.22 s
35/110 DPDK:fast-tests / ethdev_link_status OK 0.22 s
36/110 DPDK:fast-tests / event_eth_tx_adapter_autotest OK 0.47 s
37/110 DPDK:fast-tests / event_ring_autotest OK 0.22 s
38/110 DPDK:fast-tests / eventdev_common_autotest OK 0.22 s
39/110 DPDK:fast-tests / eventdev_selftest_sw OK 0.27 s
40/110 DPDK:fast-tests / fbarray_autotest OK 0.22 s
41/110 DPDK:fast-tests / fib_autotest OK 0.62 s
42/110 DPDK:fast-tests / fib6_autotest OK 0.62 s
43/110 DPDK:fast-tests / func_reentrancy_autotest OK 0.52 s
44/110 DPDK:fast-tests / graph_autotest OK 0.22 s
45/110 DPDK:fast-tests / node_list_dump OK 0.22 s
46/110 DPDK:fast-tests / hash_autotest OK 0.32 s
47/110 DPDK:fast-tests / hash_readwrite_func_autotest SKIP 0.17 s
48/110 DPDK:fast-tests / interrupt_autotest OK 1.22 s
49/110 DPDK:fast-tests / ipfrag_autotest OK 0.17 s
50/110 DPDK:fast-tests / ipsec_autotest SKIP 0.22 s
51/110 DPDK:fast-tests / kvargs_autotest OK 0.22 s
52/110 DPDK:fast-tests / latencystats_autotest OK 0.22 s
53/110 DPDK:fast-tests / lcores_autotest OK 1.52 s
54/110 DPDK:fast-tests / logs_autotest OK 0.22 s
55/110 DPDK:fast-tests / lpm_autotest OK 1.43 s
56/110 DPDK:fast-tests / lpm6_autotest OK 2.53 s
57/110 DPDK:fast-tests / malloc_autotest OK 0.57 s
58/110 DPDK:fast-tests / mbuf_autotest OK 0.22 s
59/110 DPDK:fast-tests / mcslock_autotest OK 0.47 s
60/110 DPDK:fast-tests / member_autotest OK 0.77 s
61/110 DPDK:fast-tests / memcpy_autotest OK 1.87 s
62/110 DPDK:fast-tests / memory_autotest OK 0.17 s
63/110 DPDK:fast-tests / mempool_autotest OK 0.47 s
64/110 DPDK:fast-tests / memzone_autotest OK 0.17 s
65/110 DPDK:fast-tests / meter_autotest OK 0.22 s
66/110 DPDK:fast-tests / metrics_autotest OK 0.22 s
67/110 DPDK:fast-tests / multiprocess_autotest OK 0.27 s
68/110 DPDK:fast-tests / net_ether_autotest OK 0.52 s
69/110 DPDK:fast-tests / pdcp_autotest SKIP 0.17 s
70/110 DPDK:fast-tests / pdump_autotest OK 0.32 s
71/110 DPDK:fast-tests / per_lcore_autotest OK 0.32 s
72/110 DPDK:fast-tests / pflock_autotest OK 0.32 s
73/110 DPDK:fast-tests / pie_autotest OK 0.22 s
74/110 DPDK:fast-tests / ring_pmd_autotest OK 0.22 s
75/110 DPDK:fast-tests / power_autotest OK 0.22 s
76/110 DPDK:fast-tests / power_cpufreq_autotest SKIP 0.17 s
77/110 DPDK:fast-tests / power_intel_uncore_autotest SKIP 0.22 s
78/110 DPDK:fast-tests / power_kvm_vm_autotest SKIP 0.17 s
79/110 DPDK:fast-tests / prefetch_autotest OK 0.22 s
80/110 DPDK:fast-tests / rawdev_autotest OK 0.22 s
81/110 DPDK:fast-tests / rcu_qsbr_autotest OK 0.32 s
82/110 DPDK:fast-tests / reorder_autotest OK 0.32 s
83/110 DPDK:fast-tests / rib_autotest OK 4.39 s
84/110 DPDK:fast-tests / rib6_autotest OK 4.28 s
85/110 DPDK:fast-tests / ring_autotest OK 0.22 s
86/110 DPDK:fast-tests / rwlock_test1_autotest OK 0.32 s
87/110 DPDK:fast-tests / rwlock_rda_autotest OK 5.18 s
88/110 DPDK:fast-tests / rwlock_rds_wrm_autotest OK 5.18 s
89/110 DPDK:fast-tests / rwlock_rde_wro_autotest OK 5.18 s
90/110 DPDK:fast-tests / sched_autotest OK 0.22 s
91/110 DPDK:fast-tests / security_autotest OK 0.17 s
92/110 DPDK:fast-tests / seqlock_autotest SKIP 0.22 s
93/110 DPDK:fast-tests / service_autotest OK 0.32 s
94/110 DPDK:fast-tests / spinlock_autotest OK 0.22 s
95/110 DPDK:fast-tests / stack_autotest OK 0.22 s
96/110 DPDK:fast-tests / stack_lf_autotest OK 0.27 s
97/110 DPDK:fast-tests / string_autotest OK 0.22 s
98/110 DPDK:fast-tests / table_autotest OK 5.68 s
99/110 DPDK:fast-tests / tailq_autotest OK 0.22 s
100/110 DPDK:fast-tests / telemetry_data_autotest OK 0.22 s
101/110 DPDK:fast-tests / telemetry_json_autotest OK 0.22 s
102/110 DPDK:fast-tests / thash_autotest OK 0.22 s
103/110 DPDK:fast-tests / threads_autotest OK 0.37 s
104/110 DPDK:fast-tests / ticketlock_autotest OK 0.22 s
105/110 DPDK:fast-tests / timer_autotest OK 2.52 s
106/110 DPDK:fast-tests / trace_autotest OK 0.22 s
107/110 DPDK:fast-tests / trace_autotest_with_traces OK 0.22 s
108/110 DPDK:fast-tests / vdev_autotest OK 0.22 s
109/110 DPDK:fast-tests / version_autotest OK 0.22 s
110/110 DPDK:fast-tests / telemetry_all OK 1.07 s
Ok: 101
Expected Fail: 0
Fail: 0
Unexpected Pass: 0
Skipped: 9
Timeout: 0
Full log written to /home-local/jenkins-local/jenkins-agent/workspace/Generic-Unit-Test-DPDK/dpdk/build/meson-logs/testlog.txt
ninja: Entering directory `/home-local/jenkins-local/jenkins-agent/workspace/Generic-Unit-Test-DPDK/dpdk/build'
ninja: no work to do.
1/2 DPDK:driver-tests / cryptodev_openssl_autotest FAIL 0.62 s (killed by signal 11 SIGSEGV)
2/2 DPDK:driver-tests / cryptodev_openssl_asym_autotest OK 0.17 s
Ok: 1
Expected Fail: 0
Fail: 1
Unexpected Pass: 0
Skipped: 0
Timeout: 0
Full log written to /home-local/jenkins-local/jenkins-agent/workspace/Generic-Unit-Test-DPDK/dpdk/build/meson-logs/testlog.txt
Test log output from the failed test cryptodev_openssl_autotest:
Sorry, we were not able to find the logs for this test.
Download the log output from the CI site for this test run.
==== End log output ====
Debian 12
Kernel: Depends on container host
Compiler: gcc (Debian 12.2.0-14) 12.2.0
CentOS Stream 9
Kernel: Depends on container host
Compiler: gcc 11.5.0 20240719 (Red Hat 11.5.0-2)
CentOS Stream 10
Kernel: Depends on container host
Compiler: gcc 14.2.1 20241104 (Red Hat 14.2.1-6)
Fedora 40 (Clang)
Kernel: Depends on container host
Compiler: clang 18.1.8 (Fedora 18.1.8-1.fc40)
Fedora 40
Kernel: Depends on container host
Compiler: gcc 14.2.1 20240912 (Red Hat 14.2.1-3)
Fedora 41
Kernel: Depends on container host
Compiler: gcc 14.2.1 20240912 (Red Hat 14.2.1-3)
Fedora 41 (Clang)
Kernel: Depends on container host
Compiler: clang 19.1.5 (Fedora 19.1.5-1.fc41)
Ubuntu 24.04
Kernel: Depends on container host
Compiler: gcc (Ubuntu 13.3.0-6ubuntu2~24.04) 13.3.0
RHEL9
Kernel: Depends on container host
Compiler: gcc 11.5.0 20240719 (Red Hat 11.5.0-2)
RHEL8
Kernel: Depends on container host
Compiler: gcc 8.5.0 20210514 (Red Hat 8.5.0-22)
Ubuntu 22.04
Kernel: Depends on container host
Compiler: gcc (Ubuntu 11.4.0-1ubuntu1~22.04) 11.4.0
Ubuntu 20.04
Kernel: Depends on container host
Compiler: gcc (Ubuntu 9.4.0-1ubuntu1~20.04.2) 9.4.0
Windows Server 2022
Kernel: 10.0.20348.2031
Compiler: clang 15.0.7, gcc 14.1.0 (MinGW), and MSVC VS 19.39.33521
To view detailed results, visit:
https://lab.dpdk.org/results/dashboard/tarballs/33159/
UNH-IOL DPDK Community Lab
To manage your email subscriptions, visit:
https://lab.dpdk.org/results/dashboard/preferences/subscriptions/
^ permalink raw reply [flat|nested] 23+ messages in thread
* |FAILURE| [GIT MASTER] 669ba8067b3c7a1467999e826e396cb97332cbc6
@ 2025-04-05 9:35 dpdklab
0 siblings, 0 replies; 23+ messages in thread
From: dpdklab @ 2025-04-05 9:35 UTC (permalink / raw)
To: Test Report
Cc: dpdk-test-reports, Xueming Li, Christian Ehrhardt, Kevin Traynor,
Luca Boccassi
_Testing issues_
Branch: 23.11-staging
669ba8067b3c7a1467999e826e396cb97332cbc6 --> testing issues
Upstream job id: Generic-Unit-Test-DPDK#329004
Test environment and result as below:
+---------------------+----------------+
| Environment | dpdk_unit_test |
+=====================+================+
| Debian 12 | FAIL |
+---------------------+----------------+
| CentOS Stream 9 | FAIL |
+---------------------+----------------+
| CentOS Stream 10 | FAIL |
+---------------------+----------------+
| Fedora 40 (Clang) | FAIL |
+---------------------+----------------+
| Fedora 40 | FAIL |
+---------------------+----------------+
| Fedora 41 | FAIL |
+---------------------+----------------+
| Fedora 41 (Clang) | FAIL |
+---------------------+----------------+
| Ubuntu 24.04 | FAIL |
+---------------------+----------------+
| RHEL9 | PEND |
+---------------------+----------------+
| RHEL8 | FAIL |
+---------------------+----------------+
| Ubuntu 22.04 | FAIL |
+---------------------+----------------+
| Ubuntu 20.04 | PEND |
+---------------------+----------------+
| Windows Server 2022 | PASS |
+---------------------+----------------+
==== Unit test summary for Ubuntu 22.04 (dpdk_unit_test): ====
ninja: Entering directory `/home-local/jenkins-local/jenkins-agent/workspace/Generic-Unit-Test-DPDK/dpdk/build'
ninja: no work to do.
1/110 DPDK:fast-tests / acl_autotest OK 2.58 s
2/110 DPDK:fast-tests / atomic_autotest OK 0.37 s
3/110 DPDK:fast-tests / bitcount_autotest OK 0.22 s
4/110 DPDK:fast-tests / bitmap_autotest OK 0.22 s
5/110 DPDK:fast-tests / bitops_autotest OK 0.22 s
6/110 DPDK:fast-tests / bitratestats_autotest OK 0.22 s
7/110 DPDK:fast-tests / bpf_autotest OK 0.22 s
8/110 DPDK:fast-tests / bpf_convert_autotest OK 0.22 s
9/110 DPDK:fast-tests / byteorder_autotest OK 0.22 s
10/110 DPDK:fast-tests / cksum_autotest OK 0.22 s
11/110 DPDK:fast-tests / cmdline_autotest OK 0.22 s
12/110 DPDK:fast-tests / common_autotest OK 0.47 s
13/110 DPDK:fast-tests / compressdev_autotest SKIP 0.17 s
14/110 DPDK:fast-tests / cpuflags_autotest OK 0.22 s
15/110 DPDK:fast-tests / crc_autotest OK 0.22 s
16/110 DPDK:fast-tests / user_delay_us OK 0.22 s
17/110 DPDK:fast-tests / debug_autotest OK 0.47 s
18/110 DPDK:fast-tests / devargs_autotest OK 0.22 s
19/110 DPDK:fast-tests / dispatcher_autotest SKIP 0.17 s
20/110 DPDK:fast-tests / distributor_autotest OK 0.87 s
21/110 DPDK:fast-tests / eal_flags_c_opt_autotest OK 0.72 s
22/110 DPDK:fast-tests / eal_flags_main_opt_autotest OK 0.32 s
23/110 DPDK:fast-tests / eal_flags_n_opt_autotest OK 0.47 s
24/110 DPDK:fast-tests / eal_flags_hpet_autotest OK 0.22 s
25/110 DPDK:fast-tests / eal_flags_no_huge_autotest OK 0.52 s
26/110 DPDK:fast-tests / eal_flags_a_opt_autotest OK 0.37 s
27/110 DPDK:fast-tests / eal_flags_b_opt_autotest OK 0.33 s
28/110 DPDK:fast-tests / eal_flags_vdev_opt_autotest OK 0.57 s
29/110 DPDK:fast-tests / eal_flags_r_opt_autotest OK 0.27 s
30/110 DPDK:fast-tests / eal_flags_mem_autotest OK 0.72 s
31/110 DPDK:fast-tests / eal_flags_file_prefix_autotest OK 2.12 s
32/110 DPDK:fast-tests / eal_flags_misc_autotest OK 1.83 s
33/110 DPDK:fast-tests / eal_fs_autotest OK 0.22 s
34/110 DPDK:fast-tests / errno_autotest OK 0.22 s
35/110 DPDK:fast-tests / ethdev_link_status OK 0.22 s
36/110 DPDK:fast-tests / event_eth_tx_adapter_autotest OK 0.47 s
37/110 DPDK:fast-tests / event_ring_autotest OK 0.22 s
38/110 DPDK:fast-tests / eventdev_common_autotest OK 0.22 s
39/110 DPDK:fast-tests / eventdev_selftest_sw OK 0.27 s
40/110 DPDK:fast-tests / fbarray_autotest OK 0.22 s
41/110 DPDK:fast-tests / fib_autotest OK 0.62 s
42/110 DPDK:fast-tests / fib6_autotest OK 0.62 s
43/110 DPDK:fast-tests / func_reentrancy_autotest OK 0.52 s
44/110 DPDK:fast-tests / graph_autotest OK 0.22 s
45/110 DPDK:fast-tests / node_list_dump OK 0.22 s
46/110 DPDK:fast-tests / hash_autotest OK 0.32 s
47/110 DPDK:fast-tests / hash_readwrite_func_autotest SKIP 0.17 s
48/110 DPDK:fast-tests / interrupt_autotest OK 1.22 s
49/110 DPDK:fast-tests / ipfrag_autotest OK 0.17 s
50/110 DPDK:fast-tests / ipsec_autotest SKIP 0.22 s
51/110 DPDK:fast-tests / kvargs_autotest OK 0.22 s
52/110 DPDK:fast-tests / latencystats_autotest OK 0.22 s
53/110 DPDK:fast-tests / lcores_autotest OK 1.52 s
54/110 DPDK:fast-tests / logs_autotest OK 0.22 s
55/110 DPDK:fast-tests / lpm_autotest OK 1.43 s
56/110 DPDK:fast-tests / lpm6_autotest OK 2.53 s
57/110 DPDK:fast-tests / malloc_autotest OK 0.57 s
58/110 DPDK:fast-tests / mbuf_autotest OK 0.22 s
59/110 DPDK:fast-tests / mcslock_autotest OK 0.47 s
60/110 DPDK:fast-tests / member_autotest OK 0.77 s
61/110 DPDK:fast-tests / memcpy_autotest OK 1.87 s
62/110 DPDK:fast-tests / memory_autotest OK 0.17 s
63/110 DPDK:fast-tests / mempool_autotest OK 0.47 s
64/110 DPDK:fast-tests / memzone_autotest OK 0.17 s
65/110 DPDK:fast-tests / meter_autotest OK 0.22 s
66/110 DPDK:fast-tests / metrics_autotest OK 0.22 s
67/110 DPDK:fast-tests / multiprocess_autotest OK 0.27 s
68/110 DPDK:fast-tests / net_ether_autotest OK 0.52 s
69/110 DPDK:fast-tests / pdcp_autotest SKIP 0.17 s
70/110 DPDK:fast-tests / pdump_autotest OK 0.32 s
71/110 DPDK:fast-tests / per_lcore_autotest OK 0.32 s
72/110 DPDK:fast-tests / pflock_autotest OK 0.32 s
73/110 DPDK:fast-tests / pie_autotest OK 0.22 s
74/110 DPDK:fast-tests / ring_pmd_autotest OK 0.22 s
75/110 DPDK:fast-tests / power_autotest OK 0.22 s
76/110 DPDK:fast-tests / power_cpufreq_autotest SKIP 0.17 s
77/110 DPDK:fast-tests / power_intel_uncore_autotest SKIP 0.22 s
78/110 DPDK:fast-tests / power_kvm_vm_autotest SKIP 0.17 s
79/110 DPDK:fast-tests / prefetch_autotest OK 0.22 s
80/110 DPDK:fast-tests / rawdev_autotest OK 0.22 s
81/110 DPDK:fast-tests / rcu_qsbr_autotest OK 0.32 s
82/110 DPDK:fast-tests / reorder_autotest OK 0.32 s
83/110 DPDK:fast-tests / rib_autotest OK 4.39 s
84/110 DPDK:fast-tests / rib6_autotest OK 4.28 s
85/110 DPDK:fast-tests / ring_autotest OK 0.22 s
86/110 DPDK:fast-tests / rwlock_test1_autotest OK 0.32 s
87/110 DPDK:fast-tests / rwlock_rda_autotest OK 5.18 s
88/110 DPDK:fast-tests / rwlock_rds_wrm_autotest OK 5.18 s
89/110 DPDK:fast-tests / rwlock_rde_wro_autotest OK 5.18 s
90/110 DPDK:fast-tests / sched_autotest OK 0.22 s
91/110 DPDK:fast-tests / security_autotest OK 0.17 s
92/110 DPDK:fast-tests / seqlock_autotest SKIP 0.22 s
93/110 DPDK:fast-tests / service_autotest OK 0.32 s
94/110 DPDK:fast-tests / spinlock_autotest OK 0.22 s
95/110 DPDK:fast-tests / stack_autotest OK 0.22 s
96/110 DPDK:fast-tests / stack_lf_autotest OK 0.27 s
97/110 DPDK:fast-tests / string_autotest OK 0.22 s
98/110 DPDK:fast-tests / table_autotest OK 5.68 s
99/110 DPDK:fast-tests / tailq_autotest OK 0.22 s
100/110 DPDK:fast-tests / telemetry_data_autotest OK 0.22 s
101/110 DPDK:fast-tests / telemetry_json_autotest OK 0.22 s
102/110 DPDK:fast-tests / thash_autotest OK 0.22 s
103/110 DPDK:fast-tests / threads_autotest OK 0.37 s
104/110 DPDK:fast-tests / ticketlock_autotest OK 0.22 s
105/110 DPDK:fast-tests / timer_autotest OK 2.52 s
106/110 DPDK:fast-tests / trace_autotest OK 0.22 s
107/110 DPDK:fast-tests / trace_autotest_with_traces OK 0.22 s
108/110 DPDK:fast-tests / vdev_autotest OK 0.22 s
109/110 DPDK:fast-tests / version_autotest OK 0.22 s
110/110 DPDK:fast-tests / telemetry_all OK 1.07 s
Ok: 101
Expected Fail: 0
Fail: 0
Unexpected Pass: 0
Skipped: 9
Timeout: 0
Full log written to /home-local/jenkins-local/jenkins-agent/workspace/Generic-Unit-Test-DPDK/dpdk/build/meson-logs/testlog.txt
ninja: Entering directory `/home-local/jenkins-local/jenkins-agent/workspace/Generic-Unit-Test-DPDK/dpdk/build'
ninja: no work to do.
1/2 DPDK:driver-tests / cryptodev_openssl_autotest FAIL 0.62 s (killed by signal 11 SIGSEGV)
2/2 DPDK:driver-tests / cryptodev_openssl_asym_autotest OK 0.17 s
Ok: 1
Expected Fail: 0
Fail: 1
Unexpected Pass: 0
Skipped: 0
Timeout: 0
Full log written to /home-local/jenkins-local/jenkins-agent/workspace/Generic-Unit-Test-DPDK/dpdk/build/meson-logs/testlog.txt
Test log output from the failed test cryptodev_openssl_autotest:
Sorry, we were not able to find the logs for this test.
Download the log output from the CI site for this test run.
==== End log output ====
Debian 12
Kernel: Depends on container host
Compiler: gcc (Debian 12.2.0-14) 12.2.0
CentOS Stream 9
Kernel: Depends on container host
Compiler: gcc 11.5.0 20240719 (Red Hat 11.5.0-2)
CentOS Stream 10
Kernel: Depends on container host
Compiler: gcc 14.2.1 20241104 (Red Hat 14.2.1-6)
Fedora 40 (Clang)
Kernel: Depends on container host
Compiler: clang 18.1.8 (Fedora 18.1.8-1.fc40)
Fedora 40
Kernel: Depends on container host
Compiler: gcc 14.2.1 20240912 (Red Hat 14.2.1-3)
Fedora 41
Kernel: Depends on container host
Compiler: gcc 14.2.1 20240912 (Red Hat 14.2.1-3)
Fedora 41 (Clang)
Kernel: Depends on container host
Compiler: clang 19.1.5 (Fedora 19.1.5-1.fc41)
Ubuntu 24.04
Kernel: Depends on container host
Compiler: gcc (Ubuntu 13.3.0-6ubuntu2~24.04) 13.3.0
RHEL9
Kernel: Depends on container host
Compiler: gcc 11.5.0 20240719 (Red Hat 11.5.0-2)
RHEL8
Kernel: Depends on container host
Compiler: gcc 8.5.0 20210514 (Red Hat 8.5.0-22)
Ubuntu 22.04
Kernel: Depends on container host
Compiler: gcc (Ubuntu 11.4.0-1ubuntu1~22.04) 11.4.0
Ubuntu 20.04
Kernel: Depends on container host
Compiler: gcc (Ubuntu 9.4.0-1ubuntu1~20.04.2) 9.4.0
Windows Server 2022
Kernel: 10.0.20348.2031
Compiler: clang 15.0.7, gcc 14.1.0 (MinGW), and MSVC VS 19.39.33521
To view detailed results, visit:
https://lab.dpdk.org/results/dashboard/tarballs/33159/
UNH-IOL DPDK Community Lab
To manage your email subscriptions, visit:
https://lab.dpdk.org/results/dashboard/preferences/subscriptions/
^ permalink raw reply [flat|nested] 23+ messages in thread
* |FAILURE| [GIT MASTER] 669ba8067b3c7a1467999e826e396cb97332cbc6
@ 2025-04-05 9:31 dpdklab
0 siblings, 0 replies; 23+ messages in thread
From: dpdklab @ 2025-04-05 9:31 UTC (permalink / raw)
To: Test Report
Cc: dpdk-test-reports, Xueming Li, Christian Ehrhardt, Kevin Traynor,
Luca Boccassi
_Testing issues_
Branch: 23.11-staging
669ba8067b3c7a1467999e826e396cb97332cbc6 --> testing issues
Upstream job id: Generic-Unit-Test-DPDK#329011
Test environment and result as below:
+---------------------+----------------+
| Environment | dpdk_unit_test |
+=====================+================+
| Debian 12 | FAIL |
+---------------------+----------------+
| CentOS Stream 9 | FAIL |
+---------------------+----------------+
| CentOS Stream 10 | FAIL |
+---------------------+----------------+
| Fedora 40 (Clang) | FAIL |
+---------------------+----------------+
| Fedora 40 | FAIL |
+---------------------+----------------+
| Fedora 41 | FAIL |
+---------------------+----------------+
| Fedora 41 (Clang) | FAIL |
+---------------------+----------------+
| Ubuntu 24.04 | FAIL |
+---------------------+----------------+
| RHEL9 | PEND |
+---------------------+----------------+
| RHEL8 | PEND |
+---------------------+----------------+
| Ubuntu 22.04 | PEND |
+---------------------+----------------+
| Ubuntu 20.04 | PEND |
+---------------------+----------------+
| Windows Server 2022 | PASS |
+---------------------+----------------+
==== Unit test summary for Ubuntu 24.04 (dpdk_unit_test): ====
ninja: Entering directory `/home-local/jenkins-local/jenkins-agent/workspace/Generic-Unit-Test-DPDK/dpdk/build'
ninja: no work to do.
1/110 DPDK:fast-tests / acl_autotest OK 7.72 s
2/110 DPDK:fast-tests / atomic_autotest OK 0.86 s
3/110 DPDK:fast-tests / bitcount_autotest OK 0.37 s
4/110 DPDK:fast-tests / bitmap_autotest OK 0.41 s
5/110 DPDK:fast-tests / bitops_autotest OK 0.33 s
6/110 DPDK:fast-tests / bitratestats_autotest OK 0.36 s
7/110 DPDK:fast-tests / bpf_autotest OK 0.32 s
8/110 DPDK:fast-tests / bpf_convert_autotest OK 0.33 s
9/110 DPDK:fast-tests / byteorder_autotest OK 0.41 s
10/110 DPDK:fast-tests / cksum_autotest OK 0.29 s
11/110 DPDK:fast-tests / cmdline_autotest OK 0.37 s
12/110 DPDK:fast-tests / common_autotest OK 1.39 s
13/110 DPDK:fast-tests / compressdev_autotest SKIP 0.33 s
14/110 DPDK:fast-tests / cpuflags_autotest OK 0.32 s
15/110 DPDK:fast-tests / crc_autotest OK 0.41 s
16/110 DPDK:fast-tests / user_delay_us OK 0.32 s
17/110 DPDK:fast-tests / debug_autotest OK 1.26 s
18/110 DPDK:fast-tests / devargs_autotest OK 0.38 s
19/110 DPDK:fast-tests / dispatcher_autotest SKIP 0.20 s
20/110 DPDK:fast-tests / distributor_autotest OK 2.15 s
21/110 DPDK:fast-tests / eal_flags_c_opt_autotest OK 1.77 s
22/110 DPDK:fast-tests / eal_flags_main_opt_autotest OK 0.63 s
23/110 DPDK:fast-tests / eal_flags_n_opt_autotest OK 0.71 s
24/110 DPDK:fast-tests / eal_flags_hpet_autotest OK 0.40 s
25/110 DPDK:fast-tests / eal_flags_no_huge_autotest OK 0.65 s
26/110 DPDK:fast-tests / eal_flags_a_opt_autotest OK 0.74 s
27/110 DPDK:fast-tests / eal_flags_b_opt_autotest OK 0.81 s
28/110 DPDK:fast-tests / eal_flags_vdev_opt_autotest OK 0.82 s
29/110 DPDK:fast-tests / eal_flags_r_opt_autotest OK 0.65 s
30/110 DPDK:fast-tests / eal_flags_mem_autotest OK 1.24 s
31/110 DPDK:fast-tests / eal_flags_file_prefix_autotest OK 6.18 s
32/110 DPDK:fast-tests / eal_flags_misc_autotest OK 2.87 s
33/110 DPDK:fast-tests / eal_fs_autotest OK 0.51 s
34/110 DPDK:fast-tests / errno_autotest OK 0.37 s
35/110 DPDK:fast-tests / ethdev_link_status OK 0.26 s
36/110 DPDK:fast-tests / event_eth_tx_adapter_autotest OK 1.00 s
37/110 DPDK:fast-tests / event_ring_autotest OK 0.32 s
38/110 DPDK:fast-tests / eventdev_common_autotest OK 0.29 s
39/110 DPDK:fast-tests / eventdev_selftest_sw OK 0.56 s
40/110 DPDK:fast-tests / fbarray_autotest OK 0.46 s
41/110 DPDK:fast-tests / fib_autotest OK 1.98 s
42/110 DPDK:fast-tests / fib6_autotest OK 1.84 s
43/110 DPDK:fast-tests / func_reentrancy_autotest OK 1.33 s
44/110 DPDK:fast-tests / graph_autotest OK 0.37 s
45/110 DPDK:fast-tests / node_list_dump OK 0.27 s
46/110 DPDK:fast-tests / hash_autotest OK 0.82 s
47/110 DPDK:fast-tests / hash_readwrite_func_autotest SKIP 0.28 s
48/110 DPDK:fast-tests / interrupt_autotest OK 1.68 s
49/110 DPDK:fast-tests / ipfrag_autotest OK 0.43 s
50/110 DPDK:fast-tests / ipsec_autotest SKIP 0.57 s
51/110 DPDK:fast-tests / kvargs_autotest OK 0.45 s
52/110 DPDK:fast-tests / latencystats_autotest OK 0.45 s
53/110 DPDK:fast-tests / lcores_autotest OK 3.55 s
54/110 DPDK:fast-tests / logs_autotest OK 0.37 s
55/110 DPDK:fast-tests / lpm_autotest OK 6.38 s
56/110 DPDK:fast-tests / lpm6_autotest OK 10.26 s
57/110 DPDK:fast-tests / malloc_autotest OK 1.56 s
58/110 DPDK:fast-tests / mbuf_autotest OK 0.39 s
59/110 DPDK:fast-tests / mcslock_autotest OK 1.24 s
60/110 DPDK:fast-tests / member_autotest OK 2.14 s
61/110 DPDK:fast-tests / memcpy_autotest OK 4.76 s
62/110 DPDK:fast-tests / memory_autotest OK 0.39 s
63/110 DPDK:fast-tests / mempool_autotest OK 0.66 s
64/110 DPDK:fast-tests / memzone_autotest OK 0.30 s
65/110 DPDK:fast-tests / meter_autotest OK 0.38 s
66/110 DPDK:fast-tests / metrics_autotest OK 0.35 s
67/110 DPDK:fast-tests / multiprocess_autotest OK 0.66 s
68/110 DPDK:fast-tests / net_ether_autotest OK 1.31 s
69/110 DPDK:fast-tests / pdcp_autotest SKIP 0.31 s
70/110 DPDK:fast-tests / pdump_autotest OK 0.87 s
71/110 DPDK:fast-tests / per_lcore_autotest OK 0.50 s
72/110 DPDK:fast-tests / pflock_autotest OK 0.53 s
73/110 DPDK:fast-tests / pie_autotest OK 0.41 s
74/110 DPDK:fast-tests / ring_pmd_autotest OK 0.40 s
75/110 DPDK:fast-tests / power_autotest OK 0.41 s
76/110 DPDK:fast-tests / power_cpufreq_autotest SKIP 0.35 s
77/110 DPDK:fast-tests / power_intel_uncore_autotest SKIP 0.37 s
78/110 DPDK:fast-tests / power_kvm_vm_autotest SKIP 0.29 s
79/110 DPDK:fast-tests / prefetch_autotest OK 0.42 s
80/110 DPDK:fast-tests / rawdev_autotest OK 0.44 s
81/110 DPDK:fast-tests / rcu_qsbr_autotest OK 0.62 s
82/110 DPDK:fast-tests / reorder_autotest OK 0.98 s
83/110 DPDK:fast-tests / rib_autotest OK 17.07 s
84/110 DPDK:fast-tests / rib6_autotest OK 11.91 s
85/110 DPDK:fast-tests / ring_autotest OK 0.43 s
86/110 DPDK:fast-tests / rwlock_test1_autotest OK 0.47 s
87/110 DPDK:fast-tests / rwlock_rda_autotest OK 5.47 s
88/110 DPDK:fast-tests / rwlock_rds_wrm_autotest OK 5.48 s
89/110 DPDK:fast-tests / rwlock_rde_wro_autotest OK 5.50 s
90/110 DPDK:fast-tests / sched_autotest OK 0.43 s
91/110 DPDK:fast-tests / security_autotest OK 0.24 s
92/110 DPDK:fast-tests / seqlock_autotest SKIP 0.35 s
93/110 DPDK:fast-tests / service_autotest OK 0.55 s
94/110 DPDK:fast-tests / spinlock_autotest OK 0.61 s
95/110 DPDK:fast-tests / stack_autotest OK 0.38 s
96/110 DPDK:fast-tests / stack_lf_autotest OK 0.56 s
97/110 DPDK:fast-tests / string_autotest OK 0.36 s
98/110 DPDK:fast-tests / table_autotest OK 19.52 s
99/110 DPDK:fast-tests / tailq_autotest OK 0.35 s
100/110 DPDK:fast-tests / telemetry_data_autotest OK 0.40 s
101/110 DPDK:fast-tests / telemetry_json_autotest OK 0.23 s
102/110 DPDK:fast-tests / thash_autotest OK 0.50 s
103/110 DPDK:fast-tests / threads_autotest OK 1.13 s
104/110 DPDK:fast-tests / ticketlock_autotest OK 0.33 s
105/110 DPDK:fast-tests / timer_autotest OK 2.99 s
106/110 DPDK:fast-tests / trace_autotest OK 0.30 s
107/110 DPDK:fast-tests / trace_autotest_with_traces OK 0.41 s
108/110 DPDK:fast-tests / vdev_autotest OK 0.24 s
109/110 DPDK:fast-tests / version_autotest OK 0.41 s
110/110 DPDK:fast-tests / telemetry_all OK 1.24 s
Ok: 101
Expected Fail: 0
Fail: 0
Unexpected Pass: 0
Skipped: 9
Timeout: 0
Full log written to /home-local/jenkins-local/jenkins-agent/workspace/Generic-Unit-Test-DPDK/dpdk/build/meson-logs/testlog.txt
ninja: Entering directory `/home-local/jenkins-local/jenkins-agent/workspace/Generic-Unit-Test-DPDK/dpdk/build'
ninja: no work to do.
1/2 DPDK:driver-tests / cryptodev_openssl_autotest FAIL 1.71 s (killed by signal 11 SIGSEGV)
2/2 DPDK:driver-tests / cryptodev_openssl_asym_autotest OK 0.47 s
Ok: 1
Expected Fail: 0
Fail: 1
Unexpected Pass: 0
Skipped: 0
Timeout: 0
Full log written to /home-local/jenkins-local/jenkins-agent/workspace/Generic-Unit-Test-DPDK/dpdk/build/meson-logs/testlog.txt
Test log output from the failed test cryptodev_openssl_autotest:
Sorry, we were not able to find the logs for this test.
Download the log output from the CI site for this test run.
==== End log output ====
Debian 12
Kernel: Depends on container host
Compiler: gcc (Debian 12.2.0-14) 12.2.0
CentOS Stream 9
Kernel: Depends on container host
Compiler: gcc 11.5.0 20240719 (Red Hat 11.5.0-2)
CentOS Stream 10
Kernel: Depends on container host
Compiler: gcc 14.2.1 20241104 (Red Hat 14.2.1-6)
Fedora 40 (Clang)
Kernel: Depends on container host
Compiler: clang 18.1.8 (Fedora 18.1.8-1.fc40)
Fedora 40
Kernel: Depends on container host
Compiler: gcc 14.2.1 20240912 (Red Hat 14.2.1-3)
Fedora 41
Kernel: Depends on container host
Compiler: gcc 14.2.1 20240912 (Red Hat 14.2.1-3)
Fedora 41 (Clang)
Kernel: Depends on container host
Compiler: clang 19.1.5 (Fedora 19.1.5-1.fc41)
Ubuntu 24.04
Kernel: Depends on container host
Compiler: gcc (Ubuntu 13.3.0-6ubuntu2~24.04) 13.3.0
RHEL9
Kernel: Depends on container host
Compiler: gcc 11.5.0 20240719 (Red Hat 11.5.0-2)
RHEL8
Kernel: Depends on container host
Compiler: gcc 8.5.0 20210514 (Red Hat 8.5.0-22)
Ubuntu 22.04
Kernel: Depends on container host
Compiler: gcc (Ubuntu 11.4.0-1ubuntu1~22.04) 11.4.0
Ubuntu 20.04
Kernel: Depends on container host
Compiler: gcc (Ubuntu 9.4.0-1ubuntu1~20.04.2) 9.4.0
Windows Server 2022
Kernel: 10.0.20348.2031
Compiler: clang 15.0.7, gcc 14.1.0 (MinGW), and MSVC VS 19.39.33521
To view detailed results, visit:
https://lab.dpdk.org/results/dashboard/tarballs/33159/
UNH-IOL DPDK Community Lab
To manage your email subscriptions, visit:
https://lab.dpdk.org/results/dashboard/preferences/subscriptions/
^ permalink raw reply [flat|nested] 23+ messages in thread
* |FAILURE| [GIT MASTER] 669ba8067b3c7a1467999e826e396cb97332cbc6
@ 2025-04-05 9:23 dpdklab
0 siblings, 0 replies; 23+ messages in thread
From: dpdklab @ 2025-04-05 9:23 UTC (permalink / raw)
To: Test Report
Cc: dpdk-test-reports, Xueming Li, Christian Ehrhardt, Kevin Traynor,
Luca Boccassi
_Testing issues_
Branch: 23.11-staging
669ba8067b3c7a1467999e826e396cb97332cbc6 --> testing issues
Upstream job id: Generic-Unit-Test-DPDK#328995
Test environment and result as below:
+-----------------------------+----------------+--------------+---------------------------+------------------------------+
| Environment | dpdk_unit_test | lpm_autotest | cryptodev_sw_zuc_autotest | cryptodev_sw_snow3g_autotest |
+=============================+================+==============+===========================+==============================+
| CentOS Stream 10 (ARM) | FAIL | SKIPPED | SKIPPED | SKIPPED |
+-----------------------------+----------------+--------------+---------------------------+------------------------------+
| CentOS Stream 9 (ARM) | FAIL | SKIPPED | SKIPPED | SKIPPED |
+-----------------------------+----------------+--------------+---------------------------+------------------------------+
| Debian 12 (arm) | FAIL | SKIPPED | PEND | PEND |
+-----------------------------+----------------+--------------+---------------------------+------------------------------+
| Fedora 40 (ARM) | FAIL | SKIPPED | SKIPPED | SKIPPED |
+-----------------------------+----------------+--------------+---------------------------+------------------------------+
| Fedora 40 (ARM Clang) | PEND | SKIPPED | SKIPPED | SKIPPED |
+-----------------------------+----------------+--------------+---------------------------+------------------------------+
| Fedora 41 (ARM) | PEND | SKIPPED | SKIPPED | SKIPPED |
+-----------------------------+----------------+--------------+---------------------------+------------------------------+
| Fedora 41 (ARM Clang) | PEND | SKIPPED | SKIPPED | SKIPPED |
+-----------------------------+----------------+--------------+---------------------------+------------------------------+
| Ubuntu 20.04 (ARM) | PEND | SKIPPED | SKIPPED | SKIPPED |
+-----------------------------+----------------+--------------+---------------------------+------------------------------+
| Ubuntu 22.04 (ARM) | PEND | SKIPPED | SKIPPED | SKIPPED |
+-----------------------------+----------------+--------------+---------------------------+------------------------------+
| RHEL9 (ARM) | PEND | SKIPPED | SKIPPED | SKIPPED |
+-----------------------------+----------------+--------------+---------------------------+------------------------------+
| 32-bit Ubuntu 22.04.4 (ARM) | PASS | SKIPPED | SKIPPED | SKIPPED |
+-----------------------------+----------------+--------------+---------------------------+------------------------------+
| Ubuntu 24.04 (ARM) | PEND | SKIPPED | SKIPPED | SKIPPED |
+-----------------------------+----------------+--------------+---------------------------+------------------------------+
| Ubuntu 20.04 ARM SVE | SKIPPED | PEND | SKIPPED | SKIPPED |
+-----------------------------+----------------+--------------+---------------------------+------------------------------+
==== Unit test summary for Fedora 40 (ARM) (dpdk_unit_test): ====
ninja: Entering directory `/home-local/jenkins-local/jenkins-agent/workspace/Generic-Unit-Test-DPDK/dpdk/build'
ninja: no work to do.
1/110 DPDK:fast-tests / acl_autotest OK 4.68 s
2/110 DPDK:fast-tests / atomic_autotest OK 5.23 s
3/110 DPDK:fast-tests / bitcount_autotest OK 0.17 s
4/110 DPDK:fast-tests / bitmap_autotest OK 0.17 s
5/110 DPDK:fast-tests / bitops_autotest OK 0.17 s
6/110 DPDK:fast-tests / bitratestats_autotest OK 0.17 s
7/110 DPDK:fast-tests / bpf_autotest OK 0.17 s
8/110 DPDK:fast-tests / bpf_convert_autotest OK 0.17 s
9/110 DPDK:fast-tests / byteorder_autotest OK 0.17 s
10/110 DPDK:fast-tests / cksum_autotest OK 0.17 s
11/110 DPDK:fast-tests / cmdline_autotest OK 0.17 s
12/110 DPDK:fast-tests / common_autotest OK 1.07 s
13/110 DPDK:fast-tests / compressdev_autotest SKIP 0.07 s
14/110 DPDK:fast-tests / cpuflags_autotest OK 0.17 s
15/110 DPDK:fast-tests / crc_autotest OK 0.17 s
16/110 DPDK:fast-tests / user_delay_us OK 0.17 s
17/110 DPDK:fast-tests / debug_autotest OK 0.87 s
18/110 DPDK:fast-tests / devargs_autotest OK 0.17 s
19/110 DPDK:fast-tests / dispatcher_autotest OK 2.02 s
20/110 DPDK:fast-tests / distributor_autotest OK 0.82 s
21/110 DPDK:fast-tests / eal_flags_c_opt_autotest OK 0.72 s
22/110 DPDK:fast-tests / eal_flags_main_opt_autotest OK 0.22 s
23/110 DPDK:fast-tests / eal_flags_n_opt_autotest OK 0.22 s
24/110 DPDK:fast-tests / eal_flags_hpet_autotest OK 0.12 s
25/110 DPDK:fast-tests / eal_flags_no_huge_autotest OK 0.22 s
26/110 DPDK:fast-tests / eal_flags_a_opt_autotest OK 0.32 s
27/110 DPDK:fast-tests / eal_flags_b_opt_autotest OK 0.27 s
28/110 DPDK:fast-tests / eal_flags_vdev_opt_autotest OK 0.22 s
29/110 DPDK:fast-tests / eal_flags_r_opt_autotest OK 0.22 s
30/110 DPDK:fast-tests / eal_flags_mem_autotest OK 0.32 s
31/110 DPDK:fast-tests / eal_flags_file_prefix_autotest OK 1.27 s
32/110 DPDK:fast-tests / eal_flags_misc_autotest OK 0.92 s
33/110 DPDK:fast-tests / eal_fs_autotest OK 0.17 s
34/110 DPDK:fast-tests / errno_autotest OK 0.17 s
35/110 DPDK:fast-tests / ethdev_link_status OK 0.17 s
36/110 DPDK:fast-tests / event_eth_tx_adapter_autotest OK 1.12 s
37/110 DPDK:fast-tests / event_ring_autotest OK 0.17 s
38/110 DPDK:fast-tests / eventdev_common_autotest OK 0.17 s
39/110 DPDK:fast-tests / eventdev_selftest_sw OK 10.14 s
40/110 DPDK:fast-tests / fbarray_autotest OK 0.17 s
41/110 DPDK:fast-tests / fib_autotest OK 0.92 s
42/110 DPDK:fast-tests / fib6_autotest OK 0.87 s
43/110 DPDK:fast-tests / func_reentrancy_autotest OK 0.77 s
44/110 DPDK:fast-tests / graph_autotest OK 0.17 s
45/110 DPDK:fast-tests / node_list_dump OK 0.17 s
46/110 DPDK:fast-tests / hash_autotest OK 0.52 s
47/110 DPDK:fast-tests / hash_readwrite_func_autotest OK 7.34 s
48/110 DPDK:fast-tests / interrupt_autotest OK 1.17 s
49/110 DPDK:fast-tests / ipfrag_autotest OK 0.07 s
50/110 DPDK:fast-tests / ipsec_autotest SKIP 0.17 s
51/110 DPDK:fast-tests / kvargs_autotest OK 0.17 s
52/110 DPDK:fast-tests / latencystats_autotest OK 0.17 s
53/110 DPDK:fast-tests / lcores_autotest OK 3.13 s
54/110 DPDK:fast-tests / logs_autotest OK 0.17 s
55/110 DPDK:fast-tests / lpm_autotest OK 1.62 s
56/110 DPDK:fast-tests / lpm6_autotest OK 4.88 s
57/110 DPDK:fast-tests / malloc_autotest OK 0.42 s
58/110 DPDK:fast-tests / mbuf_autotest OK 4.23 s
59/110 DPDK:fast-tests / mcslock_autotest OK 0.72 s
60/110 DPDK:fast-tests / member_autotest OK 1.47 s
61/110 DPDK:fast-tests / memcpy_autotest OK 5.43 s
62/110 DPDK:fast-tests / memory_autotest OK 0.07 s
63/110 DPDK:fast-tests / mempool_autotest OK 0.47 s
64/110 DPDK:fast-tests / memzone_autotest OK 0.12 s
65/110 DPDK:fast-tests / meter_autotest OK 0.17 s
66/110 DPDK:fast-tests / metrics_autotest OK 0.17 s
67/110 DPDK:fast-tests / multiprocess_autotest OK 0.22 s
68/110 DPDK:fast-tests / net_ether_autotest OK 1.12 s
69/110 DPDK:fast-tests / pdcp_autotest SKIP 0.07 s
70/110 DPDK:fast-tests / pdump_autotest OK 0.37 s
71/110 DPDK:fast-tests / per_lcore_autotest OK 0.27 s
72/110 DPDK:fast-tests / pflock_autotest OK 0.47 s
73/110 DPDK:fast-tests / pie_autotest OK 0.17 s
74/110 DPDK:fast-tests / ring_pmd_autotest OK 0.17 s
75/110 DPDK:fast-tests / power_autotest OK 0.17 s
76/110 DPDK:fast-tests / power_cpufreq_autotest SKIP 0.07 s
77/110 DPDK:fast-tests / power_intel_uncore_autotest SKIP 0.17 s
78/110 DPDK:fast-tests / power_kvm_vm_autotest SKIP 0.07 s
79/110 DPDK:fast-tests / prefetch_autotest OK 0.17 s
80/110 DPDK:fast-tests / rawdev_autotest OK 0.17 s
81/110 DPDK:fast-tests / rcu_qsbr_autotest OK 0.62 s
82/110 DPDK:fast-tests / reorder_autotest OK 0.42 s
83/110 DPDK:fast-tests / rib_autotest OK 3.98 s
84/110 DPDK:fast-tests / rib6_autotest OK 3.93 s
85/110 DPDK:fast-tests / ring_autotest OK 0.17 s
86/110 DPDK:fast-tests / rwlock_test1_autotest OK 0.47 s
87/110 DPDK:fast-tests / rwlock_rda_autotest OK 5.13 s
88/110 DPDK:fast-tests / rwlock_rds_wrm_autotest OK 5.13 s
89/110 DPDK:fast-tests / rwlock_rde_wro_autotest OK 5.13 s
90/110 DPDK:fast-tests / sched_autotest OK 0.17 s
91/110 DPDK:fast-tests / security_autotest OK 0.07 s
92/110 DPDK:fast-tests / seqlock_autotest OK 2.22 s
93/110 DPDK:fast-tests / service_autotest OK 2.87 s
94/110 DPDK:fast-tests / spinlock_autotest OK 0.17 s
95/110 DPDK:fast-tests / stack_autotest OK 0.32 s
96/110 DPDK:fast-tests / stack_lf_autotest OK 0.32 s
97/110 DPDK:fast-tests / string_autotest OK 0.17 s
98/110 DPDK:fast-tests / table_autotest OK 7.03 s
99/110 DPDK:fast-tests / tailq_autotest OK 0.17 s
100/110 DPDK:fast-tests / telemetry_data_autotest OK 0.17 s
101/110 DPDK:fast-tests / telemetry_json_autotest OK 0.17 s
102/110 DPDK:fast-tests / thash_autotest OK 0.17 s
103/110 DPDK:fast-tests / threads_autotest OK 0.32 s
104/110 DPDK:fast-tests / ticketlock_autotest OK 0.22 s
105/110 DPDK:fast-tests / timer_autotest OK 2.82 s
106/110 DPDK:fast-tests / trace_autotest OK 0.17 s
107/110 DPDK:fast-tests / trace_autotest_with_traces OK 0.17 s
108/110 DPDK:fast-tests / vdev_autotest OK 0.17 s
109/110 DPDK:fast-tests / version_autotest OK 0.17 s
110/110 DPDK:fast-tests / telemetry_all SKIP 0.01 s
Ok: 103
Expected Fail: 0
Fail: 0
Unexpected Pass: 0
Skipped: 7
Timeout: 0
Full log written to /home-local/jenkins-local/jenkins-agent/workspace/Generic-Unit-Test-DPDK/dpdk/build/meson-logs/testlog.txt
ninja: Entering directory `/home-local/jenkins-local/jenkins-agent/workspace/Generic-Unit-Test-DPDK/dpdk/build'
ninja: no work to do.
1/2 DPDK:driver-tests / cryptodev_openssl_autotest FAIL 1.22 s (killed by signal 11 SIGSEGV)
2/2 DPDK:driver-tests / cryptodev_openssl_asym_autotest OK 0.12 s
Ok: 1
Expected Fail: 0
Fail: 1
Unexpected Pass: 0
Skipped: 0
Timeout: 0
Full log written to /home-local/jenkins-local/jenkins-agent/workspace/Generic-Unit-Test-DPDK/dpdk/build/meson-logs/testlog.txt
Test log output from the failed test cryptodev_openssl_autotest:
Sorry, we were not able to find the logs for this test.
Download the log output from the CI site for this test run.
==== End log output ====
CentOS Stream 10 (ARM)
Kernel: Depends on container host
Compiler: gcc 14.2.1 20241104 (Red Hat 14.2.1-6)
CentOS Stream 9 (ARM)
Kernel: Depends on container host
Compiler: gcc 11.5.0 20240719 (Red Hat 11.5.0-2)
Debian 12 (arm)
Kernel: Depends on container host
Compiler: gcc (Debian 12.2.0-14) 12.2.0
Fedora 40 (ARM)
Kernel: Depends on container host
Compiler: gcc 14.2.1 20240912 (Red Hat 14.2.1-3)
Fedora 40 (ARM Clang)
Kernel: Depends on container host
Compiler: clang 18.1.8 (Fedora 18.1.8-1.fc40)
Fedora 41 (ARM)
Kernel: Depends on container host
Compiler: gcc 14.2.1 20240912 (Red Hat 14.2.1-3)
Fedora 41 (ARM Clang)
Kernel: Depends on container host
Compiler: clang 19.1.5 (Fedora 19.1.5-1.fc41)
Ubuntu 20.04 (ARM)
Kernel: Depends on container host
Compiler: gcc (Ubuntu 9.4.0-1ubuntu1~20.04.2) 9.4.0
Ubuntu 22.04 (ARM)
Kernel: Depends on container host
Compiler: gcc (Ubuntu 11.4.0-1ubuntu1~22.04) 11.4.0
RHEL9 (ARM)
Kernel: Depends on container host
Compiler: gcc 11.5.0 20240719 (Red Hat 11.5.0-2)
32-bit Ubuntu 22.04.4 (ARM)
Kernel: 5.15.83+ aarch64
Compiler: gcc (Ubuntu 11.4.0-1ubuntu1~22.04) 11.4.0
Ubuntu 24.04 (ARM)
Kernel: Depends on container host
Compiler: gcc (Ubuntu 13.3.0-6ubuntu2~24.04) 13.3.0
Ubuntu 20.04 ARM SVE
Kernel: Depends on container host
Compiler: gcc (Ubuntu 10.5.0-1ubuntu1~20.04) 10.5.0
To view detailed results, visit:
https://lab.dpdk.org/results/dashboard/tarballs/33159/
UNH-IOL DPDK Community Lab
To manage your email subscriptions, visit:
https://lab.dpdk.org/results/dashboard/preferences/subscriptions/
^ permalink raw reply [flat|nested] 23+ messages in thread
* |FAILURE| [GIT MASTER] 669ba8067b3c7a1467999e826e396cb97332cbc6
@ 2025-04-05 9:22 dpdklab
0 siblings, 0 replies; 23+ messages in thread
From: dpdklab @ 2025-04-05 9:22 UTC (permalink / raw)
To: Test Report
Cc: dpdk-test-reports, Xueming Li, Christian Ehrhardt, Kevin Traynor,
Luca Boccassi
_Testing issues_
Branch: 23.11-staging
669ba8067b3c7a1467999e826e396cb97332cbc6 --> testing issues
Upstream job id: Generic-Unit-Test-DPDK#328993
Test environment and result as below:
+-----------------------------+----------------+--------------+---------------------------+------------------------------+
| Environment | dpdk_unit_test | lpm_autotest | cryptodev_sw_zuc_autotest | cryptodev_sw_snow3g_autotest |
+=============================+================+==============+===========================+==============================+
| CentOS Stream 10 (ARM) | FAIL | SKIPPED | SKIPPED | SKIPPED |
+-----------------------------+----------------+--------------+---------------------------+------------------------------+
| CentOS Stream 9 (ARM) | FAIL | SKIPPED | SKIPPED | SKIPPED |
+-----------------------------+----------------+--------------+---------------------------+------------------------------+
| Debian 12 (arm) | PEND | SKIPPED | PEND | PEND |
+-----------------------------+----------------+--------------+---------------------------+------------------------------+
| Fedora 40 (ARM) | FAIL | SKIPPED | SKIPPED | SKIPPED |
+-----------------------------+----------------+--------------+---------------------------+------------------------------+
| Fedora 40 (ARM Clang) | PEND | SKIPPED | SKIPPED | SKIPPED |
+-----------------------------+----------------+--------------+---------------------------+------------------------------+
| Fedora 41 (ARM) | PEND | SKIPPED | SKIPPED | SKIPPED |
+-----------------------------+----------------+--------------+---------------------------+------------------------------+
| Fedora 41 (ARM Clang) | PEND | SKIPPED | SKIPPED | SKIPPED |
+-----------------------------+----------------+--------------+---------------------------+------------------------------+
| Ubuntu 20.04 (ARM) | PEND | SKIPPED | SKIPPED | SKIPPED |
+-----------------------------+----------------+--------------+---------------------------+------------------------------+
| Ubuntu 22.04 (ARM) | PEND | SKIPPED | SKIPPED | SKIPPED |
+-----------------------------+----------------+--------------+---------------------------+------------------------------+
| RHEL9 (ARM) | PEND | SKIPPED | SKIPPED | SKIPPED |
+-----------------------------+----------------+--------------+---------------------------+------------------------------+
| 32-bit Ubuntu 22.04.4 (ARM) | PASS | SKIPPED | SKIPPED | SKIPPED |
+-----------------------------+----------------+--------------+---------------------------+------------------------------+
| Ubuntu 24.04 (ARM) | PEND | SKIPPED | SKIPPED | SKIPPED |
+-----------------------------+----------------+--------------+---------------------------+------------------------------+
| Ubuntu 20.04 ARM SVE | SKIPPED | PEND | SKIPPED | SKIPPED |
+-----------------------------+----------------+--------------+---------------------------+------------------------------+
==== Unit test summary for Fedora 40 (ARM) (dpdk_unit_test): ====
ninja: Entering directory `/home-local/jenkins-local/jenkins-agent/workspace/Generic-Unit-Test-DPDK/dpdk/build'
ninja: no work to do.
1/110 DPDK:fast-tests / acl_autotest OK 4.68 s
2/110 DPDK:fast-tests / atomic_autotest OK 5.23 s
3/110 DPDK:fast-tests / bitcount_autotest OK 0.17 s
4/110 DPDK:fast-tests / bitmap_autotest OK 0.17 s
5/110 DPDK:fast-tests / bitops_autotest OK 0.17 s
6/110 DPDK:fast-tests / bitratestats_autotest OK 0.17 s
7/110 DPDK:fast-tests / bpf_autotest OK 0.17 s
8/110 DPDK:fast-tests / bpf_convert_autotest OK 0.17 s
9/110 DPDK:fast-tests / byteorder_autotest OK 0.17 s
10/110 DPDK:fast-tests / cksum_autotest OK 0.17 s
11/110 DPDK:fast-tests / cmdline_autotest OK 0.17 s
12/110 DPDK:fast-tests / common_autotest OK 1.07 s
13/110 DPDK:fast-tests / compressdev_autotest SKIP 0.07 s
14/110 DPDK:fast-tests / cpuflags_autotest OK 0.17 s
15/110 DPDK:fast-tests / crc_autotest OK 0.17 s
16/110 DPDK:fast-tests / user_delay_us OK 0.17 s
17/110 DPDK:fast-tests / debug_autotest OK 0.87 s
18/110 DPDK:fast-tests / devargs_autotest OK 0.17 s
19/110 DPDK:fast-tests / dispatcher_autotest OK 2.02 s
20/110 DPDK:fast-tests / distributor_autotest OK 0.82 s
21/110 DPDK:fast-tests / eal_flags_c_opt_autotest OK 0.72 s
22/110 DPDK:fast-tests / eal_flags_main_opt_autotest OK 0.22 s
23/110 DPDK:fast-tests / eal_flags_n_opt_autotest OK 0.22 s
24/110 DPDK:fast-tests / eal_flags_hpet_autotest OK 0.12 s
25/110 DPDK:fast-tests / eal_flags_no_huge_autotest OK 0.22 s
26/110 DPDK:fast-tests / eal_flags_a_opt_autotest OK 0.32 s
27/110 DPDK:fast-tests / eal_flags_b_opt_autotest OK 0.27 s
28/110 DPDK:fast-tests / eal_flags_vdev_opt_autotest OK 0.22 s
29/110 DPDK:fast-tests / eal_flags_r_opt_autotest OK 0.22 s
30/110 DPDK:fast-tests / eal_flags_mem_autotest OK 0.32 s
31/110 DPDK:fast-tests / eal_flags_file_prefix_autotest OK 1.27 s
32/110 DPDK:fast-tests / eal_flags_misc_autotest OK 0.92 s
33/110 DPDK:fast-tests / eal_fs_autotest OK 0.17 s
34/110 DPDK:fast-tests / errno_autotest OK 0.17 s
35/110 DPDK:fast-tests / ethdev_link_status OK 0.17 s
36/110 DPDK:fast-tests / event_eth_tx_adapter_autotest OK 1.12 s
37/110 DPDK:fast-tests / event_ring_autotest OK 0.17 s
38/110 DPDK:fast-tests / eventdev_common_autotest OK 0.17 s
39/110 DPDK:fast-tests / eventdev_selftest_sw OK 10.14 s
40/110 DPDK:fast-tests / fbarray_autotest OK 0.17 s
41/110 DPDK:fast-tests / fib_autotest OK 0.92 s
42/110 DPDK:fast-tests / fib6_autotest OK 0.87 s
43/110 DPDK:fast-tests / func_reentrancy_autotest OK 0.77 s
44/110 DPDK:fast-tests / graph_autotest OK 0.17 s
45/110 DPDK:fast-tests / node_list_dump OK 0.17 s
46/110 DPDK:fast-tests / hash_autotest OK 0.52 s
47/110 DPDK:fast-tests / hash_readwrite_func_autotest OK 7.34 s
48/110 DPDK:fast-tests / interrupt_autotest OK 1.17 s
49/110 DPDK:fast-tests / ipfrag_autotest OK 0.07 s
50/110 DPDK:fast-tests / ipsec_autotest SKIP 0.17 s
51/110 DPDK:fast-tests / kvargs_autotest OK 0.17 s
52/110 DPDK:fast-tests / latencystats_autotest OK 0.17 s
53/110 DPDK:fast-tests / lcores_autotest OK 3.13 s
54/110 DPDK:fast-tests / logs_autotest OK 0.17 s
55/110 DPDK:fast-tests / lpm_autotest OK 1.62 s
56/110 DPDK:fast-tests / lpm6_autotest OK 4.88 s
57/110 DPDK:fast-tests / malloc_autotest OK 0.42 s
58/110 DPDK:fast-tests / mbuf_autotest OK 4.23 s
59/110 DPDK:fast-tests / mcslock_autotest OK 0.72 s
60/110 DPDK:fast-tests / member_autotest OK 1.47 s
61/110 DPDK:fast-tests / memcpy_autotest OK 5.43 s
62/110 DPDK:fast-tests / memory_autotest OK 0.07 s
63/110 DPDK:fast-tests / mempool_autotest OK 0.47 s
64/110 DPDK:fast-tests / memzone_autotest OK 0.12 s
65/110 DPDK:fast-tests / meter_autotest OK 0.17 s
66/110 DPDK:fast-tests / metrics_autotest OK 0.17 s
67/110 DPDK:fast-tests / multiprocess_autotest OK 0.22 s
68/110 DPDK:fast-tests / net_ether_autotest OK 1.12 s
69/110 DPDK:fast-tests / pdcp_autotest SKIP 0.07 s
70/110 DPDK:fast-tests / pdump_autotest OK 0.37 s
71/110 DPDK:fast-tests / per_lcore_autotest OK 0.27 s
72/110 DPDK:fast-tests / pflock_autotest OK 0.47 s
73/110 DPDK:fast-tests / pie_autotest OK 0.17 s
74/110 DPDK:fast-tests / ring_pmd_autotest OK 0.17 s
75/110 DPDK:fast-tests / power_autotest OK 0.17 s
76/110 DPDK:fast-tests / power_cpufreq_autotest SKIP 0.07 s
77/110 DPDK:fast-tests / power_intel_uncore_autotest SKIP 0.17 s
78/110 DPDK:fast-tests / power_kvm_vm_autotest SKIP 0.07 s
79/110 DPDK:fast-tests / prefetch_autotest OK 0.17 s
80/110 DPDK:fast-tests / rawdev_autotest OK 0.17 s
81/110 DPDK:fast-tests / rcu_qsbr_autotest OK 0.62 s
82/110 DPDK:fast-tests / reorder_autotest OK 0.42 s
83/110 DPDK:fast-tests / rib_autotest OK 3.98 s
84/110 DPDK:fast-tests / rib6_autotest OK 3.93 s
85/110 DPDK:fast-tests / ring_autotest OK 0.17 s
86/110 DPDK:fast-tests / rwlock_test1_autotest OK 0.47 s
87/110 DPDK:fast-tests / rwlock_rda_autotest OK 5.13 s
88/110 DPDK:fast-tests / rwlock_rds_wrm_autotest OK 5.13 s
89/110 DPDK:fast-tests / rwlock_rde_wro_autotest OK 5.13 s
90/110 DPDK:fast-tests / sched_autotest OK 0.17 s
91/110 DPDK:fast-tests / security_autotest OK 0.07 s
92/110 DPDK:fast-tests / seqlock_autotest OK 2.22 s
93/110 DPDK:fast-tests / service_autotest OK 2.87 s
94/110 DPDK:fast-tests / spinlock_autotest OK 0.17 s
95/110 DPDK:fast-tests / stack_autotest OK 0.32 s
96/110 DPDK:fast-tests / stack_lf_autotest OK 0.32 s
97/110 DPDK:fast-tests / string_autotest OK 0.17 s
98/110 DPDK:fast-tests / table_autotest OK 7.03 s
99/110 DPDK:fast-tests / tailq_autotest OK 0.17 s
100/110 DPDK:fast-tests / telemetry_data_autotest OK 0.17 s
101/110 DPDK:fast-tests / telemetry_json_autotest OK 0.17 s
102/110 DPDK:fast-tests / thash_autotest OK 0.17 s
103/110 DPDK:fast-tests / threads_autotest OK 0.32 s
104/110 DPDK:fast-tests / ticketlock_autotest OK 0.22 s
105/110 DPDK:fast-tests / timer_autotest OK 2.82 s
106/110 DPDK:fast-tests / trace_autotest OK 0.17 s
107/110 DPDK:fast-tests / trace_autotest_with_traces OK 0.17 s
108/110 DPDK:fast-tests / vdev_autotest OK 0.17 s
109/110 DPDK:fast-tests / version_autotest OK 0.17 s
110/110 DPDK:fast-tests / telemetry_all SKIP 0.01 s
Ok: 103
Expected Fail: 0
Fail: 0
Unexpected Pass: 0
Skipped: 7
Timeout: 0
Full log written to /home-local/jenkins-local/jenkins-agent/workspace/Generic-Unit-Test-DPDK/dpdk/build/meson-logs/testlog.txt
ninja: Entering directory `/home-local/jenkins-local/jenkins-agent/workspace/Generic-Unit-Test-DPDK/dpdk/build'
ninja: no work to do.
1/2 DPDK:driver-tests / cryptodev_openssl_autotest FAIL 1.22 s (killed by signal 11 SIGSEGV)
2/2 DPDK:driver-tests / cryptodev_openssl_asym_autotest OK 0.12 s
Ok: 1
Expected Fail: 0
Fail: 1
Unexpected Pass: 0
Skipped: 0
Timeout: 0
Full log written to /home-local/jenkins-local/jenkins-agent/workspace/Generic-Unit-Test-DPDK/dpdk/build/meson-logs/testlog.txt
Test log output from the failed test cryptodev_openssl_autotest:
Sorry, we were not able to find the logs for this test.
Download the log output from the CI site for this test run.
==== End log output ====
CentOS Stream 10 (ARM)
Kernel: Depends on container host
Compiler: gcc 14.2.1 20241104 (Red Hat 14.2.1-6)
CentOS Stream 9 (ARM)
Kernel: Depends on container host
Compiler: gcc 11.5.0 20240719 (Red Hat 11.5.0-2)
Debian 12 (arm)
Kernel: Depends on container host
Compiler: gcc (Debian 12.2.0-14) 12.2.0
Fedora 40 (ARM)
Kernel: Depends on container host
Compiler: gcc 14.2.1 20240912 (Red Hat 14.2.1-3)
Fedora 40 (ARM Clang)
Kernel: Depends on container host
Compiler: clang 18.1.8 (Fedora 18.1.8-1.fc40)
Fedora 41 (ARM)
Kernel: Depends on container host
Compiler: gcc 14.2.1 20240912 (Red Hat 14.2.1-3)
Fedora 41 (ARM Clang)
Kernel: Depends on container host
Compiler: clang 19.1.5 (Fedora 19.1.5-1.fc41)
Ubuntu 20.04 (ARM)
Kernel: Depends on container host
Compiler: gcc (Ubuntu 9.4.0-1ubuntu1~20.04.2) 9.4.0
Ubuntu 22.04 (ARM)
Kernel: Depends on container host
Compiler: gcc (Ubuntu 11.4.0-1ubuntu1~22.04) 11.4.0
RHEL9 (ARM)
Kernel: Depends on container host
Compiler: gcc 11.5.0 20240719 (Red Hat 11.5.0-2)
32-bit Ubuntu 22.04.4 (ARM)
Kernel: 5.15.83+ aarch64
Compiler: gcc (Ubuntu 11.4.0-1ubuntu1~22.04) 11.4.0
Ubuntu 24.04 (ARM)
Kernel: Depends on container host
Compiler: gcc (Ubuntu 13.3.0-6ubuntu2~24.04) 13.3.0
Ubuntu 20.04 ARM SVE
Kernel: Depends on container host
Compiler: gcc (Ubuntu 10.5.0-1ubuntu1~20.04) 10.5.0
To view detailed results, visit:
https://lab.dpdk.org/results/dashboard/tarballs/33159/
UNH-IOL DPDK Community Lab
To manage your email subscriptions, visit:
https://lab.dpdk.org/results/dashboard/preferences/subscriptions/
^ permalink raw reply [flat|nested] 23+ messages in thread
* |FAILURE| [GIT MASTER] 669ba8067b3c7a1467999e826e396cb97332cbc6
@ 2025-04-05 9:21 dpdklab
0 siblings, 0 replies; 23+ messages in thread
From: dpdklab @ 2025-04-05 9:21 UTC (permalink / raw)
To: Test Report
Cc: dpdk-test-reports, Xueming Li, Christian Ehrhardt, Kevin Traynor,
Luca Boccassi
_Testing issues_
Branch: 23.11-staging
669ba8067b3c7a1467999e826e396cb97332cbc6 --> testing issues
Upstream job id: Generic-Unit-Test-DPDK#328997
Test environment and result as below:
+-----------------------------+----------------+--------------+---------------------------+------------------------------+
| Environment | dpdk_unit_test | lpm_autotest | cryptodev_sw_zuc_autotest | cryptodev_sw_snow3g_autotest |
+=============================+================+==============+===========================+==============================+
| CentOS Stream 10 (ARM) | PEND | SKIPPED | SKIPPED | SKIPPED |
+-----------------------------+----------------+--------------+---------------------------+------------------------------+
| CentOS Stream 9 (ARM) | FAIL | SKIPPED | SKIPPED | SKIPPED |
+-----------------------------+----------------+--------------+---------------------------+------------------------------+
| Debian 12 (arm) | PEND | SKIPPED | PEND | PEND |
+-----------------------------+----------------+--------------+---------------------------+------------------------------+
| Fedora 40 (ARM) | FAIL | SKIPPED | SKIPPED | SKIPPED |
+-----------------------------+----------------+--------------+---------------------------+------------------------------+
| Fedora 40 (ARM Clang) | PEND | SKIPPED | SKIPPED | SKIPPED |
+-----------------------------+----------------+--------------+---------------------------+------------------------------+
| Fedora 41 (ARM) | PEND | SKIPPED | SKIPPED | SKIPPED |
+-----------------------------+----------------+--------------+---------------------------+------------------------------+
| Fedora 41 (ARM Clang) | PEND | SKIPPED | SKIPPED | SKIPPED |
+-----------------------------+----------------+--------------+---------------------------+------------------------------+
| Ubuntu 20.04 (ARM) | PEND | SKIPPED | SKIPPED | SKIPPED |
+-----------------------------+----------------+--------------+---------------------------+------------------------------+
| Ubuntu 22.04 (ARM) | PEND | SKIPPED | SKIPPED | SKIPPED |
+-----------------------------+----------------+--------------+---------------------------+------------------------------+
| RHEL9 (ARM) | PEND | SKIPPED | SKIPPED | SKIPPED |
+-----------------------------+----------------+--------------+---------------------------+------------------------------+
| 32-bit Ubuntu 22.04.4 (ARM) | PASS | SKIPPED | SKIPPED | SKIPPED |
+-----------------------------+----------------+--------------+---------------------------+------------------------------+
| Ubuntu 24.04 (ARM) | PEND | SKIPPED | SKIPPED | SKIPPED |
+-----------------------------+----------------+--------------+---------------------------+------------------------------+
| Ubuntu 20.04 ARM SVE | SKIPPED | PEND | SKIPPED | SKIPPED |
+-----------------------------+----------------+--------------+---------------------------+------------------------------+
==== Unit test summary for Fedora 40 (ARM) (dpdk_unit_test): ====
ninja: Entering directory `/home-local/jenkins-local/jenkins-agent/workspace/Generic-Unit-Test-DPDK/dpdk/build'
ninja: no work to do.
1/110 DPDK:fast-tests / acl_autotest OK 4.68 s
2/110 DPDK:fast-tests / atomic_autotest OK 5.23 s
3/110 DPDK:fast-tests / bitcount_autotest OK 0.17 s
4/110 DPDK:fast-tests / bitmap_autotest OK 0.17 s
5/110 DPDK:fast-tests / bitops_autotest OK 0.17 s
6/110 DPDK:fast-tests / bitratestats_autotest OK 0.17 s
7/110 DPDK:fast-tests / bpf_autotest OK 0.17 s
8/110 DPDK:fast-tests / bpf_convert_autotest OK 0.17 s
9/110 DPDK:fast-tests / byteorder_autotest OK 0.17 s
10/110 DPDK:fast-tests / cksum_autotest OK 0.17 s
11/110 DPDK:fast-tests / cmdline_autotest OK 0.17 s
12/110 DPDK:fast-tests / common_autotest OK 1.07 s
13/110 DPDK:fast-tests / compressdev_autotest SKIP 0.07 s
14/110 DPDK:fast-tests / cpuflags_autotest OK 0.17 s
15/110 DPDK:fast-tests / crc_autotest OK 0.17 s
16/110 DPDK:fast-tests / user_delay_us OK 0.17 s
17/110 DPDK:fast-tests / debug_autotest OK 0.87 s
18/110 DPDK:fast-tests / devargs_autotest OK 0.17 s
19/110 DPDK:fast-tests / dispatcher_autotest OK 2.02 s
20/110 DPDK:fast-tests / distributor_autotest OK 0.82 s
21/110 DPDK:fast-tests / eal_flags_c_opt_autotest OK 0.72 s
22/110 DPDK:fast-tests / eal_flags_main_opt_autotest OK 0.22 s
23/110 DPDK:fast-tests / eal_flags_n_opt_autotest OK 0.22 s
24/110 DPDK:fast-tests / eal_flags_hpet_autotest OK 0.12 s
25/110 DPDK:fast-tests / eal_flags_no_huge_autotest OK 0.22 s
26/110 DPDK:fast-tests / eal_flags_a_opt_autotest OK 0.32 s
27/110 DPDK:fast-tests / eal_flags_b_opt_autotest OK 0.27 s
28/110 DPDK:fast-tests / eal_flags_vdev_opt_autotest OK 0.22 s
29/110 DPDK:fast-tests / eal_flags_r_opt_autotest OK 0.22 s
30/110 DPDK:fast-tests / eal_flags_mem_autotest OK 0.32 s
31/110 DPDK:fast-tests / eal_flags_file_prefix_autotest OK 1.27 s
32/110 DPDK:fast-tests / eal_flags_misc_autotest OK 0.92 s
33/110 DPDK:fast-tests / eal_fs_autotest OK 0.17 s
34/110 DPDK:fast-tests / errno_autotest OK 0.17 s
35/110 DPDK:fast-tests / ethdev_link_status OK 0.17 s
36/110 DPDK:fast-tests / event_eth_tx_adapter_autotest OK 1.12 s
37/110 DPDK:fast-tests / event_ring_autotest OK 0.17 s
38/110 DPDK:fast-tests / eventdev_common_autotest OK 0.17 s
39/110 DPDK:fast-tests / eventdev_selftest_sw OK 10.14 s
40/110 DPDK:fast-tests / fbarray_autotest OK 0.17 s
41/110 DPDK:fast-tests / fib_autotest OK 0.92 s
42/110 DPDK:fast-tests / fib6_autotest OK 0.87 s
43/110 DPDK:fast-tests / func_reentrancy_autotest OK 0.77 s
44/110 DPDK:fast-tests / graph_autotest OK 0.17 s
45/110 DPDK:fast-tests / node_list_dump OK 0.17 s
46/110 DPDK:fast-tests / hash_autotest OK 0.52 s
47/110 DPDK:fast-tests / hash_readwrite_func_autotest OK 7.34 s
48/110 DPDK:fast-tests / interrupt_autotest OK 1.17 s
49/110 DPDK:fast-tests / ipfrag_autotest OK 0.07 s
50/110 DPDK:fast-tests / ipsec_autotest SKIP 0.17 s
51/110 DPDK:fast-tests / kvargs_autotest OK 0.17 s
52/110 DPDK:fast-tests / latencystats_autotest OK 0.17 s
53/110 DPDK:fast-tests / lcores_autotest OK 3.13 s
54/110 DPDK:fast-tests / logs_autotest OK 0.17 s
55/110 DPDK:fast-tests / lpm_autotest OK 1.62 s
56/110 DPDK:fast-tests / lpm6_autotest OK 4.88 s
57/110 DPDK:fast-tests / malloc_autotest OK 0.42 s
58/110 DPDK:fast-tests / mbuf_autotest OK 4.23 s
59/110 DPDK:fast-tests / mcslock_autotest OK 0.72 s
60/110 DPDK:fast-tests / member_autotest OK 1.47 s
61/110 DPDK:fast-tests / memcpy_autotest OK 5.43 s
62/110 DPDK:fast-tests / memory_autotest OK 0.07 s
63/110 DPDK:fast-tests / mempool_autotest OK 0.47 s
64/110 DPDK:fast-tests / memzone_autotest OK 0.12 s
65/110 DPDK:fast-tests / meter_autotest OK 0.17 s
66/110 DPDK:fast-tests / metrics_autotest OK 0.17 s
67/110 DPDK:fast-tests / multiprocess_autotest OK 0.22 s
68/110 DPDK:fast-tests / net_ether_autotest OK 1.12 s
69/110 DPDK:fast-tests / pdcp_autotest SKIP 0.07 s
70/110 DPDK:fast-tests / pdump_autotest OK 0.37 s
71/110 DPDK:fast-tests / per_lcore_autotest OK 0.27 s
72/110 DPDK:fast-tests / pflock_autotest OK 0.47 s
73/110 DPDK:fast-tests / pie_autotest OK 0.17 s
74/110 DPDK:fast-tests / ring_pmd_autotest OK 0.17 s
75/110 DPDK:fast-tests / power_autotest OK 0.17 s
76/110 DPDK:fast-tests / power_cpufreq_autotest SKIP 0.07 s
77/110 DPDK:fast-tests / power_intel_uncore_autotest SKIP 0.17 s
78/110 DPDK:fast-tests / power_kvm_vm_autotest SKIP 0.07 s
79/110 DPDK:fast-tests / prefetch_autotest OK 0.17 s
80/110 DPDK:fast-tests / rawdev_autotest OK 0.17 s
81/110 DPDK:fast-tests / rcu_qsbr_autotest OK 0.62 s
82/110 DPDK:fast-tests / reorder_autotest OK 0.42 s
83/110 DPDK:fast-tests / rib_autotest OK 3.98 s
84/110 DPDK:fast-tests / rib6_autotest OK 3.93 s
85/110 DPDK:fast-tests / ring_autotest OK 0.17 s
86/110 DPDK:fast-tests / rwlock_test1_autotest OK 0.47 s
87/110 DPDK:fast-tests / rwlock_rda_autotest OK 5.13 s
88/110 DPDK:fast-tests / rwlock_rds_wrm_autotest OK 5.13 s
89/110 DPDK:fast-tests / rwlock_rde_wro_autotest OK 5.13 s
90/110 DPDK:fast-tests / sched_autotest OK 0.17 s
91/110 DPDK:fast-tests / security_autotest OK 0.07 s
92/110 DPDK:fast-tests / seqlock_autotest OK 2.22 s
93/110 DPDK:fast-tests / service_autotest OK 2.87 s
94/110 DPDK:fast-tests / spinlock_autotest OK 0.17 s
95/110 DPDK:fast-tests / stack_autotest OK 0.32 s
96/110 DPDK:fast-tests / stack_lf_autotest OK 0.32 s
97/110 DPDK:fast-tests / string_autotest OK 0.17 s
98/110 DPDK:fast-tests / table_autotest OK 7.03 s
99/110 DPDK:fast-tests / tailq_autotest OK 0.17 s
100/110 DPDK:fast-tests / telemetry_data_autotest OK 0.17 s
101/110 DPDK:fast-tests / telemetry_json_autotest OK 0.17 s
102/110 DPDK:fast-tests / thash_autotest OK 0.17 s
103/110 DPDK:fast-tests / threads_autotest OK 0.32 s
104/110 DPDK:fast-tests / ticketlock_autotest OK 0.22 s
105/110 DPDK:fast-tests / timer_autotest OK 2.82 s
106/110 DPDK:fast-tests / trace_autotest OK 0.17 s
107/110 DPDK:fast-tests / trace_autotest_with_traces OK 0.17 s
108/110 DPDK:fast-tests / vdev_autotest OK 0.17 s
109/110 DPDK:fast-tests / version_autotest OK 0.17 s
110/110 DPDK:fast-tests / telemetry_all SKIP 0.01 s
Ok: 103
Expected Fail: 0
Fail: 0
Unexpected Pass: 0
Skipped: 7
Timeout: 0
Full log written to /home-local/jenkins-local/jenkins-agent/workspace/Generic-Unit-Test-DPDK/dpdk/build/meson-logs/testlog.txt
ninja: Entering directory `/home-local/jenkins-local/jenkins-agent/workspace/Generic-Unit-Test-DPDK/dpdk/build'
ninja: no work to do.
1/2 DPDK:driver-tests / cryptodev_openssl_autotest FAIL 1.22 s (killed by signal 11 SIGSEGV)
2/2 DPDK:driver-tests / cryptodev_openssl_asym_autotest OK 0.12 s
Ok: 1
Expected Fail: 0
Fail: 1
Unexpected Pass: 0
Skipped: 0
Timeout: 0
Full log written to /home-local/jenkins-local/jenkins-agent/workspace/Generic-Unit-Test-DPDK/dpdk/build/meson-logs/testlog.txt
Test log output from the failed test cryptodev_openssl_autotest:
Sorry, we were not able to find the logs for this test.
Download the log output from the CI site for this test run.
==== End log output ====
CentOS Stream 10 (ARM)
Kernel: Depends on container host
Compiler: gcc 14.2.1 20241104 (Red Hat 14.2.1-6)
CentOS Stream 9 (ARM)
Kernel: Depends on container host
Compiler: gcc 11.5.0 20240719 (Red Hat 11.5.0-2)
Debian 12 (arm)
Kernel: Depends on container host
Compiler: gcc (Debian 12.2.0-14) 12.2.0
Fedora 40 (ARM)
Kernel: Depends on container host
Compiler: gcc 14.2.1 20240912 (Red Hat 14.2.1-3)
Fedora 40 (ARM Clang)
Kernel: Depends on container host
Compiler: clang 18.1.8 (Fedora 18.1.8-1.fc40)
Fedora 41 (ARM)
Kernel: Depends on container host
Compiler: gcc 14.2.1 20240912 (Red Hat 14.2.1-3)
Fedora 41 (ARM Clang)
Kernel: Depends on container host
Compiler: clang 19.1.5 (Fedora 19.1.5-1.fc41)
Ubuntu 20.04 (ARM)
Kernel: Depends on container host
Compiler: gcc (Ubuntu 9.4.0-1ubuntu1~20.04.2) 9.4.0
Ubuntu 22.04 (ARM)
Kernel: Depends on container host
Compiler: gcc (Ubuntu 11.4.0-1ubuntu1~22.04) 11.4.0
RHEL9 (ARM)
Kernel: Depends on container host
Compiler: gcc 11.5.0 20240719 (Red Hat 11.5.0-2)
32-bit Ubuntu 22.04.4 (ARM)
Kernel: 5.15.83+ aarch64
Compiler: gcc (Ubuntu 11.4.0-1ubuntu1~22.04) 11.4.0
Ubuntu 24.04 (ARM)
Kernel: Depends on container host
Compiler: gcc (Ubuntu 13.3.0-6ubuntu2~24.04) 13.3.0
Ubuntu 20.04 ARM SVE
Kernel: Depends on container host
Compiler: gcc (Ubuntu 10.5.0-1ubuntu1~20.04) 10.5.0
To view detailed results, visit:
https://lab.dpdk.org/results/dashboard/tarballs/33159/
UNH-IOL DPDK Community Lab
To manage your email subscriptions, visit:
https://lab.dpdk.org/results/dashboard/preferences/subscriptions/
^ permalink raw reply [flat|nested] 23+ messages in thread
* |FAILURE| [GIT MASTER] 669ba8067b3c7a1467999e826e396cb97332cbc6
@ 2025-04-05 9:20 dpdklab
0 siblings, 0 replies; 23+ messages in thread
From: dpdklab @ 2025-04-05 9:20 UTC (permalink / raw)
To: Test Report
Cc: dpdk-test-reports, Xueming Li, Christian Ehrhardt, Kevin Traynor,
Luca Boccassi
_Testing issues_
Branch: 23.11-staging
669ba8067b3c7a1467999e826e396cb97332cbc6 --> testing issues
Upstream job id: Generic-Unit-Test-DPDK#329000
Test environment and result as below:
+---------------------+----------------+
| Environment | dpdk_unit_test |
+=====================+================+
| Debian 12 | FAIL |
+---------------------+----------------+
| CentOS Stream 9 | FAIL |
+---------------------+----------------+
| CentOS Stream 10 | FAIL |
+---------------------+----------------+
| Fedora 40 (Clang) | FAIL |
+---------------------+----------------+
| Fedora 40 | FAIL |
+---------------------+----------------+
| Fedora 41 | FAIL |
+---------------------+----------------+
| Fedora 41 (Clang) | FAIL |
+---------------------+----------------+
| Ubuntu 24.04 | PEND |
+---------------------+----------------+
| RHEL9 | PEND |
+---------------------+----------------+
| RHEL8 | PEND |
+---------------------+----------------+
| Ubuntu 22.04 | PEND |
+---------------------+----------------+
| Ubuntu 20.04 | PEND |
+---------------------+----------------+
| Windows Server 2022 | PASS |
+---------------------+----------------+
==== Unit test summary for Fedora 41 (Clang) (dpdk_unit_test): ====
ninja: Entering directory `/root/workspace/Generic-Unit-Test-DPDK/dpdk/build'
ninja: no work to do.
1/110 DPDK:fast-tests / acl_autotest OK 2.27 s
2/110 DPDK:fast-tests / atomic_autotest OK 0.37 s
3/110 DPDK:fast-tests / bitcount_autotest OK 0.17 s
4/110 DPDK:fast-tests / bitmap_autotest OK 0.17 s
5/110 DPDK:fast-tests / bitops_autotest OK 0.17 s
6/110 DPDK:fast-tests / bitratestats_autotest OK 0.17 s
7/110 DPDK:fast-tests / bpf_autotest OK 0.17 s
8/110 DPDK:fast-tests / bpf_convert_autotest OK 0.17 s
9/110 DPDK:fast-tests / byteorder_autotest OK 0.17 s
10/110 DPDK:fast-tests / cksum_autotest OK 0.17 s
11/110 DPDK:fast-tests / cmdline_autotest OK 0.17 s
12/110 DPDK:fast-tests / common_autotest OK 0.37 s
13/110 DPDK:fast-tests / compressdev_autotest SKIP 0.17 s
14/110 DPDK:fast-tests / cpuflags_autotest OK 0.17 s
15/110 DPDK:fast-tests / crc_autotest OK 0.17 s
16/110 DPDK:fast-tests / user_delay_us OK 0.17 s
17/110 DPDK:fast-tests / debug_autotest OK 0.42 s
18/110 DPDK:fast-tests / devargs_autotest OK 0.17 s
19/110 DPDK:fast-tests / dispatcher_autotest SKIP 0.17 s
20/110 DPDK:fast-tests / distributor_autotest OK 0.82 s
21/110 DPDK:fast-tests / eal_flags_c_opt_autotest OK 0.52 s
22/110 DPDK:fast-tests / eal_flags_main_opt_autotest OK 0.22 s
23/110 DPDK:fast-tests / eal_flags_n_opt_autotest OK 0.42 s
24/110 DPDK:fast-tests / eal_flags_hpet_autotest OK 0.17 s
25/110 DPDK:fast-tests / eal_flags_no_huge_autotest OK 0.42 s
26/110 DPDK:fast-tests / eal_flags_a_opt_autotest OK 0.27 s
27/110 DPDK:fast-tests / eal_flags_b_opt_autotest OK 0.27 s
28/110 DPDK:fast-tests / eal_flags_vdev_opt_autotest OK 0.52 s
29/110 DPDK:fast-tests / eal_flags_r_opt_autotest OK 0.22 s
30/110 DPDK:fast-tests / eal_flags_mem_autotest OK 0.62 s
31/110 DPDK:fast-tests / eal_flags_file_prefix_autotest OK 1.92 s
32/110 DPDK:fast-tests / eal_flags_misc_autotest OK 1.57 s
33/110 DPDK:fast-tests / eal_fs_autotest OK 0.18 s
34/110 DPDK:fast-tests / errno_autotest OK 0.17 s
35/110 DPDK:fast-tests / ethdev_link_status OK 0.17 s
36/110 DPDK:fast-tests / event_eth_tx_adapter_autotest OK 0.47 s
37/110 DPDK:fast-tests / event_ring_autotest OK 0.17 s
38/110 DPDK:fast-tests / eventdev_common_autotest OK 0.17 s
39/110 DPDK:fast-tests / eventdev_selftest_sw OK 0.22 s
40/110 DPDK:fast-tests / fbarray_autotest OK 0.17 s
41/110 DPDK:fast-tests / fib_autotest OK 0.57 s
42/110 DPDK:fast-tests / fib6_autotest OK 0.57 s
43/110 DPDK:fast-tests / func_reentrancy_autotest OK 0.52 s
44/110 DPDK:fast-tests / graph_autotest OK 0.17 s
45/110 DPDK:fast-tests / node_list_dump OK 0.17 s
46/110 DPDK:fast-tests / hash_autotest OK 0.27 s
47/110 DPDK:fast-tests / hash_readwrite_func_autotest SKIP 0.17 s
48/110 DPDK:fast-tests / interrupt_autotest OK 1.22 s
49/110 DPDK:fast-tests / ipfrag_autotest OK 0.17 s
50/110 DPDK:fast-tests / ipsec_autotest SKIP 0.17 s
51/110 DPDK:fast-tests / kvargs_autotest OK 0.17 s
52/110 DPDK:fast-tests / latencystats_autotest OK 0.17 s
53/110 DPDK:fast-tests / lcores_autotest OK 1.27 s
54/110 DPDK:fast-tests / logs_autotest OK 0.17 s
55/110 DPDK:fast-tests / lpm_autotest OK 1.42 s
56/110 DPDK:fast-tests / lpm6_autotest OK 2.93 s
57/110 DPDK:fast-tests / malloc_autotest OK 0.52 s
58/110 DPDK:fast-tests / mbuf_autotest OK 0.17 s
59/110 DPDK:fast-tests / mcslock_autotest OK 0.42 s
60/110 DPDK:fast-tests / member_autotest OK 0.72 s
61/110 DPDK:fast-tests / memcpy_autotest OK 1.47 s
62/110 DPDK:fast-tests / memory_autotest OK 0.17 s
63/110 DPDK:fast-tests / mempool_autotest OK 0.42 s
64/110 DPDK:fast-tests / memzone_autotest OK 0.17 s
65/110 DPDK:fast-tests / meter_autotest OK 0.17 s
66/110 DPDK:fast-tests / metrics_autotest OK 0.17 s
67/110 DPDK:fast-tests / multiprocess_autotest OK 0.22 s
68/110 DPDK:fast-tests / net_ether_autotest OK 0.47 s
69/110 DPDK:fast-tests / pdcp_autotest SKIP 0.17 s
70/110 DPDK:fast-tests / pdump_autotest OK 0.27 s
71/110 DPDK:fast-tests / per_lcore_autotest OK 0.27 s
72/110 DPDK:fast-tests / pflock_autotest OK 0.27 s
73/110 DPDK:fast-tests / pie_autotest OK 0.17 s
74/110 DPDK:fast-tests / ring_pmd_autotest OK 0.17 s
75/110 DPDK:fast-tests / power_autotest OK 0.17 s
76/110 DPDK:fast-tests / power_cpufreq_autotest SKIP 0.17 s
77/110 DPDK:fast-tests / power_intel_uncore_autotest SKIP 0.17 s
78/110 DPDK:fast-tests / power_kvm_vm_autotest SKIP 0.17 s
79/110 DPDK:fast-tests / prefetch_autotest OK 0.17 s
80/110 DPDK:fast-tests / rawdev_autotest OK 0.17 s
81/110 DPDK:fast-tests / rcu_qsbr_autotest OK 0.27 s
82/110 DPDK:fast-tests / reorder_autotest OK 0.27 s
83/110 DPDK:fast-tests / rib_autotest OK 4.53 s
84/110 DPDK:fast-tests / rib6_autotest OK 4.58 s
85/110 DPDK:fast-tests / ring_autotest OK 0.17 s
86/110 DPDK:fast-tests / rwlock_test1_autotest OK 0.32 s
87/110 DPDK:fast-tests / rwlock_rda_autotest OK 5.19 s
88/110 DPDK:fast-tests / rwlock_rds_wrm_autotest OK 5.18 s
89/110 DPDK:fast-tests / rwlock_rde_wro_autotest OK 5.18 s
90/110 DPDK:fast-tests / sched_autotest OK 0.17 s
91/110 DPDK:fast-tests / security_autotest OK 0.17 s
92/110 DPDK:fast-tests / seqlock_autotest SKIP 0.17 s
93/110 DPDK:fast-tests / service_autotest OK 0.27 s
94/110 DPDK:fast-tests / spinlock_autotest OK 0.17 s
95/110 DPDK:fast-tests / stack_autotest OK 0.17 s
96/110 DPDK:fast-tests / stack_lf_autotest OK 0.27 s
97/110 DPDK:fast-tests / string_autotest OK 0.17 s
98/110 DPDK:fast-tests / table_autotest OK 5.38 s
99/110 DPDK:fast-tests / tailq_autotest OK 0.17 s
100/110 DPDK:fast-tests / telemetry_data_autotest OK 0.18 s
101/110 DPDK:fast-tests / telemetry_json_autotest OK 0.18 s
102/110 DPDK:fast-tests / thash_autotest OK 0.18 s
103/110 DPDK:fast-tests / threads_autotest OK 0.37 s
104/110 DPDK:fast-tests / ticketlock_autotest OK 0.22 s
105/110 DPDK:fast-tests / timer_autotest OK 2.52 s
106/110 DPDK:fast-tests / trace_autotest OK 0.17 s
107/110 DPDK:fast-tests / trace_autotest_with_traces OK 0.17 s
108/110 DPDK:fast-tests / vdev_autotest OK 0.17 s
109/110 DPDK:fast-tests / version_autotest OK 0.17 s
110/110 DPDK:fast-tests / telemetry_all SKIP 0.01 s
Ok: 100
Expected Fail: 0
Fail: 0
Unexpected Pass: 0
Skipped: 10
Timeout: 0
Full log written to /root/workspace/Generic-Unit-Test-DPDK/dpdk/build/meson-logs/testlog.txt
ninja: Entering directory `/root/workspace/Generic-Unit-Test-DPDK/dpdk/build'
ninja: no work to do.
1/2 DPDK:driver-tests / cryptodev_openssl_autotest FAIL 0.52 s (killed by signal 11 SIGSEGV)
2/2 DPDK:driver-tests / cryptodev_openssl_asym_autotest OK 0.17 s
Ok: 1
Expected Fail: 0
Fail: 1
Unexpected Pass: 0
Skipped: 0
Timeout: 0
Full log written to /root/workspace/Generic-Unit-Test-DPDK/dpdk/build/meson-logs/testlog.txt
Test log output from the failed test cryptodev_openssl_autotest:
Sorry, we were not able to find the logs for this test.
Download the log output from the CI site for this test run.
==== End log output ====
Debian 12
Kernel: Depends on container host
Compiler: gcc (Debian 12.2.0-14) 12.2.0
CentOS Stream 9
Kernel: Depends on container host
Compiler: gcc 11.5.0 20240719 (Red Hat 11.5.0-2)
CentOS Stream 10
Kernel: Depends on container host
Compiler: gcc 14.2.1 20241104 (Red Hat 14.2.1-6)
Fedora 40 (Clang)
Kernel: Depends on container host
Compiler: clang 18.1.8 (Fedora 18.1.8-1.fc40)
Fedora 40
Kernel: Depends on container host
Compiler: gcc 14.2.1 20240912 (Red Hat 14.2.1-3)
Fedora 41
Kernel: Depends on container host
Compiler: gcc 14.2.1 20240912 (Red Hat 14.2.1-3)
Fedora 41 (Clang)
Kernel: Depends on container host
Compiler: clang 19.1.5 (Fedora 19.1.5-1.fc41)
Ubuntu 24.04
Kernel: Depends on container host
Compiler: gcc (Ubuntu 13.3.0-6ubuntu2~24.04) 13.3.0
RHEL9
Kernel: Depends on container host
Compiler: gcc 11.5.0 20240719 (Red Hat 11.5.0-2)
RHEL8
Kernel: Depends on container host
Compiler: gcc 8.5.0 20210514 (Red Hat 8.5.0-22)
Ubuntu 22.04
Kernel: Depends on container host
Compiler: gcc (Ubuntu 11.4.0-1ubuntu1~22.04) 11.4.0
Ubuntu 20.04
Kernel: Depends on container host
Compiler: gcc (Ubuntu 9.4.0-1ubuntu1~20.04.2) 9.4.0
Windows Server 2022
Kernel: 10.0.20348.2031
Compiler: clang 15.0.7, gcc 14.1.0 (MinGW), and MSVC VS 19.39.33521
To view detailed results, visit:
https://lab.dpdk.org/results/dashboard/tarballs/33159/
UNH-IOL DPDK Community Lab
To manage your email subscriptions, visit:
https://lab.dpdk.org/results/dashboard/preferences/subscriptions/
^ permalink raw reply [flat|nested] 23+ messages in thread
* |FAILURE| [GIT MASTER] 669ba8067b3c7a1467999e826e396cb97332cbc6
@ 2025-04-05 9:20 dpdklab
0 siblings, 0 replies; 23+ messages in thread
From: dpdklab @ 2025-04-05 9:20 UTC (permalink / raw)
To: Test Report
Cc: dpdk-test-reports, Xueming Li, Christian Ehrhardt, Kevin Traynor,
Luca Boccassi
_Testing issues_
Branch: 23.11-staging
669ba8067b3c7a1467999e826e396cb97332cbc6 --> testing issues
Upstream job id: Generic-Unit-Test-DPDK#329002
Test environment and result as below:
+---------------------+----------------+
| Environment | dpdk_unit_test |
+=====================+================+
| Debian 12 | FAIL |
+---------------------+----------------+
| CentOS Stream 9 | FAIL |
+---------------------+----------------+
| CentOS Stream 10 | FAIL |
+---------------------+----------------+
| Fedora 40 (Clang) | FAIL |
+---------------------+----------------+
| Fedora 40 | FAIL |
+---------------------+----------------+
| Fedora 41 | FAIL |
+---------------------+----------------+
| Fedora 41 (Clang) | FAIL |
+---------------------+----------------+
| Ubuntu 24.04 | PEND |
+---------------------+----------------+
| RHEL9 | PEND |
+---------------------+----------------+
| RHEL8 | PEND |
+---------------------+----------------+
| Ubuntu 22.04 | PEND |
+---------------------+----------------+
| Ubuntu 20.04 | PEND |
+---------------------+----------------+
| Windows Server 2022 | PASS |
+---------------------+----------------+
==== Unit test summary for Fedora 41 (Clang) (dpdk_unit_test): ====
ninja: Entering directory `/root/workspace/Generic-Unit-Test-DPDK/dpdk/build'
ninja: no work to do.
1/110 DPDK:fast-tests / acl_autotest OK 2.27 s
2/110 DPDK:fast-tests / atomic_autotest OK 0.37 s
3/110 DPDK:fast-tests / bitcount_autotest OK 0.17 s
4/110 DPDK:fast-tests / bitmap_autotest OK 0.17 s
5/110 DPDK:fast-tests / bitops_autotest OK 0.17 s
6/110 DPDK:fast-tests / bitratestats_autotest OK 0.17 s
7/110 DPDK:fast-tests / bpf_autotest OK 0.17 s
8/110 DPDK:fast-tests / bpf_convert_autotest OK 0.17 s
9/110 DPDK:fast-tests / byteorder_autotest OK 0.17 s
10/110 DPDK:fast-tests / cksum_autotest OK 0.17 s
11/110 DPDK:fast-tests / cmdline_autotest OK 0.17 s
12/110 DPDK:fast-tests / common_autotest OK 0.37 s
13/110 DPDK:fast-tests / compressdev_autotest SKIP 0.17 s
14/110 DPDK:fast-tests / cpuflags_autotest OK 0.17 s
15/110 DPDK:fast-tests / crc_autotest OK 0.17 s
16/110 DPDK:fast-tests / user_delay_us OK 0.17 s
17/110 DPDK:fast-tests / debug_autotest OK 0.42 s
18/110 DPDK:fast-tests / devargs_autotest OK 0.17 s
19/110 DPDK:fast-tests / dispatcher_autotest SKIP 0.17 s
20/110 DPDK:fast-tests / distributor_autotest OK 0.82 s
21/110 DPDK:fast-tests / eal_flags_c_opt_autotest OK 0.52 s
22/110 DPDK:fast-tests / eal_flags_main_opt_autotest OK 0.22 s
23/110 DPDK:fast-tests / eal_flags_n_opt_autotest OK 0.42 s
24/110 DPDK:fast-tests / eal_flags_hpet_autotest OK 0.17 s
25/110 DPDK:fast-tests / eal_flags_no_huge_autotest OK 0.42 s
26/110 DPDK:fast-tests / eal_flags_a_opt_autotest OK 0.27 s
27/110 DPDK:fast-tests / eal_flags_b_opt_autotest OK 0.27 s
28/110 DPDK:fast-tests / eal_flags_vdev_opt_autotest OK 0.52 s
29/110 DPDK:fast-tests / eal_flags_r_opt_autotest OK 0.22 s
30/110 DPDK:fast-tests / eal_flags_mem_autotest OK 0.62 s
31/110 DPDK:fast-tests / eal_flags_file_prefix_autotest OK 1.92 s
32/110 DPDK:fast-tests / eal_flags_misc_autotest OK 1.57 s
33/110 DPDK:fast-tests / eal_fs_autotest OK 0.18 s
34/110 DPDK:fast-tests / errno_autotest OK 0.17 s
35/110 DPDK:fast-tests / ethdev_link_status OK 0.17 s
36/110 DPDK:fast-tests / event_eth_tx_adapter_autotest OK 0.47 s
37/110 DPDK:fast-tests / event_ring_autotest OK 0.17 s
38/110 DPDK:fast-tests / eventdev_common_autotest OK 0.17 s
39/110 DPDK:fast-tests / eventdev_selftest_sw OK 0.22 s
40/110 DPDK:fast-tests / fbarray_autotest OK 0.17 s
41/110 DPDK:fast-tests / fib_autotest OK 0.57 s
42/110 DPDK:fast-tests / fib6_autotest OK 0.57 s
43/110 DPDK:fast-tests / func_reentrancy_autotest OK 0.52 s
44/110 DPDK:fast-tests / graph_autotest OK 0.17 s
45/110 DPDK:fast-tests / node_list_dump OK 0.17 s
46/110 DPDK:fast-tests / hash_autotest OK 0.27 s
47/110 DPDK:fast-tests / hash_readwrite_func_autotest SKIP 0.17 s
48/110 DPDK:fast-tests / interrupt_autotest OK 1.22 s
49/110 DPDK:fast-tests / ipfrag_autotest OK 0.17 s
50/110 DPDK:fast-tests / ipsec_autotest SKIP 0.17 s
51/110 DPDK:fast-tests / kvargs_autotest OK 0.17 s
52/110 DPDK:fast-tests / latencystats_autotest OK 0.17 s
53/110 DPDK:fast-tests / lcores_autotest OK 1.27 s
54/110 DPDK:fast-tests / logs_autotest OK 0.17 s
55/110 DPDK:fast-tests / lpm_autotest OK 1.42 s
56/110 DPDK:fast-tests / lpm6_autotest OK 2.93 s
57/110 DPDK:fast-tests / malloc_autotest OK 0.52 s
58/110 DPDK:fast-tests / mbuf_autotest OK 0.17 s
59/110 DPDK:fast-tests / mcslock_autotest OK 0.42 s
60/110 DPDK:fast-tests / member_autotest OK 0.72 s
61/110 DPDK:fast-tests / memcpy_autotest OK 1.47 s
62/110 DPDK:fast-tests / memory_autotest OK 0.17 s
63/110 DPDK:fast-tests / mempool_autotest OK 0.42 s
64/110 DPDK:fast-tests / memzone_autotest OK 0.17 s
65/110 DPDK:fast-tests / meter_autotest OK 0.17 s
66/110 DPDK:fast-tests / metrics_autotest OK 0.17 s
67/110 DPDK:fast-tests / multiprocess_autotest OK 0.22 s
68/110 DPDK:fast-tests / net_ether_autotest OK 0.47 s
69/110 DPDK:fast-tests / pdcp_autotest SKIP 0.17 s
70/110 DPDK:fast-tests / pdump_autotest OK 0.27 s
71/110 DPDK:fast-tests / per_lcore_autotest OK 0.27 s
72/110 DPDK:fast-tests / pflock_autotest OK 0.27 s
73/110 DPDK:fast-tests / pie_autotest OK 0.17 s
74/110 DPDK:fast-tests / ring_pmd_autotest OK 0.17 s
75/110 DPDK:fast-tests / power_autotest OK 0.17 s
76/110 DPDK:fast-tests / power_cpufreq_autotest SKIP 0.17 s
77/110 DPDK:fast-tests / power_intel_uncore_autotest SKIP 0.17 s
78/110 DPDK:fast-tests / power_kvm_vm_autotest SKIP 0.17 s
79/110 DPDK:fast-tests / prefetch_autotest OK 0.17 s
80/110 DPDK:fast-tests / rawdev_autotest OK 0.17 s
81/110 DPDK:fast-tests / rcu_qsbr_autotest OK 0.27 s
82/110 DPDK:fast-tests / reorder_autotest OK 0.27 s
83/110 DPDK:fast-tests / rib_autotest OK 4.53 s
84/110 DPDK:fast-tests / rib6_autotest OK 4.58 s
85/110 DPDK:fast-tests / ring_autotest OK 0.17 s
86/110 DPDK:fast-tests / rwlock_test1_autotest OK 0.32 s
87/110 DPDK:fast-tests / rwlock_rda_autotest OK 5.19 s
88/110 DPDK:fast-tests / rwlock_rds_wrm_autotest OK 5.18 s
89/110 DPDK:fast-tests / rwlock_rde_wro_autotest OK 5.18 s
90/110 DPDK:fast-tests / sched_autotest OK 0.17 s
91/110 DPDK:fast-tests / security_autotest OK 0.17 s
92/110 DPDK:fast-tests / seqlock_autotest SKIP 0.17 s
93/110 DPDK:fast-tests / service_autotest OK 0.27 s
94/110 DPDK:fast-tests / spinlock_autotest OK 0.17 s
95/110 DPDK:fast-tests / stack_autotest OK 0.17 s
96/110 DPDK:fast-tests / stack_lf_autotest OK 0.27 s
97/110 DPDK:fast-tests / string_autotest OK 0.17 s
98/110 DPDK:fast-tests / table_autotest OK 5.38 s
99/110 DPDK:fast-tests / tailq_autotest OK 0.17 s
100/110 DPDK:fast-tests / telemetry_data_autotest OK 0.18 s
101/110 DPDK:fast-tests / telemetry_json_autotest OK 0.18 s
102/110 DPDK:fast-tests / thash_autotest OK 0.18 s
103/110 DPDK:fast-tests / threads_autotest OK 0.37 s
104/110 DPDK:fast-tests / ticketlock_autotest OK 0.22 s
105/110 DPDK:fast-tests / timer_autotest OK 2.52 s
106/110 DPDK:fast-tests / trace_autotest OK 0.17 s
107/110 DPDK:fast-tests / trace_autotest_with_traces OK 0.17 s
108/110 DPDK:fast-tests / vdev_autotest OK 0.17 s
109/110 DPDK:fast-tests / version_autotest OK 0.17 s
110/110 DPDK:fast-tests / telemetry_all SKIP 0.01 s
Ok: 100
Expected Fail: 0
Fail: 0
Unexpected Pass: 0
Skipped: 10
Timeout: 0
Full log written to /root/workspace/Generic-Unit-Test-DPDK/dpdk/build/meson-logs/testlog.txt
ninja: Entering directory `/root/workspace/Generic-Unit-Test-DPDK/dpdk/build'
ninja: no work to do.
1/2 DPDK:driver-tests / cryptodev_openssl_autotest FAIL 0.52 s (killed by signal 11 SIGSEGV)
2/2 DPDK:driver-tests / cryptodev_openssl_asym_autotest OK 0.17 s
Ok: 1
Expected Fail: 0
Fail: 1
Unexpected Pass: 0
Skipped: 0
Timeout: 0
Full log written to /root/workspace/Generic-Unit-Test-DPDK/dpdk/build/meson-logs/testlog.txt
Test log output from the failed test cryptodev_openssl_autotest:
Sorry, we were not able to find the logs for this test.
Download the log output from the CI site for this test run.
==== End log output ====
Debian 12
Kernel: Depends on container host
Compiler: gcc (Debian 12.2.0-14) 12.2.0
CentOS Stream 9
Kernel: Depends on container host
Compiler: gcc 11.5.0 20240719 (Red Hat 11.5.0-2)
CentOS Stream 10
Kernel: Depends on container host
Compiler: gcc 14.2.1 20241104 (Red Hat 14.2.1-6)
Fedora 40 (Clang)
Kernel: Depends on container host
Compiler: clang 18.1.8 (Fedora 18.1.8-1.fc40)
Fedora 40
Kernel: Depends on container host
Compiler: gcc 14.2.1 20240912 (Red Hat 14.2.1-3)
Fedora 41
Kernel: Depends on container host
Compiler: gcc 14.2.1 20240912 (Red Hat 14.2.1-3)
Fedora 41 (Clang)
Kernel: Depends on container host
Compiler: clang 19.1.5 (Fedora 19.1.5-1.fc41)
Ubuntu 24.04
Kernel: Depends on container host
Compiler: gcc (Ubuntu 13.3.0-6ubuntu2~24.04) 13.3.0
RHEL9
Kernel: Depends on container host
Compiler: gcc 11.5.0 20240719 (Red Hat 11.5.0-2)
RHEL8
Kernel: Depends on container host
Compiler: gcc 8.5.0 20210514 (Red Hat 8.5.0-22)
Ubuntu 22.04
Kernel: Depends on container host
Compiler: gcc (Ubuntu 11.4.0-1ubuntu1~22.04) 11.4.0
Ubuntu 20.04
Kernel: Depends on container host
Compiler: gcc (Ubuntu 9.4.0-1ubuntu1~20.04.2) 9.4.0
Windows Server 2022
Kernel: 10.0.20348.2031
Compiler: clang 15.0.7, gcc 14.1.0 (MinGW), and MSVC VS 19.39.33521
To view detailed results, visit:
https://lab.dpdk.org/results/dashboard/tarballs/33159/
UNH-IOL DPDK Community Lab
To manage your email subscriptions, visit:
https://lab.dpdk.org/results/dashboard/preferences/subscriptions/
^ permalink raw reply [flat|nested] 23+ messages in thread
* |FAILURE| [GIT MASTER] 669ba8067b3c7a1467999e826e396cb97332cbc6
@ 2025-04-05 9:19 dpdklab
0 siblings, 0 replies; 23+ messages in thread
From: dpdklab @ 2025-04-05 9:19 UTC (permalink / raw)
To: Test Report
Cc: dpdk-test-reports, Xueming Li, Christian Ehrhardt, Kevin Traynor,
Luca Boccassi
_Testing issues_
Branch: 23.11-staging
669ba8067b3c7a1467999e826e396cb97332cbc6 --> testing issues
Upstream job id: Generic-Unit-Test-DPDK#328991
Test environment and result as below:
+-----------------------------+----------------+--------------+---------------------------+------------------------------+
| Environment | dpdk_unit_test | lpm_autotest | cryptodev_sw_zuc_autotest | cryptodev_sw_snow3g_autotest |
+=============================+================+==============+===========================+==============================+
| CentOS Stream 10 (ARM) | PEND | SKIPPED | SKIPPED | SKIPPED |
+-----------------------------+----------------+--------------+---------------------------+------------------------------+
| CentOS Stream 9 (ARM) | FAIL | SKIPPED | SKIPPED | SKIPPED |
+-----------------------------+----------------+--------------+---------------------------+------------------------------+
| Debian 12 (arm) | PEND | SKIPPED | PEND | PEND |
+-----------------------------+----------------+--------------+---------------------------+------------------------------+
| Fedora 40 (ARM) | PEND | SKIPPED | SKIPPED | SKIPPED |
+-----------------------------+----------------+--------------+---------------------------+------------------------------+
| Fedora 40 (ARM Clang) | PEND | SKIPPED | SKIPPED | SKIPPED |
+-----------------------------+----------------+--------------+---------------------------+------------------------------+
| Fedora 41 (ARM) | PEND | SKIPPED | SKIPPED | SKIPPED |
+-----------------------------+----------------+--------------+---------------------------+------------------------------+
| Fedora 41 (ARM Clang) | PEND | SKIPPED | SKIPPED | SKIPPED |
+-----------------------------+----------------+--------------+---------------------------+------------------------------+
| Ubuntu 20.04 (ARM) | PEND | SKIPPED | SKIPPED | SKIPPED |
+-----------------------------+----------------+--------------+---------------------------+------------------------------+
| Ubuntu 22.04 (ARM) | PEND | SKIPPED | SKIPPED | SKIPPED |
+-----------------------------+----------------+--------------+---------------------------+------------------------------+
| RHEL9 (ARM) | PEND | SKIPPED | SKIPPED | SKIPPED |
+-----------------------------+----------------+--------------+---------------------------+------------------------------+
| 32-bit Ubuntu 22.04.4 (ARM) | PASS | SKIPPED | SKIPPED | SKIPPED |
+-----------------------------+----------------+--------------+---------------------------+------------------------------+
| Ubuntu 24.04 (ARM) | PEND | SKIPPED | SKIPPED | SKIPPED |
+-----------------------------+----------------+--------------+---------------------------+------------------------------+
| Ubuntu 20.04 ARM SVE | SKIPPED | PEND | SKIPPED | SKIPPED |
+-----------------------------+----------------+--------------+---------------------------+------------------------------+
==== Unit test summary for CentOS Stream 9 (ARM) (dpdk_unit_test): ====
ninja: Entering directory `/home-local/jenkins-local/jenkins-agent/workspace/Generic-Unit-Test-DPDK/dpdk/build'
ninja: no work to do.
1/110 DPDK:fast-tests / acl_autotest OK 4.94 s
2/110 DPDK:fast-tests / atomic_autotest OK 5.43 s
3/110 DPDK:fast-tests / bitcount_autotest OK 0.17 s
4/110 DPDK:fast-tests / bitmap_autotest OK 0.17 s
5/110 DPDK:fast-tests / bitops_autotest OK 0.17 s
6/110 DPDK:fast-tests / bitratestats_autotest OK 0.17 s
7/110 DPDK:fast-tests / bpf_autotest OK 0.17 s
8/110 DPDK:fast-tests / bpf_convert_autotest OK 0.17 s
9/110 DPDK:fast-tests / byteorder_autotest OK 0.17 s
10/110 DPDK:fast-tests / cksum_autotest OK 0.17 s
11/110 DPDK:fast-tests / cmdline_autotest OK 0.17 s
12/110 DPDK:fast-tests / common_autotest OK 0.87 s
13/110 DPDK:fast-tests / compressdev_autotest SKIP 0.07 s
14/110 DPDK:fast-tests / cpuflags_autotest OK 0.22 s
15/110 DPDK:fast-tests / crc_autotest OK 0.17 s
16/110 DPDK:fast-tests / user_delay_us OK 0.17 s
17/110 DPDK:fast-tests / debug_autotest OK 0.87 s
18/110 DPDK:fast-tests / devargs_autotest OK 0.17 s
19/110 DPDK:fast-tests / dispatcher_autotest OK 2.42 s
20/110 DPDK:fast-tests / distributor_autotest OK 0.77 s
21/110 DPDK:fast-tests / eal_flags_c_opt_autotest OK 0.82 s
22/110 DPDK:fast-tests / eal_flags_main_opt_autotest OK 0.27 s
23/110 DPDK:fast-tests / eal_flags_n_opt_autotest OK 0.22 s
24/110 DPDK:fast-tests / eal_flags_hpet_autotest OK 0.17 s
25/110 DPDK:fast-tests / eal_flags_no_huge_autotest OK 0.27 s
26/110 DPDK:fast-tests / eal_flags_a_opt_autotest OK 0.32 s
27/110 DPDK:fast-tests / eal_flags_b_opt_autotest OK 0.27 s
28/110 DPDK:fast-tests / eal_flags_vdev_opt_autotest OK 0.27 s
29/110 DPDK:fast-tests / eal_flags_r_opt_autotest OK 0.22 s
30/110 DPDK:fast-tests / eal_flags_mem_autotest OK 0.37 s
31/110 DPDK:fast-tests / eal_flags_file_prefix_autotest OK 1.28 s
32/110 DPDK:fast-tests / eal_flags_misc_autotest OK 0.92 s
33/110 DPDK:fast-tests / eal_fs_autotest OK 0.17 s
34/110 DPDK:fast-tests / errno_autotest OK 0.17 s
35/110 DPDK:fast-tests / ethdev_link_status OK 0.17 s
36/110 DPDK:fast-tests / event_eth_tx_adapter_autotest OK 1.22 s
37/110 DPDK:fast-tests / event_ring_autotest OK 0.17 s
38/110 DPDK:fast-tests / eventdev_common_autotest OK 0.17 s
39/110 DPDK:fast-tests / eventdev_selftest_sw OK 7.44 s
40/110 DPDK:fast-tests / fbarray_autotest OK 0.17 s
41/110 DPDK:fast-tests / fib_autotest OK 0.77 s
42/110 DPDK:fast-tests / fib6_autotest OK 0.87 s
43/110 DPDK:fast-tests / func_reentrancy_autotest OK 0.77 s
44/110 DPDK:fast-tests / graph_autotest OK 0.17 s
45/110 DPDK:fast-tests / node_list_dump OK 0.17 s
46/110 DPDK:fast-tests / hash_autotest OK 0.52 s
47/110 DPDK:fast-tests / hash_readwrite_func_autotest OK 7.24 s
48/110 DPDK:fast-tests / interrupt_autotest OK 1.17 s
49/110 DPDK:fast-tests / ipfrag_autotest OK 0.07 s
50/110 DPDK:fast-tests / ipsec_autotest SKIP 0.17 s
51/110 DPDK:fast-tests / kvargs_autotest OK 0.17 s
52/110 DPDK:fast-tests / latencystats_autotest OK 0.17 s
53/110 DPDK:fast-tests / lcores_autotest OK 3.73 s
54/110 DPDK:fast-tests / logs_autotest OK 0.17 s
55/110 DPDK:fast-tests / lpm_autotest OK 1.68 s
56/110 DPDK:fast-tests / lpm6_autotest OK 5.00 s
57/110 DPDK:fast-tests / malloc_autotest OK 0.42 s
58/110 DPDK:fast-tests / mbuf_autotest OK 4.03 s
59/110 DPDK:fast-tests / mcslock_autotest OK 0.87 s
60/110 DPDK:fast-tests / member_autotest OK 1.53 s
61/110 DPDK:fast-tests / memcpy_autotest OK 5.50 s
62/110 DPDK:fast-tests / memory_autotest OK 0.07 s
63/110 DPDK:fast-tests / mempool_autotest OK 0.52 s
64/110 DPDK:fast-tests / memzone_autotest OK 0.12 s
65/110 DPDK:fast-tests / meter_autotest OK 0.17 s
66/110 DPDK:fast-tests / metrics_autotest OK 0.17 s
67/110 DPDK:fast-tests / multiprocess_autotest OK 0.22 s
68/110 DPDK:fast-tests / net_ether_autotest OK 1.02 s
69/110 DPDK:fast-tests / pdcp_autotest SKIP 0.07 s
70/110 DPDK:fast-tests / pdump_autotest OK 0.37 s
71/110 DPDK:fast-tests / per_lcore_autotest OK 0.27 s
72/110 DPDK:fast-tests / pflock_autotest OK 0.47 s
73/110 DPDK:fast-tests / pie_autotest OK 0.17 s
74/110 DPDK:fast-tests / ring_pmd_autotest OK 0.17 s
75/110 DPDK:fast-tests / power_autotest OK 0.17 s
76/110 DPDK:fast-tests / power_cpufreq_autotest SKIP 0.07 s
77/110 DPDK:fast-tests / power_intel_uncore_autotest SKIP 0.17 s
78/110 DPDK:fast-tests / power_kvm_vm_autotest SKIP 0.07 s
79/110 DPDK:fast-tests / prefetch_autotest OK 0.17 s
80/110 DPDK:fast-tests / rawdev_autotest OK 0.17 s
81/110 DPDK:fast-tests / rcu_qsbr_autotest OK 0.62 s
82/110 DPDK:fast-tests / reorder_autotest OK 0.42 s
83/110 DPDK:fast-tests / rib_autotest OK 3.93 s
84/110 DPDK:fast-tests / rib6_autotest OK 4.04 s
85/110 DPDK:fast-tests / ring_autotest OK 0.17 s
86/110 DPDK:fast-tests / rwlock_test1_autotest OK 0.47 s
87/110 DPDK:fast-tests / rwlock_rda_autotest OK 5.13 s
88/110 DPDK:fast-tests / rwlock_rds_wrm_autotest OK 5.18 s
89/110 DPDK:fast-tests / rwlock_rde_wro_autotest OK 5.18 s
90/110 DPDK:fast-tests / sched_autotest OK 0.17 s
91/110 DPDK:fast-tests / security_autotest OK 0.07 s
92/110 DPDK:fast-tests / seqlock_autotest OK 2.17 s
93/110 DPDK:fast-tests / service_autotest OK 2.88 s
94/110 DPDK:fast-tests / spinlock_autotest OK 0.22 s
95/110 DPDK:fast-tests / stack_autotest OK 0.37 s
96/110 DPDK:fast-tests / stack_lf_autotest OK 0.32 s
97/110 DPDK:fast-tests / string_autotest OK 0.17 s
98/110 DPDK:fast-tests / table_autotest OK 7.30 s
99/110 DPDK:fast-tests / tailq_autotest OK 0.47 s
100/110 DPDK:fast-tests / telemetry_data_autotest OK 0.17 s
101/110 DPDK:fast-tests / telemetry_json_autotest OK 0.17 s
102/110 DPDK:fast-tests / thash_autotest OK 0.17 s
103/110 DPDK:fast-tests / threads_autotest OK 0.32 s
104/110 DPDK:fast-tests / ticketlock_autotest OK 0.22 s
105/110 DPDK:fast-tests / timer_autotest OK 2.83 s
106/110 DPDK:fast-tests / trace_autotest OK 0.22 s
107/110 DPDK:fast-tests / trace_autotest_with_traces OK 0.17 s
108/110 DPDK:fast-tests / vdev_autotest OK 0.17 s
109/110 DPDK:fast-tests / version_autotest OK 0.17 s
110/110 DPDK:fast-tests / telemetry_all SKIP 0.12 s
Ok: 103
Expected Fail: 0
Fail: 0
Unexpected Pass: 0
Skipped: 7
Timeout: 0
Full log written to /home-local/jenkins-local/jenkins-agent/workspace/Generic-Unit-Test-DPDK/dpdk/build/meson-logs/testlog.txt
ninja: Entering directory `/home-local/jenkins-local/jenkins-agent/workspace/Generic-Unit-Test-DPDK/dpdk/build'
ninja: no work to do.
1/2 DPDK:driver-tests / cryptodev_openssl_autotest FAIL 1.42 s (killed by signal 11 SIGSEGV)
2/2 DPDK:driver-tests / cryptodev_openssl_asym_autotest OK 0.12 s
Ok: 1
Expected Fail: 0
Fail: 1
Unexpected Pass: 0
Skipped: 0
Timeout: 0
Full log written to /home-local/jenkins-local/jenkins-agent/workspace/Generic-Unit-Test-DPDK/dpdk/build/meson-logs/testlog.txt
Test log output from the failed test cryptodev_openssl_autotest:
Sorry, we were not able to find the logs for this test.
Download the log output from the CI site for this test run.
==== End log output ====
CentOS Stream 10 (ARM)
Kernel: Depends on container host
Compiler: gcc 14.2.1 20241104 (Red Hat 14.2.1-6)
CentOS Stream 9 (ARM)
Kernel: Depends on container host
Compiler: gcc 11.5.0 20240719 (Red Hat 11.5.0-2)
Debian 12 (arm)
Kernel: Depends on container host
Compiler: gcc (Debian 12.2.0-14) 12.2.0
Fedora 40 (ARM)
Kernel: Depends on container host
Compiler: gcc 14.2.1 20240912 (Red Hat 14.2.1-3)
Fedora 40 (ARM Clang)
Kernel: Depends on container host
Compiler: clang 18.1.8 (Fedora 18.1.8-1.fc40)
Fedora 41 (ARM)
Kernel: Depends on container host
Compiler: gcc 14.2.1 20240912 (Red Hat 14.2.1-3)
Fedora 41 (ARM Clang)
Kernel: Depends on container host
Compiler: clang 19.1.5 (Fedora 19.1.5-1.fc41)
Ubuntu 20.04 (ARM)
Kernel: Depends on container host
Compiler: gcc (Ubuntu 9.4.0-1ubuntu1~20.04.2) 9.4.0
Ubuntu 22.04 (ARM)
Kernel: Depends on container host
Compiler: gcc (Ubuntu 11.4.0-1ubuntu1~22.04) 11.4.0
RHEL9 (ARM)
Kernel: Depends on container host
Compiler: gcc 11.5.0 20240719 (Red Hat 11.5.0-2)
32-bit Ubuntu 22.04.4 (ARM)
Kernel: 5.15.83+ aarch64
Compiler: gcc (Ubuntu 11.4.0-1ubuntu1~22.04) 11.4.0
Ubuntu 24.04 (ARM)
Kernel: Depends on container host
Compiler: gcc (Ubuntu 13.3.0-6ubuntu2~24.04) 13.3.0
Ubuntu 20.04 ARM SVE
Kernel: Depends on container host
Compiler: gcc (Ubuntu 10.5.0-1ubuntu1~20.04) 10.5.0
To view detailed results, visit:
https://lab.dpdk.org/results/dashboard/tarballs/33159/
UNH-IOL DPDK Community Lab
To manage your email subscriptions, visit:
https://lab.dpdk.org/results/dashboard/preferences/subscriptions/
^ permalink raw reply [flat|nested] 23+ messages in thread
* |FAILURE| [GIT MASTER] 669ba8067b3c7a1467999e826e396cb97332cbc6
@ 2025-04-05 9:13 dpdklab
0 siblings, 0 replies; 23+ messages in thread
From: dpdklab @ 2025-04-05 9:13 UTC (permalink / raw)
To: Test Report
Cc: dpdk-test-reports, Xueming Li, Christian Ehrhardt, Kevin Traynor,
Luca Boccassi
_Testing issues_
Branch: 23.11-staging
669ba8067b3c7a1467999e826e396cb97332cbc6 --> testing issues
Upstream job id: Generic-Unit-Test-DPDK#328996
Test environment and result as below:
+---------------------+----------------+
| Environment | dpdk_unit_test |
+=====================+================+
| Debian 12 | FAIL |
+---------------------+----------------+
| CentOS Stream 9 | FAIL |
+---------------------+----------------+
| CentOS Stream 10 | FAIL |
+---------------------+----------------+
| Fedora 40 (Clang) | FAIL |
+---------------------+----------------+
| Fedora 40 | FAIL |
+---------------------+----------------+
| Fedora 41 | PEND |
+---------------------+----------------+
| Fedora 41 (Clang) | PEND |
+---------------------+----------------+
| Ubuntu 24.04 | PEND |
+---------------------+----------------+
| RHEL9 | PEND |
+---------------------+----------------+
| RHEL8 | PEND |
+---------------------+----------------+
| Ubuntu 22.04 | PEND |
+---------------------+----------------+
| Ubuntu 20.04 | PEND |
+---------------------+----------------+
| Windows Server 2022 | PASS |
+---------------------+----------------+
==== Unit test summary for Fedora 40 (dpdk_unit_test): ====
ninja: Entering directory `/home-local/jenkins-local/jenkins-agent/workspace/Generic-Unit-Test-DPDK@3/dpdk/build'
ninja: no work to do.
1/110 DPDK:fast-tests / acl_autotest OK 3.52 s
2/110 DPDK:fast-tests / atomic_autotest OK 0.59 s
3/110 DPDK:fast-tests / bitcount_autotest OK 0.22 s
4/110 DPDK:fast-tests / bitmap_autotest OK 0.22 s
5/110 DPDK:fast-tests / bitops_autotest OK 0.22 s
6/110 DPDK:fast-tests / bitratestats_autotest OK 0.22 s
7/110 DPDK:fast-tests / bpf_autotest OK 0.22 s
8/110 DPDK:fast-tests / bpf_convert_autotest OK 0.25 s
9/110 DPDK:fast-tests / byteorder_autotest OK 0.22 s
10/110 DPDK:fast-tests / cksum_autotest OK 0.22 s
11/110 DPDK:fast-tests / cmdline_autotest OK 0.22 s
12/110 DPDK:fast-tests / common_autotest OK 0.66 s
13/110 DPDK:fast-tests / compressdev_autotest SKIP 0.17 s
14/110 DPDK:fast-tests / cpuflags_autotest OK 0.22 s
15/110 DPDK:fast-tests / crc_autotest OK 0.22 s
16/110 DPDK:fast-tests / user_delay_us OK 0.22 s
17/110 DPDK:fast-tests / debug_autotest OK 18.49 s
18/110 DPDK:fast-tests / devargs_autotest OK 0.25 s
19/110 DPDK:fast-tests / dispatcher_autotest SKIP 0.18 s
20/110 DPDK:fast-tests / distributor_autotest OK 1.44 s
21/110 DPDK:fast-tests / eal_flags_c_opt_autotest OK 0.96 s
22/110 DPDK:fast-tests / eal_flags_main_opt_autotest OK 0.45 s
23/110 DPDK:fast-tests / eal_flags_n_opt_autotest OK 0.46 s
24/110 DPDK:fast-tests / eal_flags_hpet_autotest OK 0.25 s
25/110 DPDK:fast-tests / eal_flags_no_huge_autotest OK 0.48 s
26/110 DPDK:fast-tests / eal_flags_a_opt_autotest OK 0.43 s
27/110 DPDK:fast-tests / eal_flags_b_opt_autotest OK 0.49 s
28/110 DPDK:fast-tests / eal_flags_vdev_opt_autotest OK 0.57 s
29/110 DPDK:fast-tests / eal_flags_r_opt_autotest OK 0.43 s
30/110 DPDK:fast-tests / eal_flags_mem_autotest OK 0.82 s
31/110 DPDK:fast-tests / eal_flags_file_prefix_autotest OK 6.44 s
32/110 DPDK:fast-tests / eal_flags_misc_autotest OK 2.13 s
33/110 DPDK:fast-tests / eal_fs_autotest OK 0.22 s
34/110 DPDK:fast-tests / errno_autotest OK 0.25 s
35/110 DPDK:fast-tests / ethdev_link_status OK 0.23 s
36/110 DPDK:fast-tests / event_eth_tx_adapter_autotest OK 0.62 s
37/110 DPDK:fast-tests / event_ring_autotest OK 0.25 s
38/110 DPDK:fast-tests / eventdev_common_autotest OK 0.26 s
39/110 DPDK:fast-tests / eventdev_selftest_sw OK 0.30 s
40/110 DPDK:fast-tests / fbarray_autotest OK 0.23 s
41/110 DPDK:fast-tests / fib_autotest OK 1.10 s
42/110 DPDK:fast-tests / fib6_autotest OK 1.09 s
43/110 DPDK:fast-tests / func_reentrancy_autotest OK 0.93 s
44/110 DPDK:fast-tests / graph_autotest OK 0.24 s
45/110 DPDK:fast-tests / node_list_dump OK 0.21 s
46/110 DPDK:fast-tests / hash_autotest OK 0.37 s
47/110 DPDK:fast-tests / hash_readwrite_func_autotest SKIP 0.17 s
48/110 DPDK:fast-tests / interrupt_autotest OK 1.49 s
49/110 DPDK:fast-tests / ipfrag_autotest OK 0.15 s
50/110 DPDK:fast-tests / ipsec_autotest SKIP 0.21 s
51/110 DPDK:fast-tests / kvargs_autotest OK 0.35 s
52/110 DPDK:fast-tests / latencystats_autotest OK 0.23 s
53/110 DPDK:fast-tests / lcores_autotest OK 2.01 s
54/110 DPDK:fast-tests / logs_autotest OK 0.27 s
55/110 DPDK:fast-tests / lpm_autotest OK 2.37 s
56/110 DPDK:fast-tests / lpm6_autotest OK 4.35 s
57/110 DPDK:fast-tests / malloc_autotest OK 0.94 s
58/110 DPDK:fast-tests / mbuf_autotest OK 0.48 s
59/110 DPDK:fast-tests / mcslock_autotest OK 0.71 s
60/110 DPDK:fast-tests / member_autotest OK 1.35 s
61/110 DPDK:fast-tests / memcpy_autotest OK 3.34 s
62/110 DPDK:fast-tests / memory_autotest OK 0.23 s
63/110 DPDK:fast-tests / mempool_autotest OK 0.51 s
64/110 DPDK:fast-tests / memzone_autotest OK 0.17 s
65/110 DPDK:fast-tests / meter_autotest OK 0.25 s
66/110 DPDK:fast-tests / metrics_autotest OK 0.24 s
67/110 DPDK:fast-tests / multiprocess_autotest OK 0.54 s
68/110 DPDK:fast-tests / net_ether_autotest OK 0.93 s
69/110 DPDK:fast-tests / pdcp_autotest SKIP 0.22 s
70/110 DPDK:fast-tests / pdump_autotest OK 0.38 s
71/110 DPDK:fast-tests / per_lcore_autotest OK 0.42 s
72/110 DPDK:fast-tests / pflock_autotest OK 0.55 s
73/110 DPDK:fast-tests / pie_autotest OK 0.30 s
74/110 DPDK:fast-tests / ring_pmd_autotest OK 0.27 s
75/110 DPDK:fast-tests / power_autotest OK 0.27 s
76/110 DPDK:fast-tests / power_cpufreq_autotest SKIP 0.25 s
77/110 DPDK:fast-tests / power_intel_uncore_autotest SKIP 0.29 s
78/110 DPDK:fast-tests / power_kvm_vm_autotest SKIP 0.30 s
79/110 DPDK:fast-tests / prefetch_autotest OK 0.20 s
80/110 DPDK:fast-tests / rawdev_autotest OK 0.19 s
81/110 DPDK:fast-tests / rcu_qsbr_autotest OK 0.47 s
82/110 DPDK:fast-tests / reorder_autotest OK 0.50 s
83/110 DPDK:fast-tests / rib_autotest OK 7.66 s
84/110 DPDK:fast-tests / rib6_autotest OK 7.01 s
85/110 DPDK:fast-tests / ring_autotest OK 0.42 s
86/110 DPDK:fast-tests / rwlock_test1_autotest OK 0.50 s
87/110 DPDK:fast-tests / rwlock_rda_autotest OK 5.24 s
88/110 DPDK:fast-tests / rwlock_rds_wrm_autotest OK 5.31 s
89/110 DPDK:fast-tests / rwlock_rde_wro_autotest OK 5.40 s
90/110 DPDK:fast-tests / sched_autotest OK 0.39 s
91/110 DPDK:fast-tests / security_autotest OK 0.20 s
92/110 DPDK:fast-tests / seqlock_autotest SKIP 0.28 s
93/110 DPDK:fast-tests / service_autotest OK 0.42 s
94/110 DPDK:fast-tests / spinlock_autotest OK 0.21 s
95/110 DPDK:fast-tests / stack_autotest OK 0.40 s
96/110 DPDK:fast-tests / stack_lf_autotest OK 0.37 s
97/110 DPDK:fast-tests / string_autotest OK 0.18 s
98/110 DPDK:fast-tests / table_autotest OK 9.18 s
99/110 DPDK:fast-tests / tailq_autotest OK 0.29 s
100/110 DPDK:fast-tests / telemetry_data_autotest OK 0.19 s
101/110 DPDK:fast-tests / telemetry_json_autotest OK 0.18 s
102/110 DPDK:fast-tests / thash_autotest OK 0.28 s
103/110 DPDK:fast-tests / threads_autotest OK 0.59 s
104/110 DPDK:fast-tests / ticketlock_autotest OK 0.23 s
105/110 DPDK:fast-tests / timer_autotest OK 3.03 s
106/110 DPDK:fast-tests / trace_autotest OK 0.36 s
107/110 DPDK:fast-tests / trace_autotest_with_traces OK 0.42 s
108/110 DPDK:fast-tests / vdev_autotest OK 0.19 s
109/110 DPDK:fast-tests / version_autotest OK 0.19 s
110/110 DPDK:fast-tests / telemetry_all SKIP 0.01 s
Ok: 100
Expected Fail: 0
Fail: 0
Unexpected Pass: 0
Skipped: 10
Timeout: 0
Full log written to /home-local/jenkins-local/jenkins-agent/workspace/Generic-Unit-Test-DPDK@3/dpdk/build/meson-logs/testlog.txt
ninja: Entering directory `/home-local/jenkins-local/jenkins-agent/workspace/Generic-Unit-Test-DPDK@3/dpdk/build'
ninja: no work to do.
1/2 DPDK:driver-tests / cryptodev_openssl_autotest FAIL 1.78 s (killed by signal 11 SIGSEGV)
2/2 DPDK:driver-tests / cryptodev_openssl_asym_autotest OK 0.17 s
Ok: 1
Expected Fail: 0
Fail: 1
Unexpected Pass: 0
Skipped: 0
Timeout: 0
Full log written to /home-local/jenkins-local/jenkins-agent/workspace/Generic-Unit-Test-DPDK@3/dpdk/build/meson-logs/testlog.txt
Test log output from the failed test cryptodev_openssl_autotest:
Sorry, we were not able to find the logs for this test.
Download the log output from the CI site for this test run.
==== End log output ====
Debian 12
Kernel: Depends on container host
Compiler: gcc (Debian 12.2.0-14) 12.2.0
CentOS Stream 9
Kernel: Depends on container host
Compiler: gcc 11.5.0 20240719 (Red Hat 11.5.0-2)
CentOS Stream 10
Kernel: Depends on container host
Compiler: gcc 14.2.1 20241104 (Red Hat 14.2.1-6)
Fedora 40 (Clang)
Kernel: Depends on container host
Compiler: clang 18.1.8 (Fedora 18.1.8-1.fc40)
Fedora 40
Kernel: Depends on container host
Compiler: gcc 14.2.1 20240912 (Red Hat 14.2.1-3)
Fedora 41
Kernel: Depends on container host
Compiler: gcc 14.2.1 20240912 (Red Hat 14.2.1-3)
Fedora 41 (Clang)
Kernel: Depends on container host
Compiler: clang 19.1.5 (Fedora 19.1.5-1.fc41)
Ubuntu 24.04
Kernel: Depends on container host
Compiler: gcc (Ubuntu 13.3.0-6ubuntu2~24.04) 13.3.0
RHEL9
Kernel: Depends on container host
Compiler: gcc 11.5.0 20240719 (Red Hat 11.5.0-2)
RHEL8
Kernel: Depends on container host
Compiler: gcc 8.5.0 20210514 (Red Hat 8.5.0-22)
Ubuntu 22.04
Kernel: Depends on container host
Compiler: gcc (Ubuntu 11.4.0-1ubuntu1~22.04) 11.4.0
Ubuntu 20.04
Kernel: Depends on container host
Compiler: gcc (Ubuntu 9.4.0-1ubuntu1~20.04.2) 9.4.0
Windows Server 2022
Kernel: 10.0.20348.2031
Compiler: clang 15.0.7, gcc 14.1.0 (MinGW), and MSVC VS 19.39.33521
To view detailed results, visit:
https://lab.dpdk.org/results/dashboard/tarballs/33159/
UNH-IOL DPDK Community Lab
To manage your email subscriptions, visit:
https://lab.dpdk.org/results/dashboard/preferences/subscriptions/
^ permalink raw reply [flat|nested] 23+ messages in thread
* |FAILURE| [GIT MASTER] 669ba8067b3c7a1467999e826e396cb97332cbc6
@ 2025-04-05 9:12 dpdklab
0 siblings, 0 replies; 23+ messages in thread
From: dpdklab @ 2025-04-05 9:12 UTC (permalink / raw)
To: Test Report
Cc: dpdk-test-reports, Xueming Li, Christian Ehrhardt, Kevin Traynor,
Luca Boccassi
_Testing issues_
Branch: 23.11-staging
669ba8067b3c7a1467999e826e396cb97332cbc6 --> testing issues
Upstream job id: Generic-Unit-Test-DPDK#328994
Test environment and result as below:
+---------------------+----------------+
| Environment | dpdk_unit_test |
+=====================+================+
| Debian 12 | FAIL |
+---------------------+----------------+
| CentOS Stream 9 | FAIL |
+---------------------+----------------+
| CentOS Stream 10 | FAIL |
+---------------------+----------------+
| Fedora 40 (Clang) | FAIL |
+---------------------+----------------+
| Fedora 40 | PEND |
+---------------------+----------------+
| Fedora 41 | PEND |
+---------------------+----------------+
| Fedora 41 (Clang) | PEND |
+---------------------+----------------+
| Ubuntu 24.04 | PEND |
+---------------------+----------------+
| RHEL9 | PEND |
+---------------------+----------------+
| RHEL8 | PEND |
+---------------------+----------------+
| Ubuntu 22.04 | PEND |
+---------------------+----------------+
| Ubuntu 20.04 | PEND |
+---------------------+----------------+
| Windows Server 2022 | PASS |
+---------------------+----------------+
==== Unit test summary for Fedora 40 (Clang) (dpdk_unit_test): ====
ninja: Entering directory `/home-local/jenkins-local/jenkins-agent/workspace/Generic-Unit-Test-DPDK/dpdk/build'
ninja: no work to do.
1/110 DPDK:fast-tests / acl_autotest OK 2.68 s
2/110 DPDK:fast-tests / atomic_autotest OK 0.42 s
3/110 DPDK:fast-tests / bitcount_autotest OK 0.22 s
4/110 DPDK:fast-tests / bitmap_autotest OK 0.22 s
5/110 DPDK:fast-tests / bitops_autotest OK 0.17 s
6/110 DPDK:fast-tests / bitratestats_autotest OK 0.22 s
7/110 DPDK:fast-tests / bpf_autotest OK 0.22 s
8/110 DPDK:fast-tests / bpf_convert_autotest OK 0.22 s
9/110 DPDK:fast-tests / byteorder_autotest OK 0.17 s
10/110 DPDK:fast-tests / cksum_autotest OK 0.17 s
11/110 DPDK:fast-tests / cmdline_autotest OK 0.17 s
12/110 DPDK:fast-tests / common_autotest OK 0.42 s
13/110 DPDK:fast-tests / compressdev_autotest SKIP 0.17 s
14/110 DPDK:fast-tests / cpuflags_autotest OK 0.22 s
15/110 DPDK:fast-tests / crc_autotest OK 0.22 s
16/110 DPDK:fast-tests / user_delay_us OK 0.17 s
17/110 DPDK:fast-tests / debug_autotest OK 0.47 s
18/110 DPDK:fast-tests / devargs_autotest OK 0.17 s
19/110 DPDK:fast-tests / dispatcher_autotest SKIP 0.17 s
20/110 DPDK:fast-tests / distributor_autotest OK 0.87 s
21/110 DPDK:fast-tests / eal_flags_c_opt_autotest OK 0.67 s
22/110 DPDK:fast-tests / eal_flags_main_opt_autotest OK 0.32 s
23/110 DPDK:fast-tests / eal_flags_n_opt_autotest OK 0.47 s
24/110 DPDK:fast-tests / eal_flags_hpet_autotest OK 0.22 s
25/110 DPDK:fast-tests / eal_flags_no_huge_autotest OK 0.47 s
26/110 DPDK:fast-tests / eal_flags_a_opt_autotest OK 0.32 s
27/110 DPDK:fast-tests / eal_flags_b_opt_autotest OK 0.32 s
28/110 DPDK:fast-tests / eal_flags_vdev_opt_autotest OK 0.57 s
29/110 DPDK:fast-tests / eal_flags_r_opt_autotest OK 0.27 s
30/110 DPDK:fast-tests / eal_flags_mem_autotest OK 0.72 s
31/110 DPDK:fast-tests / eal_flags_file_prefix_autotest OK 4.43 s
32/110 DPDK:fast-tests / eal_flags_misc_autotest OK 1.77 s
33/110 DPDK:fast-tests / eal_fs_autotest OK 0.22 s
34/110 DPDK:fast-tests / errno_autotest OK 0.17 s
35/110 DPDK:fast-tests / ethdev_link_status OK 0.17 s
36/110 DPDK:fast-tests / event_eth_tx_adapter_autotest OK 0.47 s
37/110 DPDK:fast-tests / event_ring_autotest OK 0.22 s
38/110 DPDK:fast-tests / eventdev_common_autotest OK 0.22 s
39/110 DPDK:fast-tests / eventdev_selftest_sw OK 0.22 s
40/110 DPDK:fast-tests / fbarray_autotest OK 0.17 s
41/110 DPDK:fast-tests / fib_autotest OK 0.82 s
42/110 DPDK:fast-tests / fib6_autotest OK 0.62 s
43/110 DPDK:fast-tests / func_reentrancy_autotest OK 0.53 s
44/110 DPDK:fast-tests / graph_autotest OK 0.22 s
45/110 DPDK:fast-tests / node_list_dump OK 0.22 s
46/110 DPDK:fast-tests / hash_autotest OK 0.32 s
47/110 DPDK:fast-tests / hash_readwrite_func_autotest SKIP 0.17 s
48/110 DPDK:fast-tests / interrupt_autotest OK 1.22 s
49/110 DPDK:fast-tests / ipfrag_autotest OK 0.17 s
50/110 DPDK:fast-tests / ipsec_autotest SKIP 0.22 s
51/110 DPDK:fast-tests / kvargs_autotest OK 0.22 s
52/110 DPDK:fast-tests / latencystats_autotest OK 0.22 s
53/110 DPDK:fast-tests / lcores_autotest OK 1.27 s
54/110 DPDK:fast-tests / logs_autotest OK 0.22 s
55/110 DPDK:fast-tests / lpm_autotest OK 1.42 s
56/110 DPDK:fast-tests / lpm6_autotest OK 2.62 s
57/110 DPDK:fast-tests / malloc_autotest OK 0.57 s
58/110 DPDK:fast-tests / mbuf_autotest OK 0.22 s
59/110 DPDK:fast-tests / mcslock_autotest OK 0.42 s
60/110 DPDK:fast-tests / member_autotest OK 0.77 s
61/110 DPDK:fast-tests / memcpy_autotest OK 1.47 s
62/110 DPDK:fast-tests / memory_autotest OK 0.17 s
63/110 DPDK:fast-tests / mempool_autotest OK 0.47 s
64/110 DPDK:fast-tests / memzone_autotest OK 0.17 s
65/110 DPDK:fast-tests / meter_autotest OK 0.22 s
66/110 DPDK:fast-tests / metrics_autotest OK 0.22 s
67/110 DPDK:fast-tests / multiprocess_autotest OK 0.27 s
68/110 DPDK:fast-tests / net_ether_autotest OK 0.52 s
69/110 DPDK:fast-tests / pdcp_autotest SKIP 0.17 s
70/110 DPDK:fast-tests / pdump_autotest OK 0.32 s
71/110 DPDK:fast-tests / per_lcore_autotest OK 0.32 s
72/110 DPDK:fast-tests / pflock_autotest OK 0.32 s
73/110 DPDK:fast-tests / pie_autotest OK 0.22 s
74/110 DPDK:fast-tests / ring_pmd_autotest OK 0.22 s
75/110 DPDK:fast-tests / power_autotest OK 0.17 s
76/110 DPDK:fast-tests / power_cpufreq_autotest SKIP 0.17 s
77/110 DPDK:fast-tests / power_intel_uncore_autotest SKIP 0.22 s
78/110 DPDK:fast-tests / power_kvm_vm_autotest SKIP 0.17 s
79/110 DPDK:fast-tests / prefetch_autotest OK 0.22 s
80/110 DPDK:fast-tests / rawdev_autotest OK 0.22 s
81/110 DPDK:fast-tests / rcu_qsbr_autotest OK 0.32 s
82/110 DPDK:fast-tests / reorder_autotest OK 0.32 s
83/110 DPDK:fast-tests / rib_autotest OK 4.78 s
84/110 DPDK:fast-tests / rib6_autotest OK 4.18 s
85/110 DPDK:fast-tests / ring_autotest OK 0.22 s
86/110 DPDK:fast-tests / rwlock_test1_autotest OK 0.32 s
87/110 DPDK:fast-tests / rwlock_rda_autotest OK 5.18 s
88/110 DPDK:fast-tests / rwlock_rds_wrm_autotest OK 5.17 s
89/110 DPDK:fast-tests / rwlock_rde_wro_autotest OK 5.18 s
90/110 DPDK:fast-tests / sched_autotest OK 0.22 s
91/110 DPDK:fast-tests / security_autotest OK 0.17 s
92/110 DPDK:fast-tests / seqlock_autotest SKIP 0.22 s
93/110 DPDK:fast-tests / service_autotest OK 0.32 s
94/110 DPDK:fast-tests / spinlock_autotest OK 0.22 s
95/110 DPDK:fast-tests / stack_autotest OK 0.22 s
96/110 DPDK:fast-tests / stack_lf_autotest OK 0.27 s
97/110 DPDK:fast-tests / string_autotest OK 0.22 s
98/110 DPDK:fast-tests / table_autotest OK 5.53 s
99/110 DPDK:fast-tests / tailq_autotest OK 0.17 s
100/110 DPDK:fast-tests / telemetry_data_autotest OK 0.22 s
101/110 DPDK:fast-tests / telemetry_json_autotest OK 0.22 s
102/110 DPDK:fast-tests / thash_autotest OK 0.22 s
103/110 DPDK:fast-tests / threads_autotest OK 0.37 s
104/110 DPDK:fast-tests / ticketlock_autotest OK 0.22 s
105/110 DPDK:fast-tests / timer_autotest OK 2.52 s
106/110 DPDK:fast-tests / trace_autotest OK 0.22 s
107/110 DPDK:fast-tests / trace_autotest_with_traces OK 0.22 s
108/110 DPDK:fast-tests / vdev_autotest OK 0.22 s
109/110 DPDK:fast-tests / version_autotest OK 0.22 s
110/110 DPDK:fast-tests / telemetry_all SKIP 0.01 s
Ok: 100
Expected Fail: 0
Fail: 0
Unexpected Pass: 0
Skipped: 10
Timeout: 0
Full log written to /home-local/jenkins-local/jenkins-agent/workspace/Generic-Unit-Test-DPDK/dpdk/build/meson-logs/testlog.txt
ninja: Entering directory `/home-local/jenkins-local/jenkins-agent/workspace/Generic-Unit-Test-DPDK/dpdk/build'
ninja: no work to do.
1/2 DPDK:driver-tests / cryptodev_openssl_autotest FAIL 0.57 s (killed by signal 11 SIGSEGV)
2/2 DPDK:driver-tests / cryptodev_openssl_asym_autotest OK 0.17 s
Ok: 1
Expected Fail: 0
Fail: 1
Unexpected Pass: 0
Skipped: 0
Timeout: 0
Full log written to /home-local/jenkins-local/jenkins-agent/workspace/Generic-Unit-Test-DPDK/dpdk/build/meson-logs/testlog.txt
Test log output from the failed test cryptodev_openssl_autotest:
Sorry, we were not able to find the logs for this test.
Download the log output from the CI site for this test run.
==== End log output ====
Debian 12
Kernel: Depends on container host
Compiler: gcc (Debian 12.2.0-14) 12.2.0
CentOS Stream 9
Kernel: Depends on container host
Compiler: gcc 11.5.0 20240719 (Red Hat 11.5.0-2)
CentOS Stream 10
Kernel: Depends on container host
Compiler: gcc 14.2.1 20241104 (Red Hat 14.2.1-6)
Fedora 40 (Clang)
Kernel: Depends on container host
Compiler: clang 18.1.8 (Fedora 18.1.8-1.fc40)
Fedora 40
Kernel: Depends on container host
Compiler: gcc 14.2.1 20240912 (Red Hat 14.2.1-3)
Fedora 41
Kernel: Depends on container host
Compiler: gcc 14.2.1 20240912 (Red Hat 14.2.1-3)
Fedora 41 (Clang)
Kernel: Depends on container host
Compiler: clang 19.1.5 (Fedora 19.1.5-1.fc41)
Ubuntu 24.04
Kernel: Depends on container host
Compiler: gcc (Ubuntu 13.3.0-6ubuntu2~24.04) 13.3.0
RHEL9
Kernel: Depends on container host
Compiler: gcc 11.5.0 20240719 (Red Hat 11.5.0-2)
RHEL8
Kernel: Depends on container host
Compiler: gcc 8.5.0 20210514 (Red Hat 8.5.0-22)
Ubuntu 22.04
Kernel: Depends on container host
Compiler: gcc (Ubuntu 11.4.0-1ubuntu1~22.04) 11.4.0
Ubuntu 20.04
Kernel: Depends on container host
Compiler: gcc (Ubuntu 9.4.0-1ubuntu1~20.04.2) 9.4.0
Windows Server 2022
Kernel: 10.0.20348.2031
Compiler: clang 15.0.7, gcc 14.1.0 (MinGW), and MSVC VS 19.39.33521
To view detailed results, visit:
https://lab.dpdk.org/results/dashboard/tarballs/33159/
UNH-IOL DPDK Community Lab
To manage your email subscriptions, visit:
https://lab.dpdk.org/results/dashboard/preferences/subscriptions/
^ permalink raw reply [flat|nested] 23+ messages in thread
* |FAILURE| [GIT MASTER] 669ba8067b3c7a1467999e826e396cb97332cbc6
@ 2025-04-05 9:10 dpdklab
0 siblings, 0 replies; 23+ messages in thread
From: dpdklab @ 2025-04-05 9:10 UTC (permalink / raw)
To: Test Report
Cc: dpdk-test-reports, Xueming Li, Christian Ehrhardt, Kevin Traynor,
Luca Boccassi
_Testing issues_
Branch: 23.11-staging
669ba8067b3c7a1467999e826e396cb97332cbc6 --> testing issues
Upstream job id: Generic-Unit-Test-DPDK#328990
Test environment and result as below:
+---------------------+----------------+
| Environment | dpdk_unit_test |
+=====================+================+
| Debian 12 | PEND |
+---------------------+----------------+
| CentOS Stream 9 | FAIL |
+---------------------+----------------+
| CentOS Stream 10 | FAIL |
+---------------------+----------------+
| Fedora 40 (Clang) | FAIL |
+---------------------+----------------+
| Fedora 40 | PEND |
+---------------------+----------------+
| Fedora 41 | PEND |
+---------------------+----------------+
| Fedora 41 (Clang) | PEND |
+---------------------+----------------+
| Ubuntu 24.04 | PEND |
+---------------------+----------------+
| RHEL9 | PEND |
+---------------------+----------------+
| RHEL8 | PEND |
+---------------------+----------------+
| Ubuntu 22.04 | PEND |
+---------------------+----------------+
| Ubuntu 20.04 | PEND |
+---------------------+----------------+
| Windows Server 2022 | PASS |
+---------------------+----------------+
==== Unit test summary for Fedora 40 (Clang) (dpdk_unit_test): ====
ninja: Entering directory `/home-local/jenkins-local/jenkins-agent/workspace/Generic-Unit-Test-DPDK/dpdk/build'
ninja: no work to do.
1/110 DPDK:fast-tests / acl_autotest OK 2.68 s
2/110 DPDK:fast-tests / atomic_autotest OK 0.42 s
3/110 DPDK:fast-tests / bitcount_autotest OK 0.22 s
4/110 DPDK:fast-tests / bitmap_autotest OK 0.22 s
5/110 DPDK:fast-tests / bitops_autotest OK 0.17 s
6/110 DPDK:fast-tests / bitratestats_autotest OK 0.22 s
7/110 DPDK:fast-tests / bpf_autotest OK 0.22 s
8/110 DPDK:fast-tests / bpf_convert_autotest OK 0.22 s
9/110 DPDK:fast-tests / byteorder_autotest OK 0.17 s
10/110 DPDK:fast-tests / cksum_autotest OK 0.17 s
11/110 DPDK:fast-tests / cmdline_autotest OK 0.17 s
12/110 DPDK:fast-tests / common_autotest OK 0.42 s
13/110 DPDK:fast-tests / compressdev_autotest SKIP 0.17 s
14/110 DPDK:fast-tests / cpuflags_autotest OK 0.22 s
15/110 DPDK:fast-tests / crc_autotest OK 0.22 s
16/110 DPDK:fast-tests / user_delay_us OK 0.17 s
17/110 DPDK:fast-tests / debug_autotest OK 0.47 s
18/110 DPDK:fast-tests / devargs_autotest OK 0.17 s
19/110 DPDK:fast-tests / dispatcher_autotest SKIP 0.17 s
20/110 DPDK:fast-tests / distributor_autotest OK 0.87 s
21/110 DPDK:fast-tests / eal_flags_c_opt_autotest OK 0.67 s
22/110 DPDK:fast-tests / eal_flags_main_opt_autotest OK 0.32 s
23/110 DPDK:fast-tests / eal_flags_n_opt_autotest OK 0.47 s
24/110 DPDK:fast-tests / eal_flags_hpet_autotest OK 0.22 s
25/110 DPDK:fast-tests / eal_flags_no_huge_autotest OK 0.47 s
26/110 DPDK:fast-tests / eal_flags_a_opt_autotest OK 0.32 s
27/110 DPDK:fast-tests / eal_flags_b_opt_autotest OK 0.32 s
28/110 DPDK:fast-tests / eal_flags_vdev_opt_autotest OK 0.57 s
29/110 DPDK:fast-tests / eal_flags_r_opt_autotest OK 0.27 s
30/110 DPDK:fast-tests / eal_flags_mem_autotest OK 0.72 s
31/110 DPDK:fast-tests / eal_flags_file_prefix_autotest OK 4.43 s
32/110 DPDK:fast-tests / eal_flags_misc_autotest OK 1.77 s
33/110 DPDK:fast-tests / eal_fs_autotest OK 0.22 s
34/110 DPDK:fast-tests / errno_autotest OK 0.17 s
35/110 DPDK:fast-tests / ethdev_link_status OK 0.17 s
36/110 DPDK:fast-tests / event_eth_tx_adapter_autotest OK 0.47 s
37/110 DPDK:fast-tests / event_ring_autotest OK 0.22 s
38/110 DPDK:fast-tests / eventdev_common_autotest OK 0.22 s
39/110 DPDK:fast-tests / eventdev_selftest_sw OK 0.22 s
40/110 DPDK:fast-tests / fbarray_autotest OK 0.17 s
41/110 DPDK:fast-tests / fib_autotest OK 0.82 s
42/110 DPDK:fast-tests / fib6_autotest OK 0.62 s
43/110 DPDK:fast-tests / func_reentrancy_autotest OK 0.53 s
44/110 DPDK:fast-tests / graph_autotest OK 0.22 s
45/110 DPDK:fast-tests / node_list_dump OK 0.22 s
46/110 DPDK:fast-tests / hash_autotest OK 0.32 s
47/110 DPDK:fast-tests / hash_readwrite_func_autotest SKIP 0.17 s
48/110 DPDK:fast-tests / interrupt_autotest OK 1.22 s
49/110 DPDK:fast-tests / ipfrag_autotest OK 0.17 s
50/110 DPDK:fast-tests / ipsec_autotest SKIP 0.22 s
51/110 DPDK:fast-tests / kvargs_autotest OK 0.22 s
52/110 DPDK:fast-tests / latencystats_autotest OK 0.22 s
53/110 DPDK:fast-tests / lcores_autotest OK 1.27 s
54/110 DPDK:fast-tests / logs_autotest OK 0.22 s
55/110 DPDK:fast-tests / lpm_autotest OK 1.42 s
56/110 DPDK:fast-tests / lpm6_autotest OK 2.62 s
57/110 DPDK:fast-tests / malloc_autotest OK 0.57 s
58/110 DPDK:fast-tests / mbuf_autotest OK 0.22 s
59/110 DPDK:fast-tests / mcslock_autotest OK 0.42 s
60/110 DPDK:fast-tests / member_autotest OK 0.77 s
61/110 DPDK:fast-tests / memcpy_autotest OK 1.47 s
62/110 DPDK:fast-tests / memory_autotest OK 0.17 s
63/110 DPDK:fast-tests / mempool_autotest OK 0.47 s
64/110 DPDK:fast-tests / memzone_autotest OK 0.17 s
65/110 DPDK:fast-tests / meter_autotest OK 0.22 s
66/110 DPDK:fast-tests / metrics_autotest OK 0.22 s
67/110 DPDK:fast-tests / multiprocess_autotest OK 0.27 s
68/110 DPDK:fast-tests / net_ether_autotest OK 0.52 s
69/110 DPDK:fast-tests / pdcp_autotest SKIP 0.17 s
70/110 DPDK:fast-tests / pdump_autotest OK 0.32 s
71/110 DPDK:fast-tests / per_lcore_autotest OK 0.32 s
72/110 DPDK:fast-tests / pflock_autotest OK 0.32 s
73/110 DPDK:fast-tests / pie_autotest OK 0.22 s
74/110 DPDK:fast-tests / ring_pmd_autotest OK 0.22 s
75/110 DPDK:fast-tests / power_autotest OK 0.17 s
76/110 DPDK:fast-tests / power_cpufreq_autotest SKIP 0.17 s
77/110 DPDK:fast-tests / power_intel_uncore_autotest SKIP 0.22 s
78/110 DPDK:fast-tests / power_kvm_vm_autotest SKIP 0.17 s
79/110 DPDK:fast-tests / prefetch_autotest OK 0.22 s
80/110 DPDK:fast-tests / rawdev_autotest OK 0.22 s
81/110 DPDK:fast-tests / rcu_qsbr_autotest OK 0.32 s
82/110 DPDK:fast-tests / reorder_autotest OK 0.32 s
83/110 DPDK:fast-tests / rib_autotest OK 4.78 s
84/110 DPDK:fast-tests / rib6_autotest OK 4.18 s
85/110 DPDK:fast-tests / ring_autotest OK 0.22 s
86/110 DPDK:fast-tests / rwlock_test1_autotest OK 0.32 s
87/110 DPDK:fast-tests / rwlock_rda_autotest OK 5.18 s
88/110 DPDK:fast-tests / rwlock_rds_wrm_autotest OK 5.17 s
89/110 DPDK:fast-tests / rwlock_rde_wro_autotest OK 5.18 s
90/110 DPDK:fast-tests / sched_autotest OK 0.22 s
91/110 DPDK:fast-tests / security_autotest OK 0.17 s
92/110 DPDK:fast-tests / seqlock_autotest SKIP 0.22 s
93/110 DPDK:fast-tests / service_autotest OK 0.32 s
94/110 DPDK:fast-tests / spinlock_autotest OK 0.22 s
95/110 DPDK:fast-tests / stack_autotest OK 0.22 s
96/110 DPDK:fast-tests / stack_lf_autotest OK 0.27 s
97/110 DPDK:fast-tests / string_autotest OK 0.22 s
98/110 DPDK:fast-tests / table_autotest OK 5.53 s
99/110 DPDK:fast-tests / tailq_autotest OK 0.17 s
100/110 DPDK:fast-tests / telemetry_data_autotest OK 0.22 s
101/110 DPDK:fast-tests / telemetry_json_autotest OK 0.22 s
102/110 DPDK:fast-tests / thash_autotest OK 0.22 s
103/110 DPDK:fast-tests / threads_autotest OK 0.37 s
104/110 DPDK:fast-tests / ticketlock_autotest OK 0.22 s
105/110 DPDK:fast-tests / timer_autotest OK 2.52 s
106/110 DPDK:fast-tests / trace_autotest OK 0.22 s
107/110 DPDK:fast-tests / trace_autotest_with_traces OK 0.22 s
108/110 DPDK:fast-tests / vdev_autotest OK 0.22 s
109/110 DPDK:fast-tests / version_autotest OK 0.22 s
110/110 DPDK:fast-tests / telemetry_all SKIP 0.01 s
Ok: 100
Expected Fail: 0
Fail: 0
Unexpected Pass: 0
Skipped: 10
Timeout: 0
Full log written to /home-local/jenkins-local/jenkins-agent/workspace/Generic-Unit-Test-DPDK/dpdk/build/meson-logs/testlog.txt
ninja: Entering directory `/home-local/jenkins-local/jenkins-agent/workspace/Generic-Unit-Test-DPDK/dpdk/build'
ninja: no work to do.
1/2 DPDK:driver-tests / cryptodev_openssl_autotest FAIL 0.57 s (killed by signal 11 SIGSEGV)
2/2 DPDK:driver-tests / cryptodev_openssl_asym_autotest OK 0.17 s
Ok: 1
Expected Fail: 0
Fail: 1
Unexpected Pass: 0
Skipped: 0
Timeout: 0
Full log written to /home-local/jenkins-local/jenkins-agent/workspace/Generic-Unit-Test-DPDK/dpdk/build/meson-logs/testlog.txt
Test log output from the failed test cryptodev_openssl_autotest:
Sorry, we were not able to find the logs for this test.
Download the log output from the CI site for this test run.
==== End log output ====
Debian 12
Kernel: Depends on container host
Compiler: gcc (Debian 12.2.0-14) 12.2.0
CentOS Stream 9
Kernel: Depends on container host
Compiler: gcc 11.5.0 20240719 (Red Hat 11.5.0-2)
CentOS Stream 10
Kernel: Depends on container host
Compiler: gcc 14.2.1 20241104 (Red Hat 14.2.1-6)
Fedora 40 (Clang)
Kernel: Depends on container host
Compiler: clang 18.1.8 (Fedora 18.1.8-1.fc40)
Fedora 40
Kernel: Depends on container host
Compiler: gcc 14.2.1 20240912 (Red Hat 14.2.1-3)
Fedora 41
Kernel: Depends on container host
Compiler: gcc 14.2.1 20240912 (Red Hat 14.2.1-3)
Fedora 41 (Clang)
Kernel: Depends on container host
Compiler: clang 19.1.5 (Fedora 19.1.5-1.fc41)
Ubuntu 24.04
Kernel: Depends on container host
Compiler: gcc (Ubuntu 13.3.0-6ubuntu2~24.04) 13.3.0
RHEL9
Kernel: Depends on container host
Compiler: gcc 11.5.0 20240719 (Red Hat 11.5.0-2)
RHEL8
Kernel: Depends on container host
Compiler: gcc 8.5.0 20210514 (Red Hat 8.5.0-22)
Ubuntu 22.04
Kernel: Depends on container host
Compiler: gcc (Ubuntu 11.4.0-1ubuntu1~22.04) 11.4.0
Ubuntu 20.04
Kernel: Depends on container host
Compiler: gcc (Ubuntu 9.4.0-1ubuntu1~20.04.2) 9.4.0
Windows Server 2022
Kernel: 10.0.20348.2031
Compiler: clang 15.0.7, gcc 14.1.0 (MinGW), and MSVC VS 19.39.33521
To view detailed results, visit:
https://lab.dpdk.org/results/dashboard/tarballs/33159/
UNH-IOL DPDK Community Lab
To manage your email subscriptions, visit:
https://lab.dpdk.org/results/dashboard/preferences/subscriptions/
^ permalink raw reply [flat|nested] 23+ messages in thread
* |FAILURE| [GIT MASTER] 669ba8067b3c7a1467999e826e396cb97332cbc6
@ 2025-04-05 9:09 dpdklab
0 siblings, 0 replies; 23+ messages in thread
From: dpdklab @ 2025-04-05 9:09 UTC (permalink / raw)
To: Test Report
Cc: dpdk-test-reports, Xueming Li, Christian Ehrhardt, Kevin Traynor,
Luca Boccassi
_Testing issues_
Branch: 23.11-staging
669ba8067b3c7a1467999e826e396cb97332cbc6 --> testing issues
Upstream job id: Generic-Unit-Test-DPDK#328992
Test environment and result as below:
+---------------------+----------------+
| Environment | dpdk_unit_test |
+=====================+================+
| Debian 12 | PEND |
+---------------------+----------------+
| CentOS Stream 9 | PEND |
+---------------------+----------------+
| CentOS Stream 10 | FAIL |
+---------------------+----------------+
| Fedora 40 (Clang) | FAIL |
+---------------------+----------------+
| Fedora 40 | PEND |
+---------------------+----------------+
| Fedora 41 | PEND |
+---------------------+----------------+
| Fedora 41 (Clang) | PEND |
+---------------------+----------------+
| Ubuntu 24.04 | PEND |
+---------------------+----------------+
| RHEL9 | PEND |
+---------------------+----------------+
| RHEL8 | PEND |
+---------------------+----------------+
| Ubuntu 22.04 | PEND |
+---------------------+----------------+
| Ubuntu 20.04 | PEND |
+---------------------+----------------+
| Windows Server 2022 | PASS |
+---------------------+----------------+
==== Unit test summary for Fedora 40 (Clang) (dpdk_unit_test): ====
ninja: Entering directory `/home-local/jenkins-local/jenkins-agent/workspace/Generic-Unit-Test-DPDK/dpdk/build'
ninja: no work to do.
1/110 DPDK:fast-tests / acl_autotest OK 2.68 s
2/110 DPDK:fast-tests / atomic_autotest OK 0.42 s
3/110 DPDK:fast-tests / bitcount_autotest OK 0.22 s
4/110 DPDK:fast-tests / bitmap_autotest OK 0.22 s
5/110 DPDK:fast-tests / bitops_autotest OK 0.17 s
6/110 DPDK:fast-tests / bitratestats_autotest OK 0.22 s
7/110 DPDK:fast-tests / bpf_autotest OK 0.22 s
8/110 DPDK:fast-tests / bpf_convert_autotest OK 0.22 s
9/110 DPDK:fast-tests / byteorder_autotest OK 0.17 s
10/110 DPDK:fast-tests / cksum_autotest OK 0.17 s
11/110 DPDK:fast-tests / cmdline_autotest OK 0.17 s
12/110 DPDK:fast-tests / common_autotest OK 0.42 s
13/110 DPDK:fast-tests / compressdev_autotest SKIP 0.17 s
14/110 DPDK:fast-tests / cpuflags_autotest OK 0.22 s
15/110 DPDK:fast-tests / crc_autotest OK 0.22 s
16/110 DPDK:fast-tests / user_delay_us OK 0.17 s
17/110 DPDK:fast-tests / debug_autotest OK 0.47 s
18/110 DPDK:fast-tests / devargs_autotest OK 0.17 s
19/110 DPDK:fast-tests / dispatcher_autotest SKIP 0.17 s
20/110 DPDK:fast-tests / distributor_autotest OK 0.87 s
21/110 DPDK:fast-tests / eal_flags_c_opt_autotest OK 0.67 s
22/110 DPDK:fast-tests / eal_flags_main_opt_autotest OK 0.32 s
23/110 DPDK:fast-tests / eal_flags_n_opt_autotest OK 0.47 s
24/110 DPDK:fast-tests / eal_flags_hpet_autotest OK 0.22 s
25/110 DPDK:fast-tests / eal_flags_no_huge_autotest OK 0.47 s
26/110 DPDK:fast-tests / eal_flags_a_opt_autotest OK 0.32 s
27/110 DPDK:fast-tests / eal_flags_b_opt_autotest OK 0.32 s
28/110 DPDK:fast-tests / eal_flags_vdev_opt_autotest OK 0.57 s
29/110 DPDK:fast-tests / eal_flags_r_opt_autotest OK 0.27 s
30/110 DPDK:fast-tests / eal_flags_mem_autotest OK 0.72 s
31/110 DPDK:fast-tests / eal_flags_file_prefix_autotest OK 4.43 s
32/110 DPDK:fast-tests / eal_flags_misc_autotest OK 1.77 s
33/110 DPDK:fast-tests / eal_fs_autotest OK 0.22 s
34/110 DPDK:fast-tests / errno_autotest OK 0.17 s
35/110 DPDK:fast-tests / ethdev_link_status OK 0.17 s
36/110 DPDK:fast-tests / event_eth_tx_adapter_autotest OK 0.47 s
37/110 DPDK:fast-tests / event_ring_autotest OK 0.22 s
38/110 DPDK:fast-tests / eventdev_common_autotest OK 0.22 s
39/110 DPDK:fast-tests / eventdev_selftest_sw OK 0.22 s
40/110 DPDK:fast-tests / fbarray_autotest OK 0.17 s
41/110 DPDK:fast-tests / fib_autotest OK 0.82 s
42/110 DPDK:fast-tests / fib6_autotest OK 0.62 s
43/110 DPDK:fast-tests / func_reentrancy_autotest OK 0.53 s
44/110 DPDK:fast-tests / graph_autotest OK 0.22 s
45/110 DPDK:fast-tests / node_list_dump OK 0.22 s
46/110 DPDK:fast-tests / hash_autotest OK 0.32 s
47/110 DPDK:fast-tests / hash_readwrite_func_autotest SKIP 0.17 s
48/110 DPDK:fast-tests / interrupt_autotest OK 1.22 s
49/110 DPDK:fast-tests / ipfrag_autotest OK 0.17 s
50/110 DPDK:fast-tests / ipsec_autotest SKIP 0.22 s
51/110 DPDK:fast-tests / kvargs_autotest OK 0.22 s
52/110 DPDK:fast-tests / latencystats_autotest OK 0.22 s
53/110 DPDK:fast-tests / lcores_autotest OK 1.27 s
54/110 DPDK:fast-tests / logs_autotest OK 0.22 s
55/110 DPDK:fast-tests / lpm_autotest OK 1.42 s
56/110 DPDK:fast-tests / lpm6_autotest OK 2.62 s
57/110 DPDK:fast-tests / malloc_autotest OK 0.57 s
58/110 DPDK:fast-tests / mbuf_autotest OK 0.22 s
59/110 DPDK:fast-tests / mcslock_autotest OK 0.42 s
60/110 DPDK:fast-tests / member_autotest OK 0.77 s
61/110 DPDK:fast-tests / memcpy_autotest OK 1.47 s
62/110 DPDK:fast-tests / memory_autotest OK 0.17 s
63/110 DPDK:fast-tests / mempool_autotest OK 0.47 s
64/110 DPDK:fast-tests / memzone_autotest OK 0.17 s
65/110 DPDK:fast-tests / meter_autotest OK 0.22 s
66/110 DPDK:fast-tests / metrics_autotest OK 0.22 s
67/110 DPDK:fast-tests / multiprocess_autotest OK 0.27 s
68/110 DPDK:fast-tests / net_ether_autotest OK 0.52 s
69/110 DPDK:fast-tests / pdcp_autotest SKIP 0.17 s
70/110 DPDK:fast-tests / pdump_autotest OK 0.32 s
71/110 DPDK:fast-tests / per_lcore_autotest OK 0.32 s
72/110 DPDK:fast-tests / pflock_autotest OK 0.32 s
73/110 DPDK:fast-tests / pie_autotest OK 0.22 s
74/110 DPDK:fast-tests / ring_pmd_autotest OK 0.22 s
75/110 DPDK:fast-tests / power_autotest OK 0.17 s
76/110 DPDK:fast-tests / power_cpufreq_autotest SKIP 0.17 s
77/110 DPDK:fast-tests / power_intel_uncore_autotest SKIP 0.22 s
78/110 DPDK:fast-tests / power_kvm_vm_autotest SKIP 0.17 s
79/110 DPDK:fast-tests / prefetch_autotest OK 0.22 s
80/110 DPDK:fast-tests / rawdev_autotest OK 0.22 s
81/110 DPDK:fast-tests / rcu_qsbr_autotest OK 0.32 s
82/110 DPDK:fast-tests / reorder_autotest OK 0.32 s
83/110 DPDK:fast-tests / rib_autotest OK 4.78 s
84/110 DPDK:fast-tests / rib6_autotest OK 4.18 s
85/110 DPDK:fast-tests / ring_autotest OK 0.22 s
86/110 DPDK:fast-tests / rwlock_test1_autotest OK 0.32 s
87/110 DPDK:fast-tests / rwlock_rda_autotest OK 5.18 s
88/110 DPDK:fast-tests / rwlock_rds_wrm_autotest OK 5.17 s
89/110 DPDK:fast-tests / rwlock_rde_wro_autotest OK 5.18 s
90/110 DPDK:fast-tests / sched_autotest OK 0.22 s
91/110 DPDK:fast-tests / security_autotest OK 0.17 s
92/110 DPDK:fast-tests / seqlock_autotest SKIP 0.22 s
93/110 DPDK:fast-tests / service_autotest OK 0.32 s
94/110 DPDK:fast-tests / spinlock_autotest OK 0.22 s
95/110 DPDK:fast-tests / stack_autotest OK 0.22 s
96/110 DPDK:fast-tests / stack_lf_autotest OK 0.27 s
97/110 DPDK:fast-tests / string_autotest OK 0.22 s
98/110 DPDK:fast-tests / table_autotest OK 5.53 s
99/110 DPDK:fast-tests / tailq_autotest OK 0.17 s
100/110 DPDK:fast-tests / telemetry_data_autotest OK 0.22 s
101/110 DPDK:fast-tests / telemetry_json_autotest OK 0.22 s
102/110 DPDK:fast-tests / thash_autotest OK 0.22 s
103/110 DPDK:fast-tests / threads_autotest OK 0.37 s
104/110 DPDK:fast-tests / ticketlock_autotest OK 0.22 s
105/110 DPDK:fast-tests / timer_autotest OK 2.52 s
106/110 DPDK:fast-tests / trace_autotest OK 0.22 s
107/110 DPDK:fast-tests / trace_autotest_with_traces OK 0.22 s
108/110 DPDK:fast-tests / vdev_autotest OK 0.22 s
109/110 DPDK:fast-tests / version_autotest OK 0.22 s
110/110 DPDK:fast-tests / telemetry_all SKIP 0.01 s
Ok: 100
Expected Fail: 0
Fail: 0
Unexpected Pass: 0
Skipped: 10
Timeout: 0
Full log written to /home-local/jenkins-local/jenkins-agent/workspace/Generic-Unit-Test-DPDK/dpdk/build/meson-logs/testlog.txt
ninja: Entering directory `/home-local/jenkins-local/jenkins-agent/workspace/Generic-Unit-Test-DPDK/dpdk/build'
ninja: no work to do.
1/2 DPDK:driver-tests / cryptodev_openssl_autotest FAIL 0.57 s (killed by signal 11 SIGSEGV)
2/2 DPDK:driver-tests / cryptodev_openssl_asym_autotest OK 0.17 s
Ok: 1
Expected Fail: 0
Fail: 1
Unexpected Pass: 0
Skipped: 0
Timeout: 0
Full log written to /home-local/jenkins-local/jenkins-agent/workspace/Generic-Unit-Test-DPDK/dpdk/build/meson-logs/testlog.txt
Test log output from the failed test cryptodev_openssl_autotest:
Sorry, we were not able to find the logs for this test.
Download the log output from the CI site for this test run.
==== End log output ====
Debian 12
Kernel: Depends on container host
Compiler: gcc (Debian 12.2.0-14) 12.2.0
CentOS Stream 9
Kernel: Depends on container host
Compiler: gcc 11.5.0 20240719 (Red Hat 11.5.0-2)
CentOS Stream 10
Kernel: Depends on container host
Compiler: gcc 14.2.1 20241104 (Red Hat 14.2.1-6)
Fedora 40 (Clang)
Kernel: Depends on container host
Compiler: clang 18.1.8 (Fedora 18.1.8-1.fc40)
Fedora 40
Kernel: Depends on container host
Compiler: gcc 14.2.1 20240912 (Red Hat 14.2.1-3)
Fedora 41
Kernel: Depends on container host
Compiler: gcc 14.2.1 20240912 (Red Hat 14.2.1-3)
Fedora 41 (Clang)
Kernel: Depends on container host
Compiler: clang 19.1.5 (Fedora 19.1.5-1.fc41)
Ubuntu 24.04
Kernel: Depends on container host
Compiler: gcc (Ubuntu 13.3.0-6ubuntu2~24.04) 13.3.0
RHEL9
Kernel: Depends on container host
Compiler: gcc 11.5.0 20240719 (Red Hat 11.5.0-2)
RHEL8
Kernel: Depends on container host
Compiler: gcc 8.5.0 20210514 (Red Hat 8.5.0-22)
Ubuntu 22.04
Kernel: Depends on container host
Compiler: gcc (Ubuntu 11.4.0-1ubuntu1~22.04) 11.4.0
Ubuntu 20.04
Kernel: Depends on container host
Compiler: gcc (Ubuntu 9.4.0-1ubuntu1~20.04.2) 9.4.0
Windows Server 2022
Kernel: 10.0.20348.2031
Compiler: clang 15.0.7, gcc 14.1.0 (MinGW), and MSVC VS 19.39.33521
To view detailed results, visit:
https://lab.dpdk.org/results/dashboard/tarballs/33159/
UNH-IOL DPDK Community Lab
To manage your email subscriptions, visit:
https://lab.dpdk.org/results/dashboard/preferences/subscriptions/
^ permalink raw reply [flat|nested] 23+ messages in thread
* |FAILURE| [GIT MASTER] 669ba8067b3c7a1467999e826e396cb97332cbc6
@ 2025-04-05 9:04 dpdklab
0 siblings, 0 replies; 23+ messages in thread
From: dpdklab @ 2025-04-05 9:04 UTC (permalink / raw)
To: Test Report
Cc: dpdk-test-reports, Xueming Li, Christian Ehrhardt, Kevin Traynor,
Luca Boccassi
_Testing issues_
Branch: 23.11-staging
669ba8067b3c7a1467999e826e396cb97332cbc6 --> testing issues
Upstream job id: Generic-Unit-Test-DPDK#328998
Test environment and result as below:
+---------------------+----------------+
| Environment | dpdk_unit_test |
+=====================+================+
| Debian 12 | PEND |
+---------------------+----------------+
| CentOS Stream 9 | PEND |
+---------------------+----------------+
| CentOS Stream 10 | PEND |
+---------------------+----------------+
| Fedora 40 (Clang) | FAIL |
+---------------------+----------------+
| Fedora 40 | PEND |
+---------------------+----------------+
| Fedora 41 | PEND |
+---------------------+----------------+
| Fedora 41 (Clang) | PEND |
+---------------------+----------------+
| Ubuntu 24.04 | PEND |
+---------------------+----------------+
| RHEL9 | PEND |
+---------------------+----------------+
| RHEL8 | PEND |
+---------------------+----------------+
| Ubuntu 22.04 | PEND |
+---------------------+----------------+
| Ubuntu 20.04 | PEND |
+---------------------+----------------+
| Windows Server 2022 | PEND |
+---------------------+----------------+
==== Unit test summary for Fedora 40 (Clang) (dpdk_unit_test): ====
ninja: Entering directory `/home-local/jenkins-local/jenkins-agent/workspace/Generic-Unit-Test-DPDK/dpdk/build'
ninja: no work to do.
1/110 DPDK:fast-tests / acl_autotest OK 2.68 s
2/110 DPDK:fast-tests / atomic_autotest OK 0.42 s
3/110 DPDK:fast-tests / bitcount_autotest OK 0.22 s
4/110 DPDK:fast-tests / bitmap_autotest OK 0.22 s
5/110 DPDK:fast-tests / bitops_autotest OK 0.17 s
6/110 DPDK:fast-tests / bitratestats_autotest OK 0.22 s
7/110 DPDK:fast-tests / bpf_autotest OK 0.22 s
8/110 DPDK:fast-tests / bpf_convert_autotest OK 0.22 s
9/110 DPDK:fast-tests / byteorder_autotest OK 0.17 s
10/110 DPDK:fast-tests / cksum_autotest OK 0.17 s
11/110 DPDK:fast-tests / cmdline_autotest OK 0.17 s
12/110 DPDK:fast-tests / common_autotest OK 0.42 s
13/110 DPDK:fast-tests / compressdev_autotest SKIP 0.17 s
14/110 DPDK:fast-tests / cpuflags_autotest OK 0.22 s
15/110 DPDK:fast-tests / crc_autotest OK 0.22 s
16/110 DPDK:fast-tests / user_delay_us OK 0.17 s
17/110 DPDK:fast-tests / debug_autotest OK 0.47 s
18/110 DPDK:fast-tests / devargs_autotest OK 0.17 s
19/110 DPDK:fast-tests / dispatcher_autotest SKIP 0.17 s
20/110 DPDK:fast-tests / distributor_autotest OK 0.87 s
21/110 DPDK:fast-tests / eal_flags_c_opt_autotest OK 0.67 s
22/110 DPDK:fast-tests / eal_flags_main_opt_autotest OK 0.32 s
23/110 DPDK:fast-tests / eal_flags_n_opt_autotest OK 0.47 s
24/110 DPDK:fast-tests / eal_flags_hpet_autotest OK 0.22 s
25/110 DPDK:fast-tests / eal_flags_no_huge_autotest OK 0.47 s
26/110 DPDK:fast-tests / eal_flags_a_opt_autotest OK 0.32 s
27/110 DPDK:fast-tests / eal_flags_b_opt_autotest OK 0.32 s
28/110 DPDK:fast-tests / eal_flags_vdev_opt_autotest OK 0.57 s
29/110 DPDK:fast-tests / eal_flags_r_opt_autotest OK 0.27 s
30/110 DPDK:fast-tests / eal_flags_mem_autotest OK 0.72 s
31/110 DPDK:fast-tests / eal_flags_file_prefix_autotest OK 4.43 s
32/110 DPDK:fast-tests / eal_flags_misc_autotest OK 1.77 s
33/110 DPDK:fast-tests / eal_fs_autotest OK 0.22 s
34/110 DPDK:fast-tests / errno_autotest OK 0.17 s
35/110 DPDK:fast-tests / ethdev_link_status OK 0.17 s
36/110 DPDK:fast-tests / event_eth_tx_adapter_autotest OK 0.47 s
37/110 DPDK:fast-tests / event_ring_autotest OK 0.22 s
38/110 DPDK:fast-tests / eventdev_common_autotest OK 0.22 s
39/110 DPDK:fast-tests / eventdev_selftest_sw OK 0.22 s
40/110 DPDK:fast-tests / fbarray_autotest OK 0.17 s
41/110 DPDK:fast-tests / fib_autotest OK 0.82 s
42/110 DPDK:fast-tests / fib6_autotest OK 0.62 s
43/110 DPDK:fast-tests / func_reentrancy_autotest OK 0.53 s
44/110 DPDK:fast-tests / graph_autotest OK 0.22 s
45/110 DPDK:fast-tests / node_list_dump OK 0.22 s
46/110 DPDK:fast-tests / hash_autotest OK 0.32 s
47/110 DPDK:fast-tests / hash_readwrite_func_autotest SKIP 0.17 s
48/110 DPDK:fast-tests / interrupt_autotest OK 1.22 s
49/110 DPDK:fast-tests / ipfrag_autotest OK 0.17 s
50/110 DPDK:fast-tests / ipsec_autotest SKIP 0.22 s
51/110 DPDK:fast-tests / kvargs_autotest OK 0.22 s
52/110 DPDK:fast-tests / latencystats_autotest OK 0.22 s
53/110 DPDK:fast-tests / lcores_autotest OK 1.27 s
54/110 DPDK:fast-tests / logs_autotest OK 0.22 s
55/110 DPDK:fast-tests / lpm_autotest OK 1.42 s
56/110 DPDK:fast-tests / lpm6_autotest OK 2.62 s
57/110 DPDK:fast-tests / malloc_autotest OK 0.57 s
58/110 DPDK:fast-tests / mbuf_autotest OK 0.22 s
59/110 DPDK:fast-tests / mcslock_autotest OK 0.42 s
60/110 DPDK:fast-tests / member_autotest OK 0.77 s
61/110 DPDK:fast-tests / memcpy_autotest OK 1.47 s
62/110 DPDK:fast-tests / memory_autotest OK 0.17 s
63/110 DPDK:fast-tests / mempool_autotest OK 0.47 s
64/110 DPDK:fast-tests / memzone_autotest OK 0.17 s
65/110 DPDK:fast-tests / meter_autotest OK 0.22 s
66/110 DPDK:fast-tests / metrics_autotest OK 0.22 s
67/110 DPDK:fast-tests / multiprocess_autotest OK 0.27 s
68/110 DPDK:fast-tests / net_ether_autotest OK 0.52 s
69/110 DPDK:fast-tests / pdcp_autotest SKIP 0.17 s
70/110 DPDK:fast-tests / pdump_autotest OK 0.32 s
71/110 DPDK:fast-tests / per_lcore_autotest OK 0.32 s
72/110 DPDK:fast-tests / pflock_autotest OK 0.32 s
73/110 DPDK:fast-tests / pie_autotest OK 0.22 s
74/110 DPDK:fast-tests / ring_pmd_autotest OK 0.22 s
75/110 DPDK:fast-tests / power_autotest OK 0.17 s
76/110 DPDK:fast-tests / power_cpufreq_autotest SKIP 0.17 s
77/110 DPDK:fast-tests / power_intel_uncore_autotest SKIP 0.22 s
78/110 DPDK:fast-tests / power_kvm_vm_autotest SKIP 0.17 s
79/110 DPDK:fast-tests / prefetch_autotest OK 0.22 s
80/110 DPDK:fast-tests / rawdev_autotest OK 0.22 s
81/110 DPDK:fast-tests / rcu_qsbr_autotest OK 0.32 s
82/110 DPDK:fast-tests / reorder_autotest OK 0.32 s
83/110 DPDK:fast-tests / rib_autotest OK 4.78 s
84/110 DPDK:fast-tests / rib6_autotest OK 4.18 s
85/110 DPDK:fast-tests / ring_autotest OK 0.22 s
86/110 DPDK:fast-tests / rwlock_test1_autotest OK 0.32 s
87/110 DPDK:fast-tests / rwlock_rda_autotest OK 5.18 s
88/110 DPDK:fast-tests / rwlock_rds_wrm_autotest OK 5.17 s
89/110 DPDK:fast-tests / rwlock_rde_wro_autotest OK 5.18 s
90/110 DPDK:fast-tests / sched_autotest OK 0.22 s
91/110 DPDK:fast-tests / security_autotest OK 0.17 s
92/110 DPDK:fast-tests / seqlock_autotest SKIP 0.22 s
93/110 DPDK:fast-tests / service_autotest OK 0.32 s
94/110 DPDK:fast-tests / spinlock_autotest OK 0.22 s
95/110 DPDK:fast-tests / stack_autotest OK 0.22 s
96/110 DPDK:fast-tests / stack_lf_autotest OK 0.27 s
97/110 DPDK:fast-tests / string_autotest OK 0.22 s
98/110 DPDK:fast-tests / table_autotest OK 5.53 s
99/110 DPDK:fast-tests / tailq_autotest OK 0.17 s
100/110 DPDK:fast-tests / telemetry_data_autotest OK 0.22 s
101/110 DPDK:fast-tests / telemetry_json_autotest OK 0.22 s
102/110 DPDK:fast-tests / thash_autotest OK 0.22 s
103/110 DPDK:fast-tests / threads_autotest OK 0.37 s
104/110 DPDK:fast-tests / ticketlock_autotest OK 0.22 s
105/110 DPDK:fast-tests / timer_autotest OK 2.52 s
106/110 DPDK:fast-tests / trace_autotest OK 0.22 s
107/110 DPDK:fast-tests / trace_autotest_with_traces OK 0.22 s
108/110 DPDK:fast-tests / vdev_autotest OK 0.22 s
109/110 DPDK:fast-tests / version_autotest OK 0.22 s
110/110 DPDK:fast-tests / telemetry_all SKIP 0.01 s
Ok: 100
Expected Fail: 0
Fail: 0
Unexpected Pass: 0
Skipped: 10
Timeout: 0
Full log written to /home-local/jenkins-local/jenkins-agent/workspace/Generic-Unit-Test-DPDK/dpdk/build/meson-logs/testlog.txt
ninja: Entering directory `/home-local/jenkins-local/jenkins-agent/workspace/Generic-Unit-Test-DPDK/dpdk/build'
ninja: no work to do.
1/2 DPDK:driver-tests / cryptodev_openssl_autotest FAIL 0.57 s (killed by signal 11 SIGSEGV)
2/2 DPDK:driver-tests / cryptodev_openssl_asym_autotest OK 0.17 s
Ok: 1
Expected Fail: 0
Fail: 1
Unexpected Pass: 0
Skipped: 0
Timeout: 0
Full log written to /home-local/jenkins-local/jenkins-agent/workspace/Generic-Unit-Test-DPDK/dpdk/build/meson-logs/testlog.txt
Test log output from the failed test cryptodev_openssl_autotest:
Sorry, we were not able to find the logs for this test.
Download the log output from the CI site for this test run.
==== End log output ====
Debian 12
Kernel: Depends on container host
Compiler: gcc (Debian 12.2.0-14) 12.2.0
CentOS Stream 9
Kernel: Depends on container host
Compiler: gcc 11.5.0 20240719 (Red Hat 11.5.0-2)
CentOS Stream 10
Kernel: Depends on container host
Compiler: gcc 14.2.1 20241104 (Red Hat 14.2.1-6)
Fedora 40 (Clang)
Kernel: Depends on container host
Compiler: clang 18.1.8 (Fedora 18.1.8-1.fc40)
Fedora 40
Kernel: Depends on container host
Compiler: gcc 14.2.1 20240912 (Red Hat 14.2.1-3)
Fedora 41
Kernel: Depends on container host
Compiler: gcc 14.2.1 20240912 (Red Hat 14.2.1-3)
Fedora 41 (Clang)
Kernel: Depends on container host
Compiler: clang 19.1.5 (Fedora 19.1.5-1.fc41)
Ubuntu 24.04
Kernel: Depends on container host
Compiler: gcc (Ubuntu 13.3.0-6ubuntu2~24.04) 13.3.0
RHEL9
Kernel: Depends on container host
Compiler: gcc 11.5.0 20240719 (Red Hat 11.5.0-2)
RHEL8
Kernel: Depends on container host
Compiler: gcc 8.5.0 20210514 (Red Hat 8.5.0-22)
Ubuntu 22.04
Kernel: Depends on container host
Compiler: gcc (Ubuntu 11.4.0-1ubuntu1~22.04) 11.4.0
Ubuntu 20.04
Kernel: Depends on container host
Compiler: gcc (Ubuntu 9.4.0-1ubuntu1~20.04.2) 9.4.0
Windows Server 2022
Kernel: 10.0.20348.2031
Compiler: clang 15.0.7, gcc 14.1.0 (MinGW), and MSVC VS 19.39.33521
To view detailed results, visit:
https://lab.dpdk.org/results/dashboard/tarballs/33159/
UNH-IOL DPDK Community Lab
To manage your email subscriptions, visit:
https://lab.dpdk.org/results/dashboard/preferences/subscriptions/
^ permalink raw reply [flat|nested] 23+ messages in thread
end of thread, other threads:[~2025-04-05 10:18 UTC | newest]
Thread overview: 23+ messages (download: mbox.gz / follow: Atom feed)
-- links below jump to the message on this page --
2025-04-05 9:07 |FAILURE| [GIT MASTER] 669ba8067b3c7a1467999e826e396cb97332cbc6 dpdklab
-- strict thread matches above, loose matches on Subject: below --
2025-04-05 10:18 dpdklab
2025-04-05 9:51 dpdklab
2025-04-05 9:49 dpdklab
2025-04-05 9:45 dpdklab
2025-04-05 9:42 dpdklab
2025-04-05 9:42 dpdklab
2025-04-05 9:40 dpdklab
2025-04-05 9:35 dpdklab
2025-04-05 9:35 dpdklab
2025-04-05 9:35 dpdklab
2025-04-05 9:31 dpdklab
2025-04-05 9:23 dpdklab
2025-04-05 9:22 dpdklab
2025-04-05 9:21 dpdklab
2025-04-05 9:20 dpdklab
2025-04-05 9:20 dpdklab
2025-04-05 9:19 dpdklab
2025-04-05 9:13 dpdklab
2025-04-05 9:12 dpdklab
2025-04-05 9:10 dpdklab
2025-04-05 9:09 dpdklab
2025-04-05 9:04 dpdklab
This is a public inbox, see mirroring instructions
for how to clone and mirror all data and code used for this inbox;
as well as URLs for NNTP newsgroup(s).