automatic DPDK test reports
 help / color / mirror / Atom feed
* [dpdk-test-report] |FAILURE| pw(101384) sid(19604) job(PER_PATCH_BUILD8713)net/bnxt: remove debug macro breaking build
@ 2021-10-14  4:24 sys_stv
  0 siblings, 0 replies; only message in thread
From: sys_stv @ 2021-10-14  4:24 UTC (permalink / raw)
  To: test-report, ferruh.yigit

[-- Attachment #1: Type: text/plain, Size: 6284 bytes --]


Test-Label: Intel-compilation
Test-Status: FAILURE
http://dpdk.org/patch/101384

_Compilation issues_

Submitter: Ferruh Yigit <ferruh.yigit@intel.com>
Date: 2021-10-13 16:31:01
Reply_mail: 20211013163101.2811453-1-ferruh.yigit@intel.com

DPDK git baseline: Repo:dpdk-next-net-brcm, CommitID: 8453f2f94bad018f1277d931c1fd6006db9744a4


Meson Build Summary: 20 Builds Done, 19 Successful, 1 Failures, 0 Blocked

+--------------+------------+--------------+------------+------------+-----------+----------+
| os           | gcc-static | clang-static | icc-static | gcc-shared | gcc-debug | document |
+--------------+------------+--------------+------------+------------+-----------+----------+
| UB2004-64    | pass       | pass         | fail       |            |           | pass     |
| FC34-64      | pass       | pass         |            |            |           |          |
| UB2104-64    | pass       |              |            |            |           |          |
| WIN10-64     |            | pass         |            |            |           |          |
| UB2004-32    | pass       |              |            |            |           |          |
| FreeBSD13-64 | pass       | pass         |            | pass       | pass      |          |
| SUSE15-64    | pass       | pass         |            |            |           |          |
| RHEL84-64    | pass       | pass         | pass       | pass       | pass      |          |
+--------------+------------+--------------+------------+------------+-----------+----------+
Test environment and configuration as below:


OS: UB2004-64
	Kernel Version: 5.8.0-48-generic
	GCC Version: gcc (Ubuntu 10.3.0-1ubuntu1~20.04) 10.3.0
	Clang Version: 10.0.0-4ubuntu1
	x86_64-native-linuxapp-clang
	x86_64-native-linuxapp-gcc
	x86_64-native-linuxapp-icc
	x86_64-native-linuxapp-doc

OS: FC34-64
	Kernel Version: 5.11.15-300.fc34.x86_64
	GCC Version: gcc (GCC) 11.0.1 20210324 (Red Hat 11.0.1-0)
	Clang Version: 12.0.0 (Fedora 12.0.0-0.3.rc1.fc34)
	x86_64-native-linuxapp-gcc
	x86_64-native-linuxapp-clang

OS: UB2104-64
	Kernel Version: 5.11.0-16-generic
	GCC Version: gcc (Ubuntu 10.3.0-1ubuntu1) 10.3.0
	Clang Version: 12.0.0-1ubuntu1
	x86_64-native-linuxapp-gcc

OS: WIN10-64
	Kernel Version: N/A
	GCC Version: N/A
	Clang Version: Clang 8.0.0
	x86_64-windows-clang

OS: UB2004-32
	Kernel Version: 5.8.0-48-generic
	GCC Version: gcc (Ubuntu 10.3.0-1ubuntu1~20.04) 10.3.0
	Clang Version: 10.0.0-4ubuntu1
	i686-native-linuxapp-gcc

OS: FreeBSD13-64
	Kernel Version: 13.0-RELEASE
	GCC Version: gcc (FreeBSD Ports Collection) 10.3.0
	Clang Version: 11.0.1 (git@github.com:llvm/llvm-project.git llvmorg-11.0.1-0-g43ff75f2c3fe)
	x86_64-native-bsdapp-gcc
	x86_64-native-bsdapp-clang
	x86_64-native-bsdapp-gcc+shared
	x86_64-native-bsdapp-gcc+debug

OS: SUSE15-64
	Kernel Version: 5.3.18-lp152.57-default
	GCC Version: gcc (SUSE Linux) 7.5.0
	Clang Version: 9.0.1
	x86_64-native-linuxapp-clang
	x86_64-native-linuxapp-gcc

OS: RHEL84-64
	Kernel Version: 4.18.0-305.19.1.el8_4.x86_64
	GCC Version: gcc (GCC) 8.4.1 20200928 (Red Hat 8.4.1-1)
	Clang Version: 11.0.0 (Red Hat 11.0.0-1.module_el8.4.0+587+5187cac0)
	x86_64-native-linuxapp-gcc
	x86_64-native-linuxapp-clang
	x86_64-native-linuxapp-gcc+shared
	x86_64-native-linuxapp-gcc+debug
	x86_64-native-linuxapp-icc



*Build Failed #1:
OS: UB2004-64
Target: x86_64-native-linuxapp-icc
FAILED: drivers/libtmp_rte_net_pcap.a.p/net_pcap_pcap_ethdev.c.o 
icc -Idrivers/libtmp_rte_net_pcap.a.p -Idrivers -I../drivers -Idrivers/net/pcap -I../drivers/net/pcap -Ilib/ethdev -I../lib/ethdev -I. -I.. -Iconfig -I../config -Ilib/eal/include -I../lib/eal/include -Ilib/eal/linux/include -I../lib/eal/linux/include -Ilib/eal/x86/include -I../lib/eal/x86/include -Ilib/eal/common -I../lib/eal/common -Ilib/eal -I../lib/eal -Ilib/kvargs -I../lib/kvargs -Ilib/metrics -I../lib/metrics -Ilib/telemetry -I../lib/telemetry -Ilib/net -I../lib/net -Ilib/mbuf -I../lib/mbuf -Ilib/mempool -I../lib/mempool -Ilib/ring -I../lib/ring -Ilib/meter -I../lib/meter -Idrivers/bus/pci -I../drivers/bus/pci -I../drivers/bus/pci/linux -Ilib/pci -I../lib/pci -Idrivers/bus/vdev -I../drivers/bus/vdev -pipe -D_FILE_OFFSET_BITS=64 -Wall -w3 -diag-disable:remark -Werror -O3 -include rte_config.h -Wextra -Wcast-qual -Wdeprecated -Wformat -Wformat-security -Wmissing-declarations -Wmissing-prototypes -Wold-style-definition -Wpointer-arith -Wsign-compare -Wstrict-prototypes -Wundef -Wwrite-strings -Wno-missing-field-initializers -diag-disable=181 -diag-disable=188 -diag-disable=2203 -diag-disable=2279 -diag-disable=2557 -diag-disable=3179 -diag-disable=3656 -D_GNU_SOURCE -fPIC -march=native -DALLOW_EXPERIMENTAL_API -DALLOW_INTERNAL_API -DRTE_LOG_DEFAULT_LOGTYPE=pmd.net.pcap -MD -MQ drivers/libtmp_rte_net_pcap.a.p/net_pcap_pcap_ethdev.c.o -MF drivers/libtmp_rte_net_pcap.a.p/net_pcap_pcap_ethdev.c.o.d -o drivers/libtmp_rte_net_pcap.a.p/net_pcap_pcap_ethdev.c.o -c ../drivers/net/pcap/pcap_ethdev.c
": internal error: ** The compiler has encountered an unexpected problem.
** Segmentation violation signal raised. **
Access violation or stack overflow. Please contact Intel Support for assistance.

icc: error #10105: /opt/intel/compilers_and_libraries_2020.4.304/linux/bin/intel64/mcpcom: core dumped
icc: warning #10102: unknown signal(0)
icc: error #10106: Fatal error in /opt/intel/compilers_and_libraries_2020.4.304/linux/bin/intel64/mcpcom, terminated by unknown
compilation aborted for ../drivers/net/pcap/pcap_ethdev.c (code 1)
[1858/3040] Generating rte_net_sfc_def with a custom command
[1859/3040] Generating rte_net_sfc_mingw with a custom command
[1860/3040] Compiling C object drivers/libtmp_rte_net_sfc.a.p/net_sfc_sfc_service.c.o
[1861/3040] Compiling C object drivers/libtmp_rte_net_sfc.a.p/net_sfc_sfc_repr.c.o
[1862/3040] Compiling C object drivers/libtmp_rte_net_sfc.a.p/net_sfc_sfc_ef10_tx.c.o
[1863/3040] Compiling C object drivers/libtmp_rte_net_sfc.a.p/net_sfc_sfc_ef100_tx.c.o
[1864/3040] Compiling C object drivers/libtmp_rte_net_sfc.a.p/net_sfc_sfc_repr_proxy.c.o
[1865/3040] Compiling C object drivers/libtmp_rte_net_octeontx2.a.p/net_octeontx2_otx2_rx.c.o
[1866/3040] Compiling C object drivers/libtmp_rte_net_octeontx2.a.p/net_octeontx2_otx2_tx.c.o
ninja: build stopped


DPDK STV team

^ permalink raw reply	[flat|nested] only message in thread

only message in thread, other threads:[~2021-10-14  4:24 UTC | newest]

Thread overview: (only message) (download: mbox.gz / follow: Atom feed)
-- links below jump to the message on this page --
2021-10-14  4:24 [dpdk-test-report] |FAILURE| pw(101384) sid(19604) job(PER_PATCH_BUILD8713)net/bnxt: remove debug macro breaking build sys_stv

automatic DPDK test reports

This inbox may be cloned and mirrored by anyone:

	git clone --mirror http://inbox.dpdk.org/test-report/0 test-report/git/0.git

	# If you have public-inbox 1.1+ installed, you may
	# initialize and index your mirror using the following commands:
	public-inbox-init -V2 test-report test-report/ http://inbox.dpdk.org/test-report \
		test-report@dpdk.org
	public-inbox-index test-report

Example config snippet for mirrors.
Newsgroup available over NNTP:
	nntp://inbox.dpdk.org/inbox.dpdk.test-report


AGPL code for this site: git clone https://public-inbox.org/public-inbox.git