automatic DPDK test reports
 help / color / mirror / Atom feed
* [dpdk-test-report] |FAILURE| pw(101452) sid(19611) job(PER_PATCH_BUILD8720)[2/2] doc: fix the list of supported flow items in net/sfc
@ 2021-10-14  5:51 sys_stv
  0 siblings, 0 replies; only message in thread
From: sys_stv @ 2021-10-14  5:51 UTC (permalink / raw)
  To: test-report, Ivan.Malov

[-- Attachment #1: Type: text/plain, Size: 6567 bytes --]


Test-Label: Intel-compilation
Test-Status: FAILURE
http://dpdk.org/patch/101452

_Compilation issues_

Submitter: Ivan Malov <Ivan.Malov@oktetlabs.ru>
Date: 2021-10-13 17:52:14
Reply_mail: 20211013175214.31235-2-ivan.malov@oktetlabs.ru

DPDK git baseline: Repo:dpdk-next-net, CommitID: cfa8a8e953881bbd2e1f81dff9a7b16300e0f4e7


Meson Build Summary: 20 Builds Done, 19 Successful, 1 Failures, 0 Blocked

+--------------+------------+--------------+------------+------------+-----------+----------+
| os           | gcc-static | clang-static | icc-static | gcc-shared | gcc-debug | document |
+--------------+------------+--------------+------------+------------+-----------+----------+
| UB2004-64    | pass       | pass         | pass       |            |           | pass     |
| FC34-64      | pass       | pass         |            |            |           |          |
| UB2104-64    | pass       |              |            |            |           |          |
| WIN10-64     |            | pass         |            |            |           |          |
| UB2004-32    | pass       |              |            |            |           |          |
| FreeBSD13-64 | pass       | pass         |            | pass       | pass      |          |
| SUSE15-64    | fail       | pass         |            |            |           |          |
| RHEL84-64    | pass       | pass         | pass       | pass       | pass      |          |
+--------------+------------+--------------+------------+------------+-----------+----------+
Test environment and configuration as below:


OS: UB2004-64
	Kernel Version: 5.8.0-48-generic
	GCC Version: gcc (Ubuntu 10.3.0-1ubuntu1~20.04) 10.3.0
	Clang Version: 10.0.0-4ubuntu1
	x86_64-native-linuxapp-clang
	x86_64-native-linuxapp-gcc
	x86_64-native-linuxapp-icc
	x86_64-native-linuxapp-doc

OS: FC34-64
	Kernel Version: 5.11.15-300.fc34.x86_64
	GCC Version: gcc (GCC) 11.0.1 20210324 (Red Hat 11.0.1-0)
	Clang Version: 12.0.0 (Fedora 12.0.0-0.3.rc1.fc34)
	x86_64-native-linuxapp-gcc
	x86_64-native-linuxapp-clang

OS: UB2104-64
	Kernel Version: 5.11.0-16-generic
	GCC Version: gcc (Ubuntu 10.3.0-1ubuntu1) 10.3.0
	Clang Version: 12.0.0-1ubuntu1
	x86_64-native-linuxapp-gcc

OS: WIN10-64
	Kernel Version: N/A
	GCC Version: N/A
	Clang Version: Clang 8.0.0
	x86_64-windows-clang

OS: UB2004-32
	Kernel Version: 5.8.0-48-generic
	GCC Version: gcc (Ubuntu 10.3.0-1ubuntu1~20.04) 10.3.0
	Clang Version: 10.0.0-4ubuntu1
	i686-native-linuxapp-gcc

OS: FreeBSD13-64
	Kernel Version: 13.0-RELEASE
	GCC Version: gcc (FreeBSD Ports Collection) 10.3.0
	Clang Version: 11.0.1 (git@github.com:llvm/llvm-project.git llvmorg-11.0.1-0-g43ff75f2c3fe)
	x86_64-native-bsdapp-gcc
	x86_64-native-bsdapp-clang
	x86_64-native-bsdapp-gcc+shared
	x86_64-native-bsdapp-gcc+debug

OS: SUSE15-64
	Kernel Version: 5.3.18-lp152.57-default
	GCC Version: gcc (SUSE Linux) 7.5.0
	Clang Version: 9.0.1
	x86_64-native-linuxapp-clang
	x86_64-native-linuxapp-gcc

OS: RHEL84-64
	Kernel Version: 4.18.0-305.19.1.el8_4.x86_64
	GCC Version: gcc (GCC) 8.4.1 20200928 (Red Hat 8.4.1-1)
	Clang Version: 11.0.0 (Red Hat 11.0.0-1.module_el8.4.0+587+5187cac0)
	x86_64-native-linuxapp-gcc
	x86_64-native-linuxapp-clang
	x86_64-native-linuxapp-gcc+shared
	x86_64-native-linuxapp-gcc+debug
	x86_64-native-linuxapp-icc



*Build Failed #1:
OS: SUSE15-64
Target: x86_64-native-linuxapp-gcc
FAILED: drivers/libtmp_rte_net_enic.a.p/net_enic_enic_fm_flow.c.o 
gcc -Idrivers/libtmp_rte_net_enic.a.p -Idrivers -I../drivers -Idrivers/net/enic -I../drivers/net/enic -I../drivers/net/enic/base -Ilib/ethdev -I../lib/ethdev -I. -I.. -Iconfig -I../config -Ilib/eal/include -I../lib/eal/include -Ilib/eal/linux/include -I../lib/eal/linux/include -Ilib/eal/x86/include -I../lib/eal/x86/include -Ilib/eal/common -I../lib/eal/common -Ilib/eal -I../lib/eal -Ilib/kvargs -I../lib/kvargs -Ilib/metrics -I../lib/metrics -Ilib/telemetry -I../lib/telemetry -Ilib/net -I../lib/net -Ilib/mbuf -I../lib/mbuf -Ilib/mempool -I../lib/mempool -Ilib/ring -I../lib/ring -Ilib/meter -I../lib/meter -Idrivers/bus/pci -I../drivers/bus/pci -I../drivers/bus/pci/linux -Ilib/pci -I../lib/pci -Idrivers/bus/vdev -I../drivers/bus/vdev -Ilib/hash -I../lib/hash -Ilib/rcu -I../lib/rcu -fdiagnostics-color=always -pipe -D_FILE_OFFSET_BITS=64 -Wall -Winvalid-pch -Werror -O3 -include rte_config.h -Wextra -Wcast-qual -Wdeprecated -Wformat -Wformat-nonliteral -Wformat-security -Wmissing-declarations -Wmissing-prototypes -Wnested-externs -Wold-style-definition -Wpointer-arith -Wsign-compare -Wstrict-prototypes -Wundef -Wwrite-strings -Wno-missing-field-initializers -D_GNU_SOURCE -fPIC -march=native -DALLOW_EXPERIMENTAL_API -DALLOW_INTERNAL_API -Wno-format-truncation -DRTE_LOG_DEFAULT_LOGTYPE=pmd.net.enic -MD -MQ drivers/libtmp_rte_net_enic.a.p/net_enic_enic_fm_flow.c.o -MF drivers/libtmp_rte_net_enic.a.p/net_enic_enic_fm_flow.c.o.d -o drivers/libtmp_rte_net_enic.a.p/net_enic_enic_fm_flow.c.o -c ../drivers/net/enic/enic_fm_flow.c
../drivers/net/enic/enic_fm_flow.c: In function ‘enic_fm_flow_parse’:
../drivers/net/enic/enic_fm_flow.c:1467:24: error: ‘dev’ may be used uninitialized in this function [-Werror=maybe-uninitialized]
    struct rte_eth_dev *dev;
                        ^~~
../drivers/net/enic/enic_fm_flow.c:1580:24: error: ‘dev’ may be used uninitialized in this function [-Werror=maybe-uninitialized]
    struct rte_eth_dev *dev;
                        ^~~
../drivers/net/enic/enic_fm_flow.c:1599:24: error: ‘dev’ may be used uninitialized in this function [-Werror=maybe-uninitialized]
    struct rte_eth_dev *dev;
                        ^~~
cc1: all warnings being treated as errors
[1353/3069] Generating rte_net_cnxk.sym_chk with a custom command (wrapped by meson to capture output)
[1354/3069] Compiling C object drivers/net/fm10k/base/libfm10k_base.a.p/fm10k_vf.c.o
[1355/3069] Compiling C object drivers/libtmp_rte_net_enic.a.p/net_enic_enic_main.c.o
[1356/3069] Compiling C object drivers/libtmp_rte_net_failsafe.a.p/net_failsafe_failsafe_ether.c.o
[1357/3069] Compiling C object drivers/libtmp_rte_net_failsafe.a.p/net_failsafe_failsafe_eal.c.o
[1358/3069] Compiling C object drivers/libtmp_rte_net_failsafe.a.p/net_failsafe_failsafe.c.o
[1359/3069] Compiling C object drivers/libtmp_rte_net_failsafe.a.p/net_failsafe_failsafe_intr.c.o
[1360/3069] Compiling C object drivers/libtmp_rte_net_failsafe.a.p/net_failsafe_failsafe_flow.c.o
[1361/3069] Compiling C object drivers/libtmp_rte_net_failsafe.a.p/net_failsafe_failsafe_ops.c.o
ninja: build stopped


DPDK STV team

^ permalink raw reply	[flat|nested] only message in thread

only message in thread, other threads:[~2021-10-14  5:51 UTC | newest]

Thread overview: (only message) (download: mbox.gz / follow: Atom feed)
-- links below jump to the message on this page --
2021-10-14  5:51 [dpdk-test-report] |FAILURE| pw(101452) sid(19611) job(PER_PATCH_BUILD8720)[2/2] doc: fix the list of supported flow items in net/sfc sys_stv

automatic DPDK test reports

This inbox may be cloned and mirrored by anyone:

	git clone --mirror http://inbox.dpdk.org/test-report/0 test-report/git/0.git

	# If you have public-inbox 1.1+ installed, you may
	# initialize and index your mirror using the following commands:
	public-inbox-init -V2 test-report test-report/ http://inbox.dpdk.org/test-report \
		test-report@dpdk.org
	public-inbox-index test-report

Example config snippet for mirrors.
Newsgroup available over NNTP:
	nntp://inbox.dpdk.org/inbox.dpdk.test-report


AGPL code for this site: git clone https://public-inbox.org/public-inbox.git