automatic DPDK test reports
 help / color / mirror / Atom feed
From: sys_stv@intel.com
To: test-report@dpdk.org, thomas@monjalon.net
Cc: dpdk_sw_eng@intel.com, npg.sw.core.tools.prc@intel.com
Subject: [dpdk-test-report] |FAILURE| dpdk daily Intel builds
Date: 13 Oct 2021 20:03:59 -0700
Message-ID: <746b4b$ekuuh0@orsmga008-auth.jf.intel.com> (raw)

[-- Attachment #1: Type: text/plain, Size: 196033 bytes --]


Test-Label: Intel-compilation
Test-Status: FAILURE
_Compilation issues_


commit d75eed0fbe4b942bc6df2e2908a8b5c2c30c99aa
Author: Stephen Hemminger <stephen@networkplumber.org>
Date:   Wed Sep 1 16:49:44 2021 -0700

    mbuf: fix typo in comment

DPDK git Repo: dpdk 


Meson Build Summary: 22 Builds Done, 17 Successful, 5 Failures, 0 Blocked

+--------------+------------+--------------+------------+------------+-----------+----------+
| os           | gcc-static | clang-static | icc-static | gcc-shared | gcc-debug | document |
+--------------+------------+--------------+------------+------------+-----------+----------+
| UB2004-64    | pass       | pass         | pass       |            |           | pass     |
| FC34-64      | fail       | fail         |            |            |           |          |
| UB2104-64    | pass       |              |            |            |           |          |
| WIN10-64     |            | pass         |            |            |           |          |
| UB2004-32    | pass       |              |            |            |           |          |
| FreeBSD13-64 | pass       | pass         |            | pass       | pass      |          |
| UB2004-64N   | pass       |              |            | pass       |           |          |
| SUSE15-64    | fail       | fail         |            |            |           |          |
| RHEL84-64    | fail       | pass         | pass       | pass       | pass      |          |
+--------------+------------+--------------+------------+------------+-----------+----------+
Test environment and configuration as below:


OS: UB2004-64
	Kernel Version: 5.8.0-48-generic
	GCC Version: gcc (Ubuntu 10.3.0-1ubuntu1~20.04) 10.3.0
	Clang Version: 10.0.0-4ubuntu1
	x86_64-native-linuxapp-clang
	x86_64-native-linuxapp-gcc
	x86_64-native-linuxapp-icc
	x86_64-native-linuxapp-doc

OS: FC34-64
	Kernel Version: 5.11.15-300.fc34.x86_64
	GCC Version: gcc (GCC) 11.0.1 20210324 (Red Hat 11.0.1-0)
	Clang Version: 12.0.0 (Fedora 12.0.0-0.3.rc1.fc34)
	x86_64-native-linuxapp-gcc
	x86_64-native-linuxapp-clang

OS: UB2104-64
	Kernel Version: 5.11.0-16-generic
	GCC Version: gcc (Ubuntu 10.3.0-1ubuntu1) 10.3.0
	Clang Version: 12.0.0-1ubuntu1
	x86_64-native-linuxapp-gcc

OS: WIN10-64
	Kernel Version: N/A
	GCC Version: N/A
	Clang Version: Clang 8.0.0
	x86_64-windows-clang

OS: UB2004-32
	Kernel Version: 5.8.0-48-generic
	GCC Version: gcc (Ubuntu 10.3.0-1ubuntu1~20.04) 10.3.0
	Clang Version: 10.0.0-4ubuntu1
	i686-native-linuxapp-gcc

OS: FreeBSD13-64
	Kernel Version: 13.0-RELEASE
	GCC Version: gcc (FreeBSD Ports Collection) 10.3.0
	Clang Version: 11.0.1 (git@github.com:llvm/llvm-project.git llvmorg-11.0.1-0-g43ff75f2c3fe)
	x86_64-native-bsdapp-gcc
	x86_64-native-bsdapp-clang
	x86_64-native-bsdapp-gcc+shared
	x86_64-native-bsdapp-gcc+debug

OS: UB2004-64N
	Kernel Version: 5.11.16-051116-generic
	GCC Version: gcc (Ubuntu 9.3.0-17ubuntu1~20.04) 9.3.0
	Clang Version: 10.0.0-4ubuntu1
	x86_64-native-linuxapp-gcc
	x86_64-native-linuxapp-gcc+shared

OS: SUSE15-64
	Kernel Version: 5.3.18-lp152.57-default
	GCC Version: gcc (SUSE Linux) 7.5.0
	Clang Version: 9.0.1
	x86_64-native-linuxapp-clang
	x86_64-native-linuxapp-gcc

OS: RHEL84-64
	Kernel Version: 4.18.0-305.19.1.el8_4.x86_64
	GCC Version: gcc (GCC) 8.4.1 20200928 (Red Hat 8.4.1-1)
	Clang Version: 11.0.0 (Red Hat 11.0.0-1.module_el8.4.0+587+5187cac0)
	x86_64-native-linuxapp-gcc
	x86_64-native-linuxapp-clang
	x86_64-native-linuxapp-gcc+shared
	x86_64-native-linuxapp-gcc+debug
	x86_64-native-linuxapp-icc



*Build Failed #1:
OS: FC34-64
Target: x86_64-native-linuxapp-gcc



*Build Failed #2:
OS: FC34-64
Target: x86_64-native-linuxapp-clang
FAILED: drivers/net/e1000/base/libe1000_base.a.p/e1000_82543.c.o 
clang -Idrivers/net/e1000/base/libe1000_base.a.p -Idrivers/net/e1000/base -I../drivers/net/e1000/base -I. -I.. -Iconfig -I../config -Ilib/eal/include -I../lib/eal/include -Ilib/eal/linux/include -I../lib/eal/linux/include -Ilib/eal/x86/include -I../lib/eal/x86/include -Ilib/eal/common -I../lib/eal/common -Ilib/eal -I../lib/eal -Ilib/kvargs -I../lib/kvargs -Ilib/metrics -I../lib/metrics -Ilib/telemetry -I../lib/telemetry -Xclang -fcolor-diagnostics -pipe -D_FILE_OFFSET_BITS=64 -Wall -Winvalid-pch -Werror -O3 -include rte_config.h -Wextra -Wcast-qual -Wdeprecated -Wformat -Wformat-nonliteral -Wformat-security -Wmissing-declarations -Wmissing-prototypes -Wnested-externs -Wold-style-definition -Wpointer-arith -Wsign-compare -Wstrict-prototypes -Wundef -Wwrite-strings -Wno-address-of-packed-member -Wno-missing-field-initializers -D_GNU_SOURCE -fPIC -march=native -DALLOW_EXPERIMENTAL_API -DALLOW_INTERNAL_API -Wno-uninitialized -Wno-unused-parameter -Wno-unused-variable -Wno-misleading-indentation -Wno-implicit-fallthrough -MD -MQ drivers/net/e1000/base/libe1000_base.a.p/e1000_82543.c.o -MF drivers/net/e1000/base/libe1000_base.a.p/e1000_82543.c.o.d -o drivers/net/e1000/base/libe1000_base.a.p/e1000_82543.c.o -c ../drivers/net/e1000/base/e1000_82543.c
In file included from ../drivers/net/e1000/base/e1000_82543.c:14:
In file included from ../drivers/net/e1000/base/e1000_api.h:8:
In file included from ../drivers/net/e1000/base/e1000_hw.h:8:
../drivers/net/e1000/base/e1000_osdep.h:14:10: fatal error: 'rte_common.h' file not found
#include <rte_common.h>
         ^~~~~~~~~~~~~~
1 error generated.
[1265/3066] Compiling C object drivers/libtmp_rte_net_dpaa2.a.p/net_dpaa2_dpaa2_rxtx.c.o
[1266/3066] Compiling C object drivers/net/e1000/base/libe1000_base.a.p/e1000_base.c.o
FAILED: drivers/net/e1000/base/libe1000_base.a.p/e1000_base.c.o 
clang -Idrivers/net/e1000/base/libe1000_base.a.p -Idrivers/net/e1000/base -I../drivers/net/e1000/base -I. -I.. -Iconfig -I../config -Ilib/eal/include -I../lib/eal/include -Ilib/eal/linux/include -I../lib/eal/linux/include -Ilib/eal/x86/include -I../lib/eal/x86/include -Ilib/eal/common -I../lib/eal/common -Ilib/eal -I../lib/eal -Ilib/kvargs -I../lib/kvargs -Ilib/metrics -I../lib/metrics -Ilib/telemetry -I../lib/telemetry -Xclang -fcolor-diagnostics -pipe -D_FILE_OFFSET_BITS=64 -Wall -Winvalid-pch -Werror -O3 -include rte_config.h -Wextra -Wcast-qual -Wdeprecated -Wformat -Wformat-nonliteral -Wformat-security -Wmissing-declarations -Wmissing-prototypes -Wnested-externs -Wold-style-definition -Wpointer-arith -Wsign-compare -Wstrict-prototypes -Wundef -Wwrite-strings -Wno-address-of-packed-member -Wno-missing-field-initializers -D_GNU_SOURCE -fPIC -march=native -DALLOW_EXPERIMENTAL_API -DALLOW_INTERNAL_API -Wno-uninitialized -Wno-unused-parameter -Wno-unused-variable -Wno-misleading-indentation -Wno-implicit-fallthrough -MD -MQ drivers/net/e1000/base/libe1000_base.a.p/e1000_base.c.o -MF drivers/net/e1000/base/libe1000_base.a.p/e1000_base.c.o.d -o drivers/net/e1000/base/libe1000_base.a.p/e1000_base.c.o -c ../drivers/net/e1000/base/e1000_base.c
In file included from ../drivers/net/e1000/base/e1000_base.c:5:
In file included from ../drivers/net/e1000/base/e1000_hw.h:8:
In file included from ../drivers/net/e1000/base/e1000_osdep.h:15:
In file included from ../lib/eal/x86/include/rte_cycles.h:13:
In file included from ../lib/eal/include/generic/rte_cycles.h:18:
../lib/eal/x86/include/rte_atomic.h:16:10: fatal error: 'generic/rte_atomic.h' file not found
#include "generic/rte_atomic.h"
         ^~~~~~~~~~~~~~~~~~~~~~
1 error generated.
[1267/3066] Compiling C object drivers/net/e1000/base/libe1000_base.a.p/e1000_82571.c.o
FAILED: drivers/net/e1000/base/libe1000_base.a.p/e1000_82571.c.o 
clang -Idrivers/net/e1000/base/libe1000_base.a.p -Idrivers/net/e1000/base -I../drivers/net/e1000/base -I. -I.. -Iconfig -I../config -Ilib/eal/include -I../lib/eal/include -Ilib/eal/linux/include -I../lib/eal/linux/include -Ilib/eal/x86/include -I../lib/eal/x86/include -Ilib/eal/common -I../lib/eal/common -Ilib/eal -I../lib/eal -Ilib/kvargs -I../lib/kvargs -Ilib/metrics -I../lib/metrics -Ilib/telemetry -I../lib/telemetry -Xclang -fcolor-diagnostics -pipe -D_FILE_OFFSET_BITS=64 -Wall -Winvalid-pch -Werror -O3 -include rte_config.h -Wextra -Wcast-qual -Wdeprecated -Wformat -Wformat-nonliteral -Wformat-security -Wmissing-declarations -Wmissing-prototypes -Wnested-externs -Wold-style-definition -Wpointer-arith -Wsign-compare -Wstrict-prototypes -Wundef -Wwrite-strings -Wno-address-of-packed-member -Wno-missing-field-initializers -D_GNU_SOURCE -fPIC -march=native -DALLOW_EXPERIMENTAL_API -DALLOW_INTERNAL_API -Wno-uninitialized -Wno-unused-parameter -Wno-unused-variable -Wno-misleading-indentation -Wno-implicit-fallthrough -MD -MQ drivers/net/e1000/base/libe1000_base.a.p/e1000_82571.c.o -MF drivers/net/e1000/base/libe1000_base.a.p/e1000_82571.c.o.d -o drivers/net/e1000/base/libe1000_base.a.p/e1000_82571.c.o -c ../drivers/net/e1000/base/e1000_82571.c
In file included from ../drivers/net/e1000/base/e1000_82571.c:21:
In file included from ../drivers/net/e1000/base/e1000_api.h:8:
In file included from ../drivers/net/e1000/base/e1000_hw.h:8:
../drivers/net/e1000/base/e1000_osdep.h:14:10: fatal error: 'rte_common.h' file not found
#include <rte_common.h>
         ^~~~~~~~~~~~~~
1 error generated.
[1268/3066] Compiling C object drivers/net/e1000/base/libe1000_base.a.p/e1000_api.c.o
FAILED: drivers/net/e1000/base/libe1000_base.a.p/e1000_api.c.o 
clang -Idrivers/net/e1000/base/libe1000_base.a.p -Idrivers/net/e1000/base -I../drivers/net/e1000/base -I. -I.. -Iconfig -I../config -Ilib/eal/include -I../lib/eal/include -Ilib/eal/linux/include -I../lib/eal/linux/include -Ilib/eal/x86/include -I../lib/eal/x86/include -Ilib/eal/common -I../lib/eal/common -Ilib/eal -I../lib/eal -Ilib/kvargs -I../lib/kvargs -Ilib/metrics -I../lib/metrics -Ilib/telemetry -I../lib/telemetry -Xclang -fcolor-diagnostics -pipe -D_FILE_OFFSET_BITS=64 -Wall -Winvalid-pch -Werror -O3 -include rte_config.h -Wextra -Wcast-qual -Wdeprecated -Wformat -Wformat-nonliteral -Wformat-security -Wmissing-declarations -Wmissing-prototypes -Wnested-externs -Wold-style-definition -Wpointer-arith -Wsign-compare -Wstrict-prototypes -Wundef -Wwrite-strings -Wno-address-of-packed-member -Wno-missing-field-initializers -D_GNU_SOURCE -fPIC -march=native -DALLOW_EXPERIMENTAL_API -DALLOW_INTERNAL_API -Wno-uninitialized -Wno-unused-parameter -Wno-unused-variable -Wno-misleading-indentation -Wno-implicit-fallthrough -MD -MQ drivers/net/e1000/base/libe1000_base.a.p/e1000_api.c.o -MF drivers/net/e1000/base/libe1000_base.a.p/e1000_api.c.o.d -o drivers/net/e1000/base/libe1000_base.a.p/e1000_api.c.o -c ../drivers/net/e1000/base/e1000_api.c
In file included from ../drivers/net/e1000/base/e1000_api.c:5:
In file included from ../drivers/net/e1000/base/e1000_api.h:8:
In file included from ../drivers/net/e1000/base/e1000_hw.h:8:
../drivers/net/e1000/base/e1000_osdep.h:14:10: fatal error: 'rte_common.h' file not found
#include <rte_common.h>
         ^~~~~~~~~~~~~~
1 error generated.
[1269/3066] Compiling C object drivers/net/e1000/base/libe1000_base.a.p/e1000_82575.c.o
FAILED: drivers/net/e1000/base/libe1000_base.a.p/e1000_82575.c.o 
clang -Idrivers/net/e1000/base/libe1000_base.a.p -Idrivers/net/e1000/base -I../drivers/net/e1000/base -I. -I.. -Iconfig -I../config -Ilib/eal/include -I../lib/eal/include -Ilib/eal/linux/include -I../lib/eal/linux/include -Ilib/eal/x86/include -I../lib/eal/x86/include -Ilib/eal/common -I../lib/eal/common -Ilib/eal -I../lib/eal -Ilib/kvargs -I../lib/kvargs -Ilib/metrics -I../lib/metrics -Ilib/telemetry -I../lib/telemetry -Xclang -fcolor-diagnostics -pipe -D_FILE_OFFSET_BITS=64 -Wall -Winvalid-pch -Werror -O3 -include rte_config.h -Wextra -Wcast-qual -Wdeprecated -Wformat -Wformat-nonliteral -Wformat-security -Wmissing-declarations -Wmissing-prototypes -Wnested-externs -Wold-style-definition -Wpointer-arith -Wsign-compare -Wstrict-prototypes -Wundef -Wwrite-strings -Wno-address-of-packed-member -Wno-missing-field-initializers -D_GNU_SOURCE -fPIC -march=native -DALLOW_EXPERIMENTAL_API -DALLOW_INTERNAL_API -Wno-uninitialized -Wno-unused-parameter -Wno-unused-variable -Wno-misleading-indentation -Wno-implicit-fallthrough -MD -MQ drivers/net/e1000/base/libe1000_base.a.p/e1000_82575.c.o -MF drivers/net/e1000/base/libe1000_base.a.p/e1000_82575.c.o.d -o drivers/net/e1000/base/libe1000_base.a.p/e1000_82575.c.o -c ../drivers/net/e1000/base/e1000_82575.c
In file included from ../drivers/net/e1000/base/e1000_82575.c:15:
In file included from ../drivers/net/e1000/base/e1000_api.h:8:
In file included from ../drivers/net/e1000/base/e1000_hw.h:8:
../drivers/net/e1000/base/e1000_osdep.h:14:10: fatal error: 'rte_common.h' file not found
#include <rte_common.h>
         ^~~~~~~~~~~~~~
1 error generated.
[1270/3066] Compiling C object drivers/net/e1000/base/libe1000_base.a.p/e1000_80003es2lan.c.o
[1271/3066] Generating symbol file drivers/librte_net_dpaa.so.22.0.p/librte_net_dpaa.so.22.0.symbols
[1272/3066] Compiling C object drivers/libtmp_rte_net_cnxk.a.p/net_cnxk_cn10k_tx_mseg.c.o
FAILED: drivers/libtmp_rte_net_cnxk.a.p/net_cnxk_cn10k_tx_mseg.c.o 
clang -Idrivers/libtmp_rte_net_cnxk.a.p -Idrivers -I../drivers -Idrivers/net/cnxk -I../drivers/net/cnxk -Ilib/ethdev -I../lib/ethdev -I. -I.. -Iconfig -I../config -Ilib/eal/include -I../lib/eal/include -Ilib/eal/linux/include -I../lib/eal/linux/include -Ilib/eal/x86/include -I../lib/eal/x86/include -Ilib/eal/common -I../lib/eal/common -Ilib/eal -I../lib/eal -Ilib/kvargs -I../lib/kvargs -Ilib/metrics -I../lib/metrics -Ilib/telemetry -I../lib/telemetry -Ilib/net -I../lib/net -Ilib/mbuf -I../lib/mbuf -Ilib/mempool -I../lib/mempool -Ilib/ring -I../lib/ring -Ilib/meter -I../lib/meter -Idrivers/bus/pci -I../drivers/bus/pci -I../drivers/bus/pci/linux -Ilib/pci -I../lib/pci -Idrivers/bus/vdev -I../drivers/bus/vdev -Ilib/cryptodev -I../lib/cryptodev -Ilib/rcu -I../lib/rcu -Ilib/eventdev -I../lib/eventdev -Ilib/hash -I../lib/hash -Ilib/timer -I../lib/timer -Ilib/security -I../lib/security -Idrivers/common/cnxk -I../drivers/common/cnxk -Idrivers/mempool/cnxk -I../drivers/mempool/cnxk -Xclang -fcolor-diagnostics -pipe -D_FILE_OFFSET_BITS=64 -Wall -Winvalid-pch -Werror -O3 -include rte_config.h -Wextra -Wcast-qual -Wdeprecated -Wformat -Wformat-nonliteral -Wformat-security -Wmissing-declarations -Wmissing-prototypes -Wnested-externs -Wold-style-definition -Wpointer-arith -Wsign-compare -Wstrict-prototypes -Wundef -Wwrite-strings -Wno-address-of-packed-member -Wno-missing-field-initializers -D_GNU_SOURCE -fPIC -march=native -DALLOW_EXPERIMENTAL_API -DALLOW_INTERNAL_API -flax-vector-conversions -Wno-strict-aliasing -DRTE_LOG_DEFAULT_LOGTYPE=pmd.net.cnxk -MD -MQ drivers/libtmp_rte_net_cnxk.a.p/net_cnxk_cn10k_tx_mseg.c.o -MF drivers/libtmp_rte_net_cnxk.a.p/net_cnxk_cn10k_tx_mseg.c.o.d -o drivers/libtmp_rte_net_cnxk.a.p/net_cnxk_cn10k_tx_mseg.c.o -c ../drivers/net/cnxk/cn10k_tx_mseg.c
error: error opening 'drivers/libtmp_rte_net_cnxk.a.p/net_cnxk_cn10k_tx_mseg.c.o.d': No such file or directory
1 error generated.
[1273/3066] Compiling C object drivers/libtmp_rte_net_dpaa2.a.p/net_dpaa2_dpaa2_flow.c.o
FAILED: drivers/libtmp_rte_net_dpaa2.a.p/net_dpaa2_dpaa2_flow.c.o 
clang -Idrivers/libtmp_rte_net_dpaa2.a.p -Idrivers -I../drivers -Idrivers/net/dpaa2 -I../drivers/net/dpaa2 -I../drivers/net/dpaa2/base -I../drivers/net/dpaa2/mc -Ilib/ethdev -I../lib/ethdev -I. -I.. -Iconfig -I../config -Ilib/eal/include -I../lib/eal/include -Ilib/eal/linux/include -I../lib/eal/linux/include -Ilib/eal/x86/include -I../lib/eal/x86/include -Ilib/eal/common -I../lib/eal/common -Ilib/eal -I../lib/eal -Ilib/kvargs -I../lib/kvargs -Ilib/metrics -I../lib/metrics -Ilib/telemetry -I../lib/telemetry -Ilib/net -I../lib/net -Ilib/mbuf -I../lib/mbuf -Ilib/mempool -I../lib/mempool -Ilib/ring -I../lib/ring -Ilib/meter -I../lib/meter -Idrivers/bus/pci -I../drivers/bus/pci -I../drivers/bus/pci/linux -Ilib/pci -I../lib/pci -Idrivers/bus/vdev -I../drivers/bus/vdev -Idrivers/mempool/dpaa2 -I../drivers/mempool/dpaa2 -Idrivers/bus/fslmc -I../drivers/bus/fslmc -I../drivers/bus/fslmc/mc -I../drivers/bus/fslmc/qbman/include -I../drivers/bus/fslmc/portal -Idrivers/common/dpaax -I../drivers/common/dpaax -I../drivers/common/dpaax/caamflib -Ilib/eventdev -I../lib/eventdev -Ilib/hash -I../lib/hash -Ilib/rcu -I../lib/rcu -Ilib/timer -I../lib/timer -Ilib/cryptodev -I../lib/cryptodev -Xclang -fcolor-diagnostics -pipe -D_FILE_OFFSET_BITS=64 -Wall -Winvalid-pch -Werror -O3 -include rte_config.h -Wextra -Wcast-qual -Wdeprecated -Wformat -Wformat-nonliteral -Wformat-security -Wmissing-declarations -Wmissing-prototypes -Wnested-externs -Wold-style-definition -Wpointer-arith -Wsign-compare -Wstrict-prototypes -Wundef -Wwrite-strings -Wno-address-of-packed-member -Wno-missing-field-initializers -D_GNU_SOURCE -fPIC -march=native -DALLOW_EXPERIMENTAL_API -DALLOW_INTERNAL_API -DRTE_LOG_DEFAULT_LOGTYPE=pmd.net.dpaa2 -MD -MQ drivers/libtmp_rte_net_dpaa2.a.p/net_dpaa2_dpaa2_flow.c.o -MF drivers/libtmp_rte_net_dpaa2.a.p/net_dpaa2_dpaa2_flow.c.o.d -o drivers/libtmp_rte_net_dpaa2.a.p/net_dpaa2_dpaa2_flow.c.o -c ../drivers/net/dpaa2/dpaa2_flow.c
error: error opening 'drivers/libtmp_rte_net_dpaa2.a.p/net_dpaa2_dpaa2_flow.c.o.d': No such file or directory
1 error generated.
ninja: build stopped




*Build Failed #3:
OS: RHEL84-64
Target: x86_64-native-linuxapp-gcc
FAILED: drivers/libtmp_rte_net_dpaa2.a.p/net_dpaa2_dpaa2_sparser.c.o 
gcc -Idrivers/libtmp_rte_net_dpaa2.a.p -Idrivers -I../drivers -Idrivers/net/dpaa2 -I../drivers/net/dpaa2 -I../drivers/net/dpaa2/base -I../drivers/net/dpaa2/mc -Ilib/ethdev -I../lib/ethdev -I. -I.. -Iconfig -I../config -Ilib/eal/include -I../lib/eal/include -Ilib/eal/linux/include -I../lib/eal/linux/include -Ilib/eal/x86/include -I../lib/eal/x86/include -Ilib/eal/common -I../lib/eal/common -Ilib/eal -I../lib/eal -Ilib/kvargs -I../lib/kvargs -Ilib/metrics -I../lib/metrics -Ilib/telemetry -I../lib/telemetry -Ilib/net -I../lib/net -Ilib/mbuf -I../lib/mbuf -Ilib/mempool -I../lib/mempool -Ilib/ring -I../lib/ring -Ilib/meter -I../lib/meter -Idrivers/bus/pci -I../drivers/bus/pci -I../drivers/bus/pci/linux -Ilib/pci -I../lib/pci -Idrivers/bus/vdev -I../drivers/bus/vdev -Idrivers/mempool/dpaa2 -I../drivers/mempool/dpaa2 -Idrivers/bus/fslmc -I../drivers/bus/fslmc -I../drivers/bus/fslmc/mc -I../drivers/bus/fslmc/qbman/include -I../drivers/bus/fslmc/portal -Idrivers/common/dpaax -I../drivers/common/dpaax -I../drivers/common/dpaax/caamflib -Ilib/eventdev -I../lib/eventdev -Ilib/hash -I../lib/hash -Ilib/rcu -I../lib/rcu -Ilib/timer -I../lib/timer -Ilib/cryptodev -I../lib/cryptodev -fdiagnostics-color=always -D_FILE_OFFSET_BITS=64 -Wall -Winvalid-pch -Werror -O3 -include rte_config.h -Wextra -Wcast-qual -Wdeprecated -Wformat -Wformat-nonliteral -Wformat-security -Wmissing-declarations -Wmissing-prototypes -Wnested-externs -Wold-style-definition -Wpointer-arith -Wsign-compare -Wstrict-prototypes -Wundef -Wwrite-strings -Wno-packed-not-aligned -Wno-missing-field-initializers -D_GNU_SOURCE -fPIC -march=native -DALLOW_EXPERIMENTAL_API -DALLOW_INTERNAL_API -Wno-format-truncation -DRTE_LOG_DEFAULT_LOGTYPE=pmd.net.dpaa2 -MD -MQ drivers/libtmp_rte_net_dpaa2.a.p/net_dpaa2_dpaa2_sparser.c.o -MF drivers/libtmp_rte_net_dpaa2.a.p/net_dpaa2_dpaa2_sparser.c.o.d -o drivers/libtmp_rte_net_dpaa2.a.p/net_dpaa2_dpaa2_sparser.c.o -c ../drivers/net/dpaa2/dpaa2_sparser.c
../drivers/net/dpaa2/dpaa2_sparser.c:5:10: fatal error: rte_mbuf.h: No such file or directory
 #include <rte_mbuf.h>
          ^~~~~~~~~~~~
compilation terminated.
[1243/2996] Compiling C object drivers/libtmp_rte_net_dpaa2.a.p/net_dpaa2_dpaa2_mux.c.o
FAILED: drivers/libtmp_rte_net_dpaa2.a.p/net_dpaa2_dpaa2_mux.c.o 
gcc -Idrivers/libtmp_rte_net_dpaa2.a.p -Idrivers -I../drivers -Idrivers/net/dpaa2 -I../drivers/net/dpaa2 -I../drivers/net/dpaa2/base -I../drivers/net/dpaa2/mc -Ilib/ethdev -I../lib/ethdev -I. -I.. -Iconfig -I../config -Ilib/eal/include -I../lib/eal/include -Ilib/eal/linux/include -I../lib/eal/linux/include -Ilib/eal/x86/include -I../lib/eal/x86/include -Ilib/eal/common -I../lib/eal/common -Ilib/eal -I../lib/eal -Ilib/kvargs -I../lib/kvargs -Ilib/metrics -I../lib/metrics -Ilib/telemetry -I../lib/telemetry -Ilib/net -I../lib/net -Ilib/mbuf -I../lib/mbuf -Ilib/mempool -I../lib/mempool -Ilib/ring -I../lib/ring -Ilib/meter -I../lib/meter -Idrivers/bus/pci -I../drivers/bus/pci -I../drivers/bus/pci/linux -Ilib/pci -I../lib/pci -Idrivers/bus/vdev -I../drivers/bus/vdev -Idrivers/mempool/dpaa2 -I../drivers/mempool/dpaa2 -Idrivers/bus/fslmc -I../drivers/bus/fslmc -I../drivers/bus/fslmc/mc -I../drivers/bus/fslmc/qbman/include -I../drivers/bus/fslmc/portal -Idrivers/common/dpaax -I../drivers/common/dpaax -I../drivers/common/dpaax/caamflib -Ilib/eventdev -I../lib/eventdev -Ilib/hash -I../lib/hash -Ilib/rcu -I../lib/rcu -Ilib/timer -I../lib/timer -Ilib/cryptodev -I../lib/cryptodev -fdiagnostics-color=always -D_FILE_OFFSET_BITS=64 -Wall -Winvalid-pch -Werror -O3 -include rte_config.h -Wextra -Wcast-qual -Wdeprecated -Wformat -Wformat-nonliteral -Wformat-security -Wmissing-declarations -Wmissing-prototypes -Wnested-externs -Wold-style-definition -Wpointer-arith -Wsign-compare -Wstrict-prototypes -Wundef -Wwrite-strings -Wno-packed-not-aligned -Wno-missing-field-initializers -D_GNU_SOURCE -fPIC -march=native -DALLOW_EXPERIMENTAL_API -DALLOW_INTERNAL_API -Wno-format-truncation -DRTE_LOG_DEFAULT_LOGTYPE=pmd.net.dpaa2 -MD -MQ drivers/libtmp_rte_net_dpaa2.a.p/net_dpaa2_dpaa2_mux.c.o -MF drivers/libtmp_rte_net_dpaa2.a.p/net_dpaa2_dpaa2_mux.c.o.d -o drivers/libtmp_rte_net_dpaa2.a.p/net_dpaa2_dpaa2_mux.c.o -c ../drivers/net/dpaa2/dpaa2_mux.c
In file included from ../lib/ring/rte_ring.h:43,
                 from ../lib/mempool/rte_mempool.h:49,
                 from ../lib/mbuf/rte_mbuf.h:38,
                 from ../lib/net/rte_ether.h:23,
                 from ../lib/ethdev/rte_ethdev.h:165,
                 from ../drivers/net/dpaa2/dpaa2_mux.c:13:
../lib/ring/rte_ring_elem.h:699:10: fatal error: rte_ring_peek_zc.h: No such file or directory
 #include <rte_ring_peek_zc.h>
          ^~~~~~~~~~~~~~~~~~~~
compilation terminated.
[1244/2996] Compiling C object drivers/libtmp_rte_net_dpaa2.a.p/net_dpaa2_dpaa2_rxtx.c.o
FAILED: drivers/libtmp_rte_net_dpaa2.a.p/net_dpaa2_dpaa2_rxtx.c.o 
gcc -Idrivers/libtmp_rte_net_dpaa2.a.p -Idrivers -I../drivers -Idrivers/net/dpaa2 -I../drivers/net/dpaa2 -I../drivers/net/dpaa2/base -I../drivers/net/dpaa2/mc -Ilib/ethdev -I../lib/ethdev -I. -I.. -Iconfig -I../config -Ilib/eal/include -I../lib/eal/include -Ilib/eal/linux/include -I../lib/eal/linux/include -Ilib/eal/x86/include -I../lib/eal/x86/include -Ilib/eal/common -I../lib/eal/common -Ilib/eal -I../lib/eal -Ilib/kvargs -I../lib/kvargs -Ilib/metrics -I../lib/metrics -Ilib/telemetry -I../lib/telemetry -Ilib/net -I../lib/net -Ilib/mbuf -I../lib/mbuf -Ilib/mempool -I../lib/mempool -Ilib/ring -I../lib/ring -Ilib/meter -I../lib/meter -Idrivers/bus/pci -I../drivers/bus/pci -I../drivers/bus/pci/linux -Ilib/pci -I../lib/pci -Idrivers/bus/vdev -I../drivers/bus/vdev -Idrivers/mempool/dpaa2 -I../drivers/mempool/dpaa2 -Idrivers/bus/fslmc -I../drivers/bus/fslmc -I../drivers/bus/fslmc/mc -I../drivers/bus/fslmc/qbman/include -I../drivers/bus/fslmc/portal -Idrivers/common/dpaax -I../drivers/common/dpaax -I../drivers/common/dpaax/caamflib -Ilib/eventdev -I../lib/eventdev -Ilib/hash -I../lib/hash -Ilib/rcu -I../lib/rcu -Ilib/timer -I../lib/timer -Ilib/cryptodev -I../lib/cryptodev -fdiagnostics-color=always -D_FILE_OFFSET_BITS=64 -Wall -Winvalid-pch -Werror -O3 -include rte_config.h -Wextra -Wcast-qual -Wdeprecated -Wformat -Wformat-nonliteral -Wformat-security -Wmissing-declarations -Wmissing-prototypes -Wnested-externs -Wold-style-definition -Wpointer-arith -Wsign-compare -Wstrict-prototypes -Wundef -Wwrite-strings -Wno-packed-not-aligned -Wno-missing-field-initializers -D_GNU_SOURCE -fPIC -march=native -DALLOW_EXPERIMENTAL_API -DALLOW_INTERNAL_API -Wno-format-truncation -DRTE_LOG_DEFAULT_LOGTYPE=pmd.net.dpaa2 -MD -MQ drivers/libtmp_rte_net_dpaa2.a.p/net_dpaa2_dpaa2_rxtx.c.o -MF drivers/libtmp_rte_net_dpaa2.a.p/net_dpaa2_dpaa2_rxtx.c.o.d -o drivers/libtmp_rte_net_dpaa2.a.p/net_dpaa2_dpaa2_rxtx.c.o -c ../drivers/net/dpaa2/dpaa2_rxtx.c
In file included from ../lib/mbuf/rte_mbuf.h:38,
                 from ../drivers/net/dpaa2/dpaa2_rxtx.c:11:
../lib/mempool/rte_mempool.h:53:10: fatal error: rte_mempool_trace_fp.h: No such file or directory
compilation terminated.
[1245/2996] Compiling C object drivers/libtmp_rte_net_dpaa2.a.p/net_dpaa2_dpaa2_ethdev.c.o
[1246/2996] Compiling C object drivers/libtmp_rte_net_cnxk.a.p/net_cnxk_cn9k_rx_mseg.c.o
FAILED: drivers/libtmp_rte_net_cnxk.a.p/net_cnxk_cn9k_rx_mseg.c.o 
gcc -Idrivers/libtmp_rte_net_cnxk.a.p -Idrivers -I../drivers -Idrivers/net/cnxk -I../drivers/net/cnxk -Ilib/ethdev -I../lib/ethdev -I. -I.. -Iconfig -I../config -Ilib/eal/include -I../lib/eal/include -Ilib/eal/linux/include -I../lib/eal/linux/include -Ilib/eal/x86/include -I../lib/eal/x86/include -Ilib/eal/common -I../lib/eal/common -Ilib/eal -I../lib/eal -Ilib/kvargs -I../lib/kvargs -Ilib/metrics -I../lib/metrics -Ilib/telemetry -I../lib/telemetry -Ilib/net -I../lib/net -Ilib/mbuf -I../lib/mbuf -Ilib/mempool -I../lib/mempool -Ilib/ring -I../lib/ring -Ilib/meter -I../lib/meter -Idrivers/bus/pci -I../drivers/bus/pci -I../drivers/bus/pci/linux -Ilib/pci -I../lib/pci -Idrivers/bus/vdev -I../drivers/bus/vdev -Ilib/cryptodev -I../lib/cryptodev -Ilib/rcu -I../lib/rcu -Ilib/eventdev -I../lib/eventdev -Ilib/hash -I../lib/hash -Ilib/timer -I../lib/timer -Ilib/security -I../lib/security -Idrivers/common/cnxk -I../drivers/common/cnxk -Idrivers/mempool/cnxk -I../drivers/mempool/cnxk -fdiagnostics-color=always -D_FILE_OFFSET_BITS=64 -Wall -Winvalid-pch -Werror -O3 -include rte_config.h -Wextra -Wcast-qual -Wdeprecated -Wformat -Wformat-nonliteral -Wformat-security -Wmissing-declarations -Wmissing-prototypes -Wnested-externs -Wold-style-definition -Wpointer-arith -Wsign-compare -Wstrict-prototypes -Wundef -Wwrite-strings -Wno-packed-not-aligned -Wno-missing-field-initializers -D_GNU_SOURCE -fPIC -march=native -DALLOW_EXPERIMENTAL_API -DALLOW_INTERNAL_API -Wno-format-truncation -flax-vector-conversions -Wno-strict-aliasing -DRTE_LOG_DEFAULT_LOGTYPE=pmd.net.cnxk -MD -MQ drivers/libtmp_rte_net_cnxk.a.p/net_cnxk_cn9k_rx_mseg.c.o -MF drivers/libtmp_rte_net_cnxk.a.p/net_cnxk_cn9k_rx_mseg.c.o.d -o drivers/libtmp_rte_net_cnxk.a.p/net_cnxk_cn9k_rx_mseg.c.o -c ../drivers/net/cnxk/cn9k_rx_mseg.c
../drivers/net/cnxk/cn9k_rx_mseg.c:10:26: fatal error: opening dependency file drivers/libtmp_rte_net_cnxk.a.p/net_cnxk_cn9k_rx_mseg.c.o.d: No such file or directory
../drivers/net/cnxk/cn9k_rx.h:1065:1: note: in expansion of macro ‘R’
 R(sec_vlan_ts_mark_cksum_ptype_rss, 1, 1, 1, 1, 1, 1, 1,         \
 ^
../drivers/net/cnxk/cn9k_rx_mseg.c:16:1: note: in expansion of macro ‘NIX_RX_FASTPATH_MODES’
compilation terminated.
[1247/2996] Generating rte_net_cxgbe.sym_chk with a custom command (wrapped by meson to capture output)
FAILED: drivers/rte_net_cxgbe.sym_chk 
/usr/local/bin/meson --internal exe --capture drivers/rte_net_cxgbe.sym_chk -- /root/RHEL84-64_K4.18.0_GCC8.4.1/x86_64-native-linuxapp-gcc/506f606f3ab6446786cf88da564f1b7c/dpdk/buildtools/check-symbols.sh /root/RHEL84-64_K4.18.0_GCC8.4.1/x86_64-native-linuxapp-gcc/506f606f3ab6446786cf88da564f1b7c/dpdk/drivers/net/cxgbe/version.map drivers/librte_net_cxgbe.a
Traceback (most recent call last):
  File "/usr/local/bin/meson", line 11, in <module>
    load_entry_point('meson==0.59.1', 'console_scripts', 'meson')()
  File "/usr/local/lib/python3.6/site-packages/mesonbuild/mesonmain.py", line 325, in main
    return run(sys.argv[1:], launcher)
  File "/usr/local/lib/python3.6/site-packages/mesonbuild/mesonmain.py", line 313, in run
    return run_script_command(args[1], args[2:])
  File "/usr/local/lib/python3.6/site-packages/mesonbuild/mesonmain.py", line 261, in run_script_command
    return module.run(script_args)
  File "/usr/local/lib/python3.6/site-packages/mesonbuild/scripts/meson_exe.py", line 119, in run
    return run_exe(exe)
  File "/usr/local/lib/python3.6/site-packages/mesonbuild/scripts/meson_exe.py", line 67, in run_exe
    close_fds=False, stdin=stdin, stdout=pipe, stderr=pipe)
  File "/usr/lib64/python3.6/subprocess.py", line 729, in __init__
    restore_signals, start_new_session)
  File "/usr/lib64/python3.6/subprocess.py", line 1364, in _execute_child
    raise child_exception_type(errno_num, err_msg, err_filename)
FileNotFoundError: [Errno 2] No such file or directory: '/root/RHEL84-64_K4.18.0_GCC8.4.1/x86_64-native-linuxapp-gcc/506f606f3ab6446786cf88da564f1b7c/dpdk/buildtools/check-symbols.sh': '/root/RHEL84-64_K4.18.0_GCC8.4.1/x86_64-native-linuxapp-gcc/506f606f3ab6446786cf88da564f1b7c/dpdk/buildtools/check-symbols.sh'
[1248/2996] Compiling C object drivers/libtmp_rte_net_dpaa.a.p/net_dpaa_dpaa_rxtx.c.o
FAILED: drivers/libtmp_rte_net_dpaa.a.p/net_dpaa_dpaa_rxtx.c.o 
gcc -Idrivers/libtmp_rte_net_dpaa.a.p -Idrivers -I../drivers -Idrivers/net/dpaa -I../drivers/net/dpaa -Ilib/ethdev -I../lib/ethdev -I. -I.. -Iconfig -I../config -Ilib/eal/include -I../lib/eal/include -Ilib/eal/linux/include -I../lib/eal/linux/include -Ilib/eal/x86/include -I../lib/eal/x86/include -Ilib/eal/common -I../lib/eal/common -Ilib/eal -I../lib/eal -Ilib/kvargs -I../lib/kvargs -Ilib/metrics -I../lib/metrics -Ilib/telemetry -I../lib/telemetry -Ilib/net -I../lib/net -Ilib/mbuf -I../lib/mbuf -Ilib/mempool -I../lib/mempool -Ilib/ring -I../lib/ring -Ilib/meter -I../lib/meter -Idrivers/bus/pci -I../drivers/bus/pci -I../drivers/bus/pci/linux -Ilib/pci -I../lib/pci -Idrivers/bus/vdev -I../drivers/bus/vdev -Idrivers/mempool/dpaa -I../drivers/mempool/dpaa -Idrivers/bus/dpaa -I../drivers/bus/dpaa -I../drivers/bus/dpaa/include -I../drivers/bus/dpaa/base/qbman -Idrivers/common/dpaax -I../drivers/common/dpaax -I../drivers/common/dpaax/caamflib -Ilib/eventdev -I../lib/eventdev -Ilib/hash -I../lib/hash -Ilib/rcu -I../lib/rcu -Ilib/timer -I../lib/timer -Ilib/cryptodev -I../lib/cryptodev -fdiagnostics-color=always -D_FILE_OFFSET_BITS=64 -Wall -Winvalid-pch -Werror -O3 -include rte_config.h -Wextra -Wcast-qual -Wdeprecated -Wformat -Wformat-nonliteral -Wformat-security -Wmissing-declarations -Wmissing-prototypes -Wnested-externs -Wold-style-definition -Wpointer-arith -Wsign-compare -Wstrict-prototypes -Wundef -Wwrite-strings -Wno-packed-not-aligned -Wno-missing-field-initializers -D_GNU_SOURCE -fPIC -march=native -DALLOW_EXPERIMENTAL_API -DALLOW_INTERNAL_API -Wno-format-truncation -Wno-pointer-arith -DRTE_LOG_DEFAULT_LOGTYPE=pmd.net.dpaa -MD -MQ drivers/libtmp_rte_net_dpaa.a.p/net_dpaa_dpaa_rxtx.c.o -MF drivers/libtmp_rte_net_dpaa.a.p/net_dpaa_dpaa_rxtx.c.o.d -o drivers/libtmp_rte_net_dpaa.a.p/net_dpaa_dpaa_rxtx.c.o -c ../drivers/net/dpaa/dpaa_rxtx.c
../drivers/net/dpaa/dpaa_rxtx.c:1203:1: fatal error: opening dependency file drivers/libtmp_rte_net_dpaa.a.p/net_dpaa_dpaa_rxtx.c.o.d: No such file or directory
 }
 ^
compilation terminated.
[1249/2996] Compiling C object drivers/libtmp_rte_net_dpaa2.a.p/net_dpaa2_dpaa2_flow.c.o
FAILED: drivers/libtmp_rte_net_dpaa2.a.p/net_dpaa2_dpaa2_flow.c.o 
gcc -Idrivers/libtmp_rte_net_dpaa2.a.p -Idrivers -I../drivers -Idrivers/net/dpaa2 -I../drivers/net/dpaa2 -I../drivers/net/dpaa2/base -I../drivers/net/dpaa2/mc -Ilib/ethdev -I../lib/ethdev -I. -I.. -Iconfig -I../config -Ilib/eal/include -I../lib/eal/include -Ilib/eal/linux/include -I../lib/eal/linux/include -Ilib/eal/x86/include -I../lib/eal/x86/include -Ilib/eal/common -I../lib/eal/common -Ilib/eal -I../lib/eal -Ilib/kvargs -I../lib/kvargs -Ilib/metrics -I../lib/metrics -Ilib/telemetry -I../lib/telemetry -Ilib/net -I../lib/net -Ilib/mbuf -I../lib/mbuf -Ilib/mempool -I../lib/mempool -Ilib/ring -I../lib/ring -Ilib/meter -I../lib/meter -Idrivers/bus/pci -I../drivers/bus/pci -I../drivers/bus/pci/linux -Ilib/pci -I../lib/pci -Idrivers/bus/vdev -I../drivers/bus/vdev -Idrivers/mempool/dpaa2 -I../drivers/mempool/dpaa2 -Idrivers/bus/fslmc -I../drivers/bus/fslmc -I../drivers/bus/fslmc/mc -I../drivers/bus/fslmc/qbman/include -I../drivers/bus/fslmc/portal -Idrivers/common/dpaax -I../drivers/common/dpaax -I../drivers/common/dpaax/caamflib -Ilib/eventdev -I../lib/eventdev -Ilib/hash -I../lib/hash -Ilib/rcu -I../lib/rcu -Ilib/timer -I../lib/timer -Ilib/cryptodev -I../lib/cryptodev -fdiagnostics-color=always -D_FILE_OFFSET_BITS=64 -Wall -Winvalid-pch -Werror -O3 -include rte_config.h -Wextra -Wcast-qual -Wdeprecated -Wformat -Wformat-nonliteral -Wformat-security -Wmissing-declarations -Wmissing-prototypes -Wnested-externs -Wold-style-definition -Wpointer-arith -Wsign-compare -Wstrict-prototypes -Wundef -Wwrite-strings -Wno-packed-not-aligned -Wno-missing-field-initializers -D_GNU_SOURCE -fPIC -march=native -DALLOW_EXPERIMENTAL_API -DALLOW_INTERNAL_API -Wno-format-truncation -DRTE_LOG_DEFAULT_LOGTYPE=pmd.net.dpaa2 -MD -MQ drivers/libtmp_rte_net_dpaa2.a.p/net_dpaa2_dpaa2_flow.c.o -MF drivers/libtmp_rte_net_dpaa2.a.p/net_dpaa2_dpaa2_flow.c.o.d -o drivers/libtmp_rte_net_dpaa2.a.p/net_dpaa2_dpaa2_flow.c.o -c ../drivers/net/dpaa2/dpaa2_flow.c
../drivers/net/dpaa2/dpaa2_flow.c:4206:1: fatal error: opening dependency file drivers/libtmp_rte_net_dpaa2.a.p/net_dpaa2_dpaa2_flow.c.o.d: No such file or directory
 };
 ^
compilation terminated.
[1250/2996] Compiling C object drivers/libtmp_rte_net_cnxk.a.p/net_cnxk_cn10k_tx_mseg.c.o
FAILED: drivers/libtmp_rte_net_cnxk.a.p/net_cnxk_cn10k_tx_mseg.c.o 
gcc -Idrivers/libtmp_rte_net_cnxk.a.p -Idrivers -I../drivers -Idrivers/net/cnxk -I../drivers/net/cnxk -Ilib/ethdev -I../lib/ethdev -I. -I.. -Iconfig -I../config -Ilib/eal/include -I../lib/eal/include -Ilib/eal/linux/include -I../lib/eal/linux/include -Ilib/eal/x86/include -I../lib/eal/x86/include -Ilib/eal/common -I../lib/eal/common -Ilib/eal -I../lib/eal -Ilib/kvargs -I../lib/kvargs -Ilib/metrics -I../lib/metrics -Ilib/telemetry -I../lib/telemetry -Ilib/net -I../lib/net -Ilib/mbuf -I../lib/mbuf -Ilib/mempool -I../lib/mempool -Ilib/ring -I../lib/ring -Ilib/meter -I../lib/meter -Idrivers/bus/pci -I../drivers/bus/pci -I../drivers/bus/pci/linux -Ilib/pci -I../lib/pci -Idrivers/bus/vdev -I../drivers/bus/vdev -Ilib/cryptodev -I../lib/cryptodev -Ilib/rcu -I../lib/rcu -Ilib/eventdev -I../lib/eventdev -Ilib/hash -I../lib/hash -Ilib/timer -I../lib/timer -Ilib/security -I../lib/security -Idrivers/common/cnxk -I../drivers/common/cnxk -Idrivers/mempool/cnxk -I../drivers/mempool/cnxk -fdiagnostics-color=always -D_FILE_OFFSET_BITS=64 -Wall -Winvalid-pch -Werror -O3 -include rte_config.h -Wextra -Wcast-qual -Wdeprecated -Wformat -Wformat-nonliteral -Wformat-security -Wmissing-declarations -Wmissing-prototypes -Wnested-externs -Wold-style-definition -Wpointer-arith -Wsign-compare -Wstrict-prototypes -Wundef -Wwrite-strings -Wno-packed-not-aligned -Wno-missing-field-initializers -D_GNU_SOURCE -fPIC -march=native -DALLOW_EXPERIMENTAL_API -DALLOW_INTERNAL_API -Wno-format-truncation -flax-vector-conversions -Wno-strict-aliasing -DRTE_LOG_DEFAULT_LOGTYPE=pmd.net.cnxk -MD -MQ drivers/libtmp_rte_net_cnxk.a.p/net_cnxk_cn10k_tx_mseg.c.o -MF drivers/libtmp_rte_net_cnxk.a.p/net_cnxk_cn10k_tx_mseg.c.o.d -o drivers/libtmp_rte_net_cnxk.a.p/net_cnxk_cn10k_tx_mseg.c.o -c ../drivers/net/cnxk/cn10k_tx_mseg.c
../drivers/net/cnxk/cn10k_tx_mseg.c:11:14: fatal error: opening dependency file drivers/libtmp_rte_net_cnxk.a.p/net_cnxk_cn10k_tx_mseg.c.o.d: No such file or directory
../drivers/net/cnxk/cn10k_tx.h:2933:1: note: in expansion of macro ‘T’
 T(sec_ts_tso_noff_vlan_ol3ol4csum_l3l4csum, 1, 1, 1, 1, 1, 1, 1, 8, \
 ^
../drivers/net/cnxk/cn10k_tx_mseg.c:25:1: note: in expansion of macro ‘NIX_TX_FASTPATH_MODES’
compilation terminated.
[1251/2996] Compiling C object drivers/libtmp_rte_net_cnxk.a.p/net_cnxk_cn9k_tx_mseg.c.o
FAILED: drivers/libtmp_rte_net_cnxk.a.p/net_cnxk_cn9k_tx_mseg.c.o 
gcc -Idrivers/libtmp_rte_net_cnxk.a.p -Idrivers -I../drivers -Idrivers/net/cnxk -I../drivers/net/cnxk -Ilib/ethdev -I../lib/ethdev -I. -I.. -Iconfig -I../config -Ilib/eal/include -I../lib/eal/include -Ilib/eal/linux/include -I../lib/eal/linux/include -Ilib/eal/x86/include -I../lib/eal/x86/include -Ilib/eal/common -I../lib/eal/common -Ilib/eal -I../lib/eal -Ilib/kvargs -I../lib/kvargs -Ilib/metrics -I../lib/metrics -Ilib/telemetry -I../lib/telemetry -Ilib/net -I../lib/net -Ilib/mbuf -I../lib/mbuf -Ilib/mempool -I../lib/mempool -Ilib/ring -I../lib/ring -Ilib/meter -I../lib/meter -Idrivers/bus/pci -I../drivers/bus/pci -I../drivers/bus/pci/linux -Ilib/pci -I../lib/pci -Idrivers/bus/vdev -I../drivers/bus/vdev -Ilib/cryptodev -I../lib/cryptodev -Ilib/rcu -I../lib/rcu -Ilib/eventdev -I../lib/eventdev -Ilib/hash -I../lib/hash -Ilib/timer -I../lib/timer -Ilib/security -I../lib/security -Idrivers/common/cnxk -I../drivers/common/cnxk -Idrivers/mempool/cnxk -I../drivers/mempool/cnxk -fdiagnostics-color=always -D_FILE_OFFSET_BITS=64 -Wall -Winvalid-pch -Werror -O3 -include rte_config.h -Wextra -Wcast-qual -Wdeprecated -Wformat -Wformat-nonliteral -Wformat-security -Wmissing-declarations -Wmissing-prototypes -Wnested-externs -Wold-style-definition -Wpointer-arith -Wsign-compare -Wstrict-prototypes -Wundef -Wwrite-strings -Wno-packed-not-aligned -Wno-missing-field-initializers -D_GNU_SOURCE -fPIC -march=native -DALLOW_EXPERIMENTAL_API -DALLOW_INTERNAL_API -Wno-format-truncation -flax-vector-conversions -Wno-strict-aliasing -DRTE_LOG_DEFAULT_LOGTYPE=pmd.net.cnxk -MD -MQ drivers/libtmp_rte_net_cnxk.a.p/net_cnxk_cn9k_tx_mseg.c.o -MF drivers/libtmp_rte_net_cnxk.a.p/net_cnxk_cn9k_tx_mseg.c.o.d -o drivers/libtmp_rte_net_cnxk.a.p/net_cnxk_cn9k_tx_mseg.c.o -c ../drivers/net/cnxk/cn9k_tx_mseg.c
../drivers/net/cnxk/cn9k_tx_mseg.c:11:20: fatal error: opening dependency file drivers/libtmp_rte_net_cnxk.a.p/net_cnxk_cn9k_tx_mseg.c.o.d: No such file or directory
../drivers/net/cnxk/cn9k_tx.h:2080:1: note: in expansion of macro ‘T’
 T(sec_ts_tso_noff_vlan_ol3ol4csum_l3l4csum, 1, 1, 1, 1, 1, 1, 1, 8, \
 ^
../drivers/net/cnxk/cn9k_tx_mseg.c:24:1: note: in expansion of macro ‘NIX_TX_FASTPATH_MODES’
compilation terminated.
ninja: build stopped




*Build Failed #4:
OS: SUSE15-64
Target: x86_64-native-linuxapp-clang
FAILED: drivers/libtmp_rte_common_cnxk.a.p/common_cnxk_roc_npc_utils.c.o 
clang -Idrivers/libtmp_rte_common_cnxk.a.p -Idrivers -I../drivers -Idrivers/common/cnxk -I../drivers/common/cnxk -Idrivers/bus/pci -I../drivers/bus/pci -Ilib/net -I../lib/net -Ilib/ethdev -I../lib/ethdev -Ilib/meter -I../lib/meter -I. -I.. -Iconfig -I../config -Ilib/eal/include -I../lib/eal/include -Ilib/eal/linux/include -I../lib/eal/linux/include -Ilib/eal/x86/include -I../lib/eal/x86/include -Ilib/eal/common -I../lib/eal/common -Ilib/eal -I../lib/eal -Ilib/kvargs -I../lib/kvargs -Ilib/metrics -I../lib/metrics -Ilib/telemetry -I../lib/telemetry -Ilib/pci -I../lib/pci -I../drivers/bus/pci/linux -Ilib/mbuf -I../lib/mbuf -Ilib/mempool -I../lib/mempool -Ilib/ring -I../lib/ring -Ilib/security -I../lib/security -Ilib/cryptodev -I../lib/cryptodev -Ilib/rcu -I../lib/rcu -Xclang -fcolor-diagnostics -pipe -D_FILE_OFFSET_BITS=64 -Wall -Winvalid-pch -Werror -O3 -include rte_config.h -Wextra -Wcast-qual -Wdeprecated -Wformat -Wformat-nonliteral -Wformat-security -Wmissing-declarations -Wmissing-prototypes -Wnested-externs -Wold-style-definition -Wpointer-arith -Wsign-compare -Wstrict-prototypes -Wundef -Wwrite-strings -Wno-address-of-packed-member -Wno-missing-field-initializers -D_GNU_SOURCE -fPIC -march=native -DALLOW_EXPERIMENTAL_API -DALLOW_INTERNAL_API -DRTE_LOG_DEFAULT_LOGTYPE=pmd.common.cnxk -MD -MQ drivers/libtmp_rte_common_cnxk.a.p/common_cnxk_roc_npc_utils.c.o -MF drivers/libtmp_rte_common_cnxk.a.p/common_cnxk_roc_npc_utils.c.o.d -o drivers/libtmp_rte_common_cnxk.a.p/common_cnxk_roc_npc_utils.c.o -c ../drivers/common/cnxk/roc_npc_utils.c
clang-9.0: error: no such file or directory: '../drivers/common/cnxk/roc_npc_utils.c'
clang-9.0: error: no input files
[770/3068] Compiling C object drivers/libtmp_rte_common_cnxk.a.p/common_cnxk_roc_npc_parse.c.o
FAILED: drivers/libtmp_rte_common_cnxk.a.p/common_cnxk_roc_npc_parse.c.o 
clang -Idrivers/libtmp_rte_common_cnxk.a.p -Idrivers -I../drivers -Idrivers/common/cnxk -I../drivers/common/cnxk -Idrivers/bus/pci -I../drivers/bus/pci -Ilib/net -I../lib/net -Ilib/ethdev -I../lib/ethdev -Ilib/meter -I../lib/meter -I. -I.. -Iconfig -I../config -Ilib/eal/include -I../lib/eal/include -Ilib/eal/linux/include -I../lib/eal/linux/include -Ilib/eal/x86/include -I../lib/eal/x86/include -Ilib/eal/common -I../lib/eal/common -Ilib/eal -I../lib/eal -Ilib/kvargs -I../lib/kvargs -Ilib/metrics -I../lib/metrics -Ilib/telemetry -I../lib/telemetry -Ilib/pci -I../lib/pci -I../drivers/bus/pci/linux -Ilib/mbuf -I../lib/mbuf -Ilib/mempool -I../lib/mempool -Ilib/ring -I../lib/ring -Ilib/security -I../lib/security -Ilib/cryptodev -I../lib/cryptodev -Ilib/rcu -I../lib/rcu -Xclang -fcolor-diagnostics -pipe -D_FILE_OFFSET_BITS=64 -Wall -Winvalid-pch -Werror -O3 -include rte_config.h -Wextra -Wcast-qual -Wdeprecated -Wformat -Wformat-nonliteral -Wformat-security -Wmissing-declarations -Wmissing-prototypes -Wnested-externs -Wold-style-definition -Wpointer-arith -Wsign-compare -Wstrict-prototypes -Wundef -Wwrite-strings -Wno-address-of-packed-member -Wno-missing-field-initializers -D_GNU_SOURCE -fPIC -march=native -DALLOW_EXPERIMENTAL_API -DALLOW_INTERNAL_API -DRTE_LOG_DEFAULT_LOGTYPE=pmd.common.cnxk -MD -MQ drivers/libtmp_rte_common_cnxk.a.p/common_cnxk_roc_npc_parse.c.o -MF drivers/libtmp_rte_common_cnxk.a.p/common_cnxk_roc_npc_parse.c.o.d -o drivers/libtmp_rte_common_cnxk.a.p/common_cnxk_roc_npc_parse.c.o -c ../drivers/common/cnxk/roc_npc_parse.c
In file included from ../drivers/common/cnxk/roc_npc_parse.c:4:
In file included from ../drivers/common/cnxk/roc_api.h:25:
In file included from ../drivers/common/cnxk/roc_platform.h:9:
In file included from ../lib/eal/include/rte_bitmap.h:42:
In file included from ../lib/eal/include/rte_memory.h:25:
In file included from ../lib/eal/include/rte_fbarray.h:40:
In file included from ../lib/eal/x86/include/rte_rwlock.h:12:
In file included from ../lib/eal/include/generic/rte_rwlock.h:25:
../lib/eal/x86/include/rte_atomic.h:16:10: fatal error: 'generic/rte_atomic.h' file not found
#include "generic/rte_atomic.h"
         ^~~~~~~~~~~~~~~~~~~~~~
1 error generated.
[771/3068] Compiling C object drivers/libtmp_rte_common_cnxk.a.p/common_cnxk_roc_platform.c.o
[772/3068] Compiling C object drivers/libtmp_rte_common_cnxk.a.p/common_cnxk_roc_npc_mcam_dump.c.o
FAILED: drivers/libtmp_rte_common_cnxk.a.p/common_cnxk_roc_npc_mcam_dump.c.o 
clang -Idrivers/libtmp_rte_common_cnxk.a.p -Idrivers -I../drivers -Idrivers/common/cnxk -I../drivers/common/cnxk -Idrivers/bus/pci -I../drivers/bus/pci -Ilib/net -I../lib/net -Ilib/ethdev -I../lib/ethdev -Ilib/meter -I../lib/meter -I. -I.. -Iconfig -I../config -Ilib/eal/include -I../lib/eal/include -Ilib/eal/linux/include -I../lib/eal/linux/include -Ilib/eal/x86/include -I../lib/eal/x86/include -Ilib/eal/common -I../lib/eal/common -Ilib/eal -I../lib/eal -Ilib/kvargs -I../lib/kvargs -Ilib/metrics -I../lib/metrics -Ilib/telemetry -I../lib/telemetry -Ilib/pci -I../lib/pci -I../drivers/bus/pci/linux -Ilib/mbuf -I../lib/mbuf -Ilib/mempool -I../lib/mempool -Ilib/ring -I../lib/ring -Ilib/security -I../lib/security -Ilib/cryptodev -I../lib/cryptodev -Ilib/rcu -I../lib/rcu -Xclang -fcolor-diagnostics -pipe -D_FILE_OFFSET_BITS=64 -Wall -Winvalid-pch -Werror -O3 -include rte_config.h -Wextra -Wcast-qual -Wdeprecated -Wformat -Wformat-nonliteral -Wformat-security -Wmissing-declarations -Wmissing-prototypes -Wnested-externs -Wold-style-definition -Wpointer-arith -Wsign-compare -Wstrict-prototypes -Wundef -Wwrite-strings -Wno-address-of-packed-member -Wno-missing-field-initializers -D_GNU_SOURCE -fPIC -march=native -DALLOW_EXPERIMENTAL_API -DALLOW_INTERNAL_API -DRTE_LOG_DEFAULT_LOGTYPE=pmd.common.cnxk -MD -MQ drivers/libtmp_rte_common_cnxk.a.p/common_cnxk_roc_npc_mcam_dump.c.o -MF drivers/libtmp_rte_common_cnxk.a.p/common_cnxk_roc_npc_mcam_dump.c.o.d -o drivers/libtmp_rte_common_cnxk.a.p/common_cnxk_roc_npc_mcam_dump.c.o -c ../drivers/common/cnxk/roc_npc_mcam_dump.c
In file included from ../drivers/common/cnxk/roc_npc_mcam_dump.c:5:
In file included from ../drivers/common/cnxk/roc_api.h:25:
In file included from ../drivers/common/cnxk/roc_platform.h:10:
In file included from ../drivers/bus/pci/rte_bus_pci.h:26:
../lib/eal/include/rte_interrupts.h:35:10: fatal error: 'rte_eal_interrupts.h' file not found
#include "rte_eal_interrupts.h"
         ^~~~~~~~~~~~~~~~~~~~~~
1 error generated.
[773/3068] Compiling C object drivers/libtmp_rte_common_cnxk.a.p/common_cnxk_roc_nix_queue.c.o
[774/3068] Compiling C object drivers/libtmp_rte_common_cnxk.a.p/common_cnxk_roc_npc_mcam.c.o
[775/3068] Compiling C object drivers/libtmp_rte_common_cnxk.a.p/common_cnxk_roc_npc.c.o
[776/3068] Generating rte_bus_dpaa.sym_chk with a custom command (wrapped by meson to capture output)
FAILED: drivers/rte_bus_dpaa.sym_chk 
/usr/bin/meson --internal exe --capture drivers/rte_bus_dpaa.sym_chk -- /root/SUSE15-64_K5.3.18_Clang9.0.1/x86_64-native-linuxapp-clang/506f606f3ab6446786cf88da564f1b7c/dpdk/buildtools/check-symbols.sh /root/SUSE15-64_K5.3.18_Clang9.0.1/x86_64-native-linuxapp-clang/506f606f3ab6446786cf88da564f1b7c/dpdk/drivers/bus/dpaa/version.map drivers/librte_bus_dpaa.a
cat: /root/SUSE15-64_K5.3.18_Clang9.0.1/x86_64-native-linuxapp-clang/506f606f3ab6446786cf88da564f1b7c/dpdk/drivers/bus/dpaa/version.map: No such file or directory
fman_if_add_mac_addr is flagged as internal
but is not listed in version map
Please add fman_if_add_mac_addr to the version map
cat: /root/SUSE15-64_K5.3.18_Clang9.0.1/x86_64-native-linuxapp-clang/506f606f3ab6446786cf88da564f1b7c/dpdk/drivers/bus/dpaa/version.map: No such file or directory
fman_if_clear_mac_addr is flagged as internal
but is not listed in version map
Please add fman_if_clear_mac_addr to the version map
cat: /root/SUSE15-64_K5.3.18_Clang9.0.1/x86_64-native-linuxapp-clang/506f606f3ab6446786cf88da564f1b7c/dpdk/drivers/bus/dpaa/version.map: No such file or directory
fman_if_disable_rx is flagged as internal
but is not listed in version map
Please add fman_if_disable_rx to the version map
cat: /root/SUSE15-64_K5.3.18_Clang9.0.1/x86_64-native-linuxapp-clang/506f606f3ab6446786cf88da564f1b7c/dpdk/drivers/bus/dpaa/version.map: No such file or directory
fman_if_discard_rx_errors is flagged as internal
but is not listed in version map
Please add fman_if_discard_rx_errors to the version map
cat: /root/SUSE15-64_K5.3.18_Clang9.0.1/x86_64-native-linuxapp-clang/506f606f3ab6446786cf88da564f1b7c/dpdk/drivers/bus/dpaa/version.map: No such file or directory
fman_if_enable_rx is flagged as internal
but is not listed in version map
Please add fman_if_enable_rx to the version map
cat: /root/SUSE15-64_K5.3.18_Clang9.0.1/x86_64-native-linuxapp-clang/506f606f3ab6446786cf88da564f1b7c/dpdk/drivers/bus/dpaa/version.map: No such file or directory
fman_if_get_fc_quanta is flagged as internal
but is not listed in version map
Please add fman_if_get_fc_quanta to the version map
cat: /root/SUSE15-64_K5.3.18_Clang9.0.1/x86_64-native-linuxapp-clang/506f606f3ab6446786cf88da564f1b7c/dpdk/drivers/bus/dpaa/version.map: No such file or directory
fman_if_get_fc_threshold is flagged as internal
but is not listed in version map
Please add fman_if_get_fc_threshold to the version map
/root/SUSE15-64_K5.3.18_Clang9.0.1/x86_64-native-linuxapp-clang/506f606f3ab6446786cf88da564f1b7c/dpdk/buildtools/check-symbols.sh: line 86: /root/SUSE15-64_K5.3.18_Clang9.0.1/x86_64-native-linuxapp-clang/506f606f3ab6446786cf88da564f1b7c/dpdk/buildtools/map-list-symbol.sh: No such file or directory
fman_if_get_fdoff is flagged as internal
but is not listed in version map
Please add fman_if_get_fdoff to the version map
/root/SUSE15-64_K5.3.18_Clang9.0.1/x86_64-native-linuxapp-clang/506f606f3ab6446786cf88da564f1b7c/dpdk/buildtools/check-symbols.sh: line 86: /root/SUSE15-64_K5.3.18_Clang9.0.1/x86_64-native-linuxapp-clang/506f606f3ab6446786cf88da564f1b7c/dpdk/buildtools/map-list-symbol.sh: No such file or directory
fman_if_get_maxfrm is flagged as internal
but is not listed in version map
Please add fman_if_get_maxfrm to the version map
/root/SUSE15-64_K5.3.18_Clang9.0.1/x86_64-native-linuxapp-clang/506f606f3ab6446786cf88da564f1b7c/dpdk/buildtools/check-symbols.sh: line 86: /root/SUSE15-64_K5.3.18_Clang9.0.1/x86_64-native-linuxapp-clang/506f606f3ab6446786cf88da564f1b7c/dpdk/buildtools/map-list-symbol.sh: No such file or directory
fman_if_get_sg_enable is flagged as internal
but is not listed in version map
Please add fman_if_get_sg_enable to the version map
/root/SUSE15-64_K5.3.18_Clang9.0.1/x86_64-native-linuxapp-clang/506f606f3ab6446786cf88da564f1b7c/dpdk/buildtools/check-symbols.sh: line 86: /root/SUSE15-64_K5.3.18_Clang9.0.1/x86_64-native-linuxapp-clang/506f606f3ab6446786cf88da564f1b7c/dpdk/buildtools/map-list-symbol.sh: No such file or directory
fman_if_loopback_disable is flagged as internal
but is not listed in version map
Please add fman_if_loopback_disable to the version map
/root/SUSE15-64_K5.3.18_Clang9.0.1/x86_64-native-linuxapp-clang/506f606f3ab6446786cf88da564f1b7c/dpdk/buildtools/check-symbols.sh: line 86: /root/SUSE15-64_K5.3.18_Clang9.0.1/x86_64-native-linuxapp-clang/506f606f3ab6446786cf88da564f1b7c/dpdk/buildtools/map-list-symbol.sh: No such file or directory
fman_if_loopback_enable is flagged as internal
but is not listed in version map
Please add fman_if_loopback_enable to the version map
/root/SUSE15-64_K5.3.18_Clang9.0.1/x86_64-native-linuxapp-clang/506f606f3ab6446786cf88da564f1b7c/dpdk/buildtools/check-symbols.sh: line 86: /root/SUSE15-64_K5.3.18_Clang9.0.1/x86_64-native-linuxapp-clang/506f606f3ab6446786cf88da564f1b7c/dpdk/buildtools/map-list-symbol.sh: No such file or directory
fman_if_promiscuous_disable is flagged as internal
but is not listed in version map
Please add fman_if_promiscuous_disable to the version map
/root/SUSE15-64_K5.3.18_Clang9.0.1/x86_64-native-linuxapp-clang/506f606f3ab6446786cf88da564f1b7c/dpdk/buildtools/check-symbols.sh: line 86: /root/SUSE15-64_K5.3.18_Clang9.0.1/x86_64-native-linuxapp-clang/506f606f3ab6446786cf88da564f1b7c/dpdk/buildtools/map-list-symbol.sh: No such file or directory
fman_if_promiscuous_enable is flagged as internal
but is not listed in version map
Please add fman_if_promiscuous_enable to the version map
/root/SUSE15-64_K5.3.18_Clang9.0.1/x86_64-native-linuxapp-clang/506f606f3ab6446786cf88da564f1b7c/dpdk/buildtools/check-symbols.sh: line 86: /root/SUSE15-64_K5.3.18_Clang9.0.1/x86_64-native-linuxapp-clang/506f606f3ab6446786cf88da564f1b7c/dpdk/buildtools/map-list-symbol.sh: No such file or directory
fman_if_receive_rx_errors is flagged as internal
but is not listed in version map
Please add fman_if_receive_rx_errors to the version map
/root/SUSE15-64_K5.3.18_Clang9.0.1/x86_64-native-linuxapp-clang/506f606f3ab6446786cf88da564f1b7c/dpdk/buildtools/check-symbols.sh: line 86: /root/SUSE15-64_K5.3.18_Clang9.0.1/x86_64-native-linuxapp-clang/506f606f3ab6446786cf88da564f1b7c/dpdk/buildtools/map-list-symbol.sh: No such file or directory
fman_if_reset_mcast_filter_table is flagged as internal
but is not listed in version map
Please add fman_if_reset_mcast_filter_table to the version map
/root/SUSE15-64_K5.3.18_Clang9.0.1/x86_64-native-linuxapp-clang/506f606f3ab6446786cf88da564f1b7c/dpdk/buildtools/check-symbols.sh: line 86: /root/SUSE15-64_K5.3.18_Clang9.0.1/x86_64-native-linuxapp-clang/506f606f3ab6446786cf88da564f1b7c/dpdk/buildtools/map-list-symbol.sh: No such file or directory
fman_if_set_bp is flagged as internal
but is not listed in version map
Please add fman_if_set_bp to the version map
/root/SUSE15-64_K5.3.18_Clang9.0.1/x86_64-native-linuxapp-clang/506f606f3ab6446786cf88da564f1b7c/dpdk/buildtools/check-symbols.sh: line 86: /root/SUSE15-64_K5.3.18_Clang9.0.1/x86_64-native-linuxapp-clang/506f606f3ab6446786cf88da564f1b7c/dpdk/buildtools/map-list-symbol.sh: No such file or directory
fman_if_set_err_fqid is flagged as internal
but is not listed in version map
Please add fman_if_set_err_fqid to the version map
/root/SUSE15-64_K5.3.18_Clang9.0.1/x86_64-native-linuxapp-clang/506f606f3ab6446786cf88da564f1b7c/dpdk/buildtools/check-symbols.sh: line 86: /root/SUSE15-64_K5.3.18_Clang9.0.1/x86_64-native-linuxapp-clang/506f606f3ab6446786cf88da564f1b7c/dpdk/buildtools/map-list-symbol.sh: No such file or directory
fman_if_set_fc_quanta is flagged as internal
but is not listed in version map
Please add fman_if_set_fc_quanta to the version map
/root/SUSE15-64_K5.3.18_Clang9.0.1/x86_64-native-linuxapp-clang/506f606f3ab6446786cf88da564f1b7c/dpdk/buildtools/check-symbols.sh: line 86: /root/SUSE15-64_K5.3.18_Clang9.0.1/x86_64-native-linuxapp-clang/506f606f3ab6446786cf88da564f1b7c/dpdk/buildtools/map-list-symbol.sh: No such file or directory
fman_if_set_fc_threshold is flagged as internal
but is not listed in version map
Please add fman_if_set_fc_threshold to the version map
/root/SUSE15-64_K5.3.18_Clang9.0.1/x86_64-native-linuxapp-clang/506f606f3ab6446786cf88da564f1b7c/dpdk/buildtools/check-symbols.sh: line 86: /root/SUSE15-64_K5.3.18_Clang9.0.1/x86_64-native-linuxapp-clang/506f606f3ab6446786cf88da564f1b7c/dpdk/buildtools/map-list-symbol.sh: No such file or directory
fman_if_set_fdoff is flagged as internal
but is not listed in version map
Please add fman_if_set_fdoff to the version map
/root/SUSE15-64_K5.3.18_Clang9.0.1/x86_64-native-linuxapp-clang/506f606f3ab6446786cf88da564f1b7c/dpdk/buildtools/check-symbols.sh: line 86: /root/SUSE15-64_K5.3.18_Clang9.0.1/x86_64-native-linuxapp-clang/506f606f3ab6446786cf88da564f1b7c/dpdk/buildtools/map-list-symbol.sh: No such file or directory
fman_if_set_ic_params is flagged as internal
but is not listed in version map
Please add fman_if_set_ic_params to the version map
/root/SUSE15-64_K5.3.18_Clang9.0.1/x86_64-native-linuxapp-clang/506f606f3ab6446786cf88da564f1b7c/dpdk/buildtools/check-symbols.sh: line 86: /root/SUSE15-64_K5.3.18_Clang9.0.1/x86_64-native-linuxapp-clang/506f606f3ab6446786cf88da564f1b7c/dpdk/buildtools/map-list-symbol.sh: No such file or directory
fman_if_set_maxfrm is flagged as internal
but is not listed in version map
Please add fman_if_set_maxfrm to the version map
/root/SUSE15-64_K5.3.18_Clang9.0.1/x86_64-native-linuxapp-clang/506f606f3ab6446786cf88da564f1b7c/dpdk/buildtools/check-symbols.sh: line 86: /root/SUSE15-64_K5.3.18_Clang9.0.1/x86_64-native-linuxapp-clang/506f606f3ab6446786cf88da564f1b7c/dpdk/buildtools/map-list-symbol.sh: No such file or directory
fman_if_set_mcast_filter_table is flagged as internal
but is not listed in version map
Please add fman_if_set_mcast_filter_table to the version map
/root/SUSE15-64_K5.3.18_Clang9.0.1/x86_64-native-linuxapp-clang/506f606f3ab6446786cf88da564f1b7c/dpdk/buildtools/check-symbols.sh: line 86: /root/SUSE15-64_K5.3.18_Clang9.0.1/x86_64-native-linuxapp-clang/506f606f3ab6446786cf88da564f1b7c/dpdk/buildtools/map-list-symbol.sh: No such file or directory
fman_if_set_sg is flagged as internal
but is not listed in version map
Please add fman_if_set_sg to the version map
/root/SUSE15-64_K5.3.18_Clang9.0.1/x86_64-native-linuxapp-clang/506f606f3ab6446786cf88da564f1b7c/dpdk/buildtools/check-symbols.sh: line 86: /root/SUSE15-64_K5.3.18_Clang9.0.1/x86_64-native-linuxapp-clang/506f606f3ab6446786cf88da564f1b7c/dpdk/buildtools/map-list-symbol.sh: No such file or directory
fman_if_stats_get is flagged as internal
but is not listed in version map
Please add fman_if_stats_get to the version map
/root/SUSE15-64_K5.3.18_Clang9.0.1/x86_64-native-linuxapp-clang/506f606f3ab6446786cf88da564f1b7c/dpdk/buildtools/check-symbols.sh: line 86: /root/SUSE15-64_K5.3.18_Clang9.0.1/x86_64-native-linuxapp-clang/506f606f3ab6446786cf88da564f1b7c/dpdk/buildtools/map-list-symbol.sh: No such file or directory
fman_if_stats_get_all is flagged as internal
but is not listed in version map
Please add fman_if_stats_get_all to the version map
/root/SUSE15-64_K5.3.18_Clang9.0.1/x86_64-native-linuxapp-clang/506f606f3ab6446786cf88da564f1b7c/dpdk/buildtools/check-symbols.sh: line 86: /root/SUSE15-64_K5.3.18_Clang9.0.1/x86_64-native-linuxapp-clang/506f606f3ab6446786cf88da564f1b7c/dpdk/buildtools/map-list-symbol.sh: No such file or directory
fman_if_stats_reset is flagged as internal
but is not listed in version map
Please add fman_if_stats_reset to the version map
/root/SUSE15-64_K5.3.18_Clang9.0.1/x86_64-native-linuxapp-clang/506f606f3ab6446786cf88da564f1b7c/dpdk/buildtools/check-symbols.sh: line 86: /root/SUSE15-64_K5.3.18_Clang9.0.1/x86_64-native-linuxapp-clang/506f606f3ab6446786cf88da564f1b7c/dpdk/buildtools/map-list-symbol.sh: No such file or directory
netcfg_acquire is flagged as internal
but is not listed in version map
Please add netcfg_acquire to the version map
/root/SUSE15-64_K5.3.18_Clang9.0.1/x86_64-native-linuxapp-clang/506f606f3ab6446786cf88da564f1b7c/dpdk/buildtools/check-symbols.sh: line 86: /root/SUSE15-64_K5.3.18_Clang9.0.1/x86_64-native-linuxapp-clang/506f606f3ab6446786cf88da564f1b7c/dpdk/buildtools/map-list-symbol.sh: No such file or directory
netcfg_release is flagged as internal
but is not listed in version map
Please add netcfg_release to the version map
/root/SUSE15-64_K5.3.18_Clang9.0.1/x86_64-native-linuxapp-clang/506f606f3ab6446786cf88da564f1b7c/dpdk/buildtools/check-symbols.sh: line 86: /root/SUSE15-64_K5.3.18_Clang9.0.1/x86_64-native-linuxapp-clang/506f606f3ab6446786cf88da564f1b7c/dpdk/buildtools/map-list-symbol.sh: No such file or directory
bman_acquire is flagged as internal
but is not listed in version map
Please add bman_acquire to the version map
/root/SUSE15-64_K5.3.18_Clang9.0.1/x86_64-native-linuxapp-clang/506f606f3ab6446786cf88da564f1b7c/dpdk/buildtools/check-symbols.sh: line 86: /root/SUSE15-64_K5.3.18_Clang9.0.1/x86_64-native-linuxapp-clang/506f606f3ab6446786cf88da564f1b7c/dpdk/buildtools/map-list-symbol.sh: No such file or directory
bman_free_pool is flagged as internal
but is not listed in version map
Please add bman_free_pool to the version map
/root/SUSE15-64_K5.3.18_Clang9.0.1/x86_64-native-linuxapp-clang/506f606f3ab6446786cf88da564f1b7c/dpdk/buildtools/check-symbols.sh: line 86: /root/SUSE15-64_K5.3.18_Clang9.0.1/x86_64-native-linuxapp-clang/506f606f3ab6446786cf88da564f1b7c/dpdk/buildtools/map-list-symbol.sh: No such file or directory
bman_get_params is flagged as internal
but is not listed in version map
Please add bman_get_params to the version map
/root/SUSE15-64_K5.3.18_Clang9.0.1/x86_64-native-linuxapp-clang/506f606f3ab6446786cf88da564f1b7c/dpdk/buildtools/check-symbols.sh: line 86: /root/SUSE15-64_K5.3.18_Clang9.0.1/x86_64-native-linuxapp-clang/506f606f3ab6446786cf88da564f1b7c/dpdk/buildtools/map-list-symbol.sh: No such file or directory
bman_new_pool is flagged as internal
but is not listed in version map
Please add bman_new_pool to the version map
/root/SUSE15-64_K5.3.18_Clang9.0.1/x86_64-native-linuxapp-clang/506f606f3ab6446786cf88da564f1b7c/dpdk/buildtools/check-symbols.sh: line 86: /root/SUSE15-64_K5.3.18_Clang9.0.1/x86_64-native-linuxapp-clang/506f606f3ab6446786cf88da564f1b7c/dpdk/buildtools/map-list-symbol.sh: No such file or directory
bman_query_free_buffers is flagged as internal
but is not listed in version map
Please add bman_query_free_buffers to the version map
/root/SUSE15-64_K5.3.18_Clang9.0.1/x86_64-native-linuxapp-clang/506f606f3ab6446786cf88da564f1b7c/dpdk/buildtools/check-symbols.sh: line 86: /root/SUSE15-64_K5.3.18_Clang9.0.1/x86_64-native-linuxapp-clang/506f606f3ab6446786cf88da564f1b7c/dpdk/buildtools/map-list-symbol.sh: No such file or directory
bman_release is flagged as internal
but is not listed in version map
Please add bman_release to the version map
/root/SUSE15-64_K5.3.18_Clang9.0.1/x86_64-native-linuxapp-clang/506f606f3ab6446786cf88da564f1b7c/dpdk/buildtools/check-symbols.sh: line 86: /root/SUSE15-64_K5.3.18_Clang9.0.1/x86_64-native-linuxapp-clang/506f606f3ab6446786cf88da564f1b7c/dpdk/buildtools/map-list-symbol.sh: No such file or directory
bman_thread_irq is flagged as internal
but is not listed in version map
Please add bman_thread_irq to the version map
/root/SUSE15-64_K5.3.18_Clang9.0.1/x86_64-native-linuxapp-clang/506f606f3ab6446786cf88da564f1b7c/dpdk/buildtools/check-symbols.sh: line 86: /root/SUSE15-64_K5.3.18_Clang9.0.1/x86_64-native-linuxapp-clang/506f606f3ab6446786cf88da564f1b7c/dpdk/buildtools/map-list-symbol.sh: No such file or directory
qman_alloc_cgrid_range is flagged as internal
but is not listed in version map
Please add qman_alloc_cgrid_range to the version map
/root/SUSE15-64_K5.3.18_Clang9.0.1/x86_64-native-linuxapp-clang/506f606f3ab6446786cf88da564f1b7c/dpdk/buildtools/check-symbols.sh: line 86: /root/SUSE15-64_K5.3.18_Clang9.0.1/x86_64-native-linuxapp-clang/506f606f3ab6446786cf88da564f1b7c/dpdk/buildtools/map-list-symbol.sh: No such file or directory
qman_alloc_fqid_range is flagged as internal
but is not listed in version map
Please add qman_alloc_fqid_range to the version map
/root/SUSE15-64_K5.3.18_Clang9.0.1/x86_64-native-linuxapp-clang/506f606f3ab6446786cf88da564f1b7c/dpdk/buildtools/check-symbols.sh: line 86: /root/SUSE15-64_K5.3.18_Clang9.0.1/x86_64-native-linuxapp-clang/506f606f3ab6446786cf88da564f1b7c/dpdk/buildtools/map-list-symbol.sh: No such file or directory
qman_alloc_pool_range is flagged as internal
but is not listed in version map
Please add qman_alloc_pool_range to the version map
/root/SUSE15-64_K5.3.18_Clang9.0.1/x86_64-native-linuxapp-clang/506f606f3ab6446786cf88da564f1b7c/dpdk/buildtools/check-symbols.sh: line 86: /root/SUSE15-64_K5.3.18_Clang9.0.1/x86_64-native-linuxapp-clang/506f606f3ab6446786cf88da564f1b7c/dpdk/buildtools/map-list-symbol.sh: No such file or directory
qman_release_cgrid_range is flagged as internal
but is not listed in version map
Please add qman_release_cgrid_range to the version map
/root/SUSE15-64_K5.3.18_Clang9.0.1/x86_64-native-linuxapp-clang/506f606f3ab6446786cf88da564f1b7c/dpdk/buildtools/check-symbols.sh: line 86: /root/SUSE15-64_K5.3.18_Clang9.0.1/x86_64-native-linuxapp-clang/506f606f3ab6446786cf88da564f1b7c/dpdk/buildtools/map-list-symbol.sh: No such file or directory
qman_reserve_fqid_range is flagged as internal
but is not listed in version map
Please add qman_reserve_fqid_range to the version map
/root/SUSE15-64_K5.3.18_Clang9.0.1/x86_64-native-linuxapp-clang/506f606f3ab6446786cf88da564f1b7c/dpdk/buildtools/check-symbols.sh: line 86: /root/SUSE15-64_K5.3.18_Clang9.0.1/x86_64-native-linuxapp-clang/506f606f3ab6446786cf88da564f1b7c/dpdk/buildtools/map-list-symbol.sh: No such file or directory
dpaa_get_ioctl_version_number is flagged as internal
but is not listed in version map
Please add dpaa_get_ioctl_version_number to the version map
/root/SUSE15-64_K5.3.18_Clang9.0.1/x86_64-native-linuxapp-clang/506f606f3ab6446786cf88da564f1b7c/dpdk/buildtools/check-symbols.sh: line 86: /root/SUSE15-64_K5.3.18_Clang9.0.1/x86_64-native-linuxapp-clang/506f606f3ab6446786cf88da564f1b7c/dpdk/buildtools/map-list-symbol.sh: No such file or directory
dpaa_get_link_status is flagged as internal
but is not listed in version map
Please add dpaa_get_link_status to the version map
/root/SUSE15-64_K5.3.18_Clang9.0.1/x86_64-native-linuxapp-clang/506f606f3ab6446786cf88da564f1b7c/dpdk/buildtools/check-symbols.sh: line 86: /root/SUSE15-64_K5.3.18_Clang9.0.1/x86_64-native-linuxapp-clang/506f606f3ab6446786cf88da564f1b7c/dpdk/buildtools/map-list-symbol.sh: No such file or directory
dpaa_intr_disable is flagged as internal
but is not listed in version map
Please add dpaa_intr_disable to the version map
/root/SUSE15-64_K5.3.18_Clang9.0.1/x86_64-native-linuxapp-clang/506f606f3ab6446786cf88da564f1b7c/dpdk/buildtools/check-symbols.sh: line 86: /root/SUSE15-64_K5.3.18_Clang9.0.1/x86_64-native-linuxapp-clang/506f606f3ab6446786cf88da564f1b7c/dpdk/buildtools/map-list-symbol.sh: No such file or directory
dpaa_intr_enable is flagged as internal
but is not listed in version map
Please add dpaa_intr_enable to the version map
/root/SUSE15-64_K5.3.18_Clang9.0.1/x86_64-native-linuxapp-clang/506f606f3ab6446786cf88da564f1b7c/dpdk/buildtools/check-symbols.sh: line 86: /root/SUSE15-64_K5.3.18_Clang9.0.1/x86_64-native-linuxapp-clang/506f606f3ab6446786cf88da564f1b7c/dpdk/buildtools/map-list-symbol.sh: No such file or directory
dpaa_restart_link_autoneg is flagged as internal
but is not listed in version map
Please add dpaa_restart_link_autoneg to the version map
/root/SUSE15-64_K5.3.18_Clang9.0.1/x86_64-native-linuxapp-clang/506f606f3ab6446786cf88da564f1b7c/dpdk/buildtools/check-symbols.sh: line 86: /root/SUSE15-64_K5.3.18_Clang9.0.1/x86_64-native-linuxapp-clang/506f606f3ab6446786cf88da564f1b7c/dpdk/buildtools/map-list-symbol.sh: No such file or directory
dpaa_update_link_speed is flagged as internal
but is not listed in version map
Please add dpaa_update_link_speed to the version map
/root/SUSE15-64_K5.3.18_Clang9.0.1/x86_64-native-linuxapp-clang/506f606f3ab6446786cf88da564f1b7c/dpdk/buildtools/check-symbols.sh: line 86: /root/SUSE15-64_K5.3.18_Clang9.0.1/x86_64-native-linuxapp-clang/506f606f3ab6446786cf88da564f1b7c/dpdk/buildtools/map-list-symbol.sh: No such file or directory
dpaa_update_link_status is flagged as internal
but is not listed in version map
Please add dpaa_update_link_status to the version map
/root/SUSE15-64_K5.3.18_Clang9.0.1/x86_64-native-linuxapp-clang/506f606f3ab6446786cf88da564f1b7c/dpdk/buildtools/check-symbols.sh: line 86: /root/SUSE15-64_K5.3.18_Clang9.0.1/x86_64-native-linuxapp-clang/506f606f3ab6446786cf88da564f1b7c/dpdk/buildtools/map-list-symbol.sh: No such file or directory
qman_clear_irq is flagged as internal
but is not listed in version map
Please add qman_clear_irq to the version map
/root/SUSE15-64_K5.3.18_Clang9.0.1/x86_64-native-linuxapp-clang/506f606f3ab6446786cf88da564f1b7c/dpdk/buildtools/check-symbols.sh: line 86: /root/SUSE15-64_K5.3.18_Clang9.0.1/x86_64-native-linuxapp-clang/506f606f3ab6446786cf88da564f1b7c/dpdk/buildtools/map-list-symbol.sh: No such file or directory
qman_create_cgr is flagged as internal
but is not listed in version map
Please add qman_create_cgr to the version map
/root/SUSE15-64_K5.3.18_Clang9.0.1/x86_64-native-linuxapp-clang/506f606f3ab6446786cf88da564f1b7c/dpdk/buildtools/check-symbols.sh: line 86: /root/SUSE15-64_K5.3.18_Clang9.0.1/x86_64-native-linuxapp-clang/506f606f3ab6446786cf88da564f1b7c/dpdk/buildtools/map-list-symbol.sh: No such file or directory
qman_create_fq is flagged as internal
but is not listed in version map
Please add qman_create_fq to the version map
/root/SUSE15-64_K5.3.18_Clang9.0.1/x86_64-native-linuxapp-clang/506f606f3ab6446786cf88da564f1b7c/dpdk/buildtools/check-symbols.sh: line 86: /root/SUSE15-64_K5.3.18_Clang9.0.1/x86_64-native-linuxapp-clang/506f606f3ab6446786cf88da564f1b7c/dpdk/buildtools/map-list-symbol.sh: No such file or directory
qman_dca_index is flagged as internal
but is not listed in version map
Please add qman_dca_index to the version map
/root/SUSE15-64_K5.3.18_Clang9.0.1/x86_64-native-linuxapp-clang/506f606f3ab6446786cf88da564f1b7c/dpdk/buildtools/check-symbols.sh: line 86: /root/SUSE15-64_K5.3.18_Clang9.0.1/x86_64-native-linuxapp-clang/506f606f3ab6446786cf88da564f1b7c/dpdk/buildtools/map-list-symbol.sh: No such file or directory
qman_delete_cgr is flagged as internal
but is not listed in version map
Please add qman_delete_cgr to the version map
/root/SUSE15-64_K5.3.18_Clang9.0.1/x86_64-native-linuxapp-clang/506f606f3ab6446786cf88da564f1b7c/dpdk/buildtools/check-symbols.sh: line 86: /root/SUSE15-64_K5.3.18_Clang9.0.1/x86_64-native-linuxapp-clang/506f606f3ab6446786cf88da564f1b7c/dpdk/buildtools/map-list-symbol.sh: No such file or directory
qman_dequeue is flagged as internal
but is not listed in version map
Please add qman_dequeue to the version map
/root/SUSE15-64_K5.3.18_Clang9.0.1/x86_64-native-linuxapp-clang/506f606f3ab6446786cf88da564f1b7c/dpdk/buildtools/check-symbols.sh: line 86: /root/SUSE15-64_K5.3.18_Clang9.0.1/x86_64-native-linuxapp-clang/506f606f3ab6446786cf88da564f1b7c/dpdk/buildtools/map-list-symbol.sh: No such file or directory
qman_dqrr_consume is flagged as internal
but is not listed in version map
Please add qman_dqrr_consume to the version map
/root/SUSE15-64_K5.3.18_Clang9.0.1/x86_64-native-linuxapp-clang/506f606f3ab6446786cf88da564f1b7c/dpdk/buildtools/check-symbols.sh: line 86: /root/SUSE15-64_K5.3.18_Clang9.0.1/x86_64-native-linuxapp-clang/506f606f3ab6446786cf88da564f1b7c/dpdk/buildtools/map-list-symbol.sh: No such file or directory
qman_enqueue is flagged as internal
but is not listed in version map
Please add qman_enqueue to the version map
/root/SUSE15-64_K5.3.18_Clang9.0.1/x86_64-native-linuxapp-clang/506f606f3ab6446786cf88da564f1b7c/dpdk/buildtools/check-symbols.sh: line 86: /root/SUSE15-64_K5.3.18_Clang9.0.1/x86_64-native-linuxapp-clang/506f606f3ab6446786cf88da564f1b7c/dpdk/buildtools/map-list-symbol.sh: No such file or directory
qman_enqueue_multi is flagged as internal
but is not listed in version map
Please add qman_enqueue_multi to the version map
/root/SUSE15-64_K5.3.18_Clang9.0.1/x86_64-native-linuxapp-clang/506f606f3ab6446786cf88da564f1b7c/dpdk/buildtools/check-symbols.sh: line 86: /root/SUSE15-64_K5.3.18_Clang9.0.1/x86_64-native-linuxapp-clang/506f606f3ab6446786cf88da564f1b7c/dpdk/buildtools/map-list-symbol.sh: No such file or directory
qman_enqueue_multi_fq is flagged as internal
but is not listed in version map
Please add qman_enqueue_multi_fq to the version map
/root/SUSE15-64_K5.3.18_Clang9.0.1/x86_64-native-linuxapp-clang/506f606f3ab6446786cf88da564f1b7c/dpdk/buildtools/check-symbols.sh: line 86: /root/SUSE15-64_K5.3.18_Clang9.0.1/x86_64-native-linuxapp-clang/506f606f3ab6446786cf88da564f1b7c/dpdk/buildtools/map-list-symbol.sh: No such file or directory
qman_ern_poll_free is flagged as internal
but is not listed in version map
Please add qman_ern_poll_free to the version map
/root/SUSE15-64_K5.3.18_Clang9.0.1/x86_64-native-linuxapp-clang/506f606f3ab6446786cf88da564f1b7c/dpdk/buildtools/check-symbols.sh: line 86: /root/SUSE15-64_K5.3.18_Clang9.0.1/x86_64-native-linuxapp-clang/506f606f3ab6446786cf88da564f1b7c/dpdk/buildtools/map-list-symbol.sh: No such file or directory
qman_ern_register_cb is flagged as internal
but is not listed in version map
Please add qman_ern_register_cb to the version map
/root/SUSE15-64_K5.3.18_Clang9.0.1/x86_64-native-linuxapp-clang/506f606f3ab6446786cf88da564f1b7c/dpdk/buildtools/check-symbols.sh: line 86: /root/SUSE15-64_K5.3.18_Clang9.0.1/x86_64-native-linuxapp-clang/506f606f3ab6446786cf88da564f1b7c/dpdk/buildtools/map-list-symbol.sh: No such file or directory
qman_fq_fqid is flagged as internal
but is not listed in version map
Please add qman_fq_fqid to the version map
/root/SUSE15-64_K5.3.18_Clang9.0.1/x86_64-native-linuxapp-clang/506f606f3ab6446786cf88da564f1b7c/dpdk/buildtools/check-symbols.sh: line 86: /root/SUSE15-64_K5.3.18_Clang9.0.1/x86_64-native-linuxapp-clang/506f606f3ab6446786cf88da564f1b7c/dpdk/buildtools/map-list-symbol.sh: No such file or directory
qman_fq_portal_irqsource_add is flagged as internal
but is not listed in version map
Please add qman_fq_portal_irqsource_add to the version map
/root/SUSE15-64_K5.3.18_Clang9.0.1/x86_64-native-linuxapp-clang/506f606f3ab6446786cf88da564f1b7c/dpdk/buildtools/check-symbols.sh: line 86: /root/SUSE15-64_K5.3.18_Clang9.0.1/x86_64-native-linuxapp-clang/506f606f3ab6446786cf88da564f1b7c/dpdk/buildtools/map-list-symbol.sh: No such file or directory
qman_fq_portal_irqsource_remove is flagged as internal
but is not listed in version map
Please add qman_fq_portal_irqsource_remove to the version map
/root/SUSE15-64_K5.3.18_Clang9.0.1/x86_64-native-linuxapp-clang/506f606f3ab6446786cf88da564f1b7c/dpdk/buildtools/check-symbols.sh: line 86: /root/SUSE15-64_K5.3.18_Clang9.0.1/x86_64-native-linuxapp-clang/506f606f3ab6446786cf88da564f1b7c/dpdk/buildtools/map-list-symbol.sh: No such file or directory
qman_fq_state is flagged as internal
but is not listed in version map
Please add qman_fq_state to the version map
/root/SUSE15-64_K5.3.18_Clang9.0.1/x86_64-native-linuxapp-clang/506f606f3ab6446786cf88da564f1b7c/dpdk/buildtools/check-symbols.sh: line 86: /root/SUSE15-64_K5.3.18_Clang9.0.1/x86_64-native-linuxapp-clang/506f606f3ab6446786cf88da564f1b7c/dpdk/buildtools/map-list-symbol.sh: No such file or directory
qman_init_fq is flagged as internal
but is not listed in version map
Please add qman_init_fq to the version map
/root/SUSE15-64_K5.3.18_Clang9.0.1/x86_64-native-linuxapp-clang/506f606f3ab6446786cf88da564f1b7c/dpdk/buildtools/check-symbols.sh: line 86: /root/SUSE15-64_K5.3.18_Clang9.0.1/x86_64-native-linuxapp-clang/506f606f3ab6446786cf88da564f1b7c/dpdk/buildtools/map-list-symbol.sh: No such file or directory
qman_irqsource_add is flagged as internal
but is not listed in version map
Please add qman_irqsource_add to the version map
/root/SUSE15-64_K5.3.18_Clang9.0.1/x86_64-native-linuxapp-clang/506f606f3ab6446786cf88da564f1b7c/dpdk/buildtools/check-symbols.sh: line 86: /root/SUSE15-64_K5.3.18_Clang9.0.1/x86_64-native-linuxapp-clang/506f606f3ab6446786cf88da564f1b7c/dpdk/buildtools/map-list-symbol.sh: No such file or directory
qman_irqsource_remove is flagged as internal
but is not listed in version map
Please add qman_irqsource_remove to the version map
/root/SUSE15-64_K5.3.18_Clang9.0.1/x86_64-native-linuxapp-clang/506f606f3ab6446786cf88da564f1b7c/dpdk/buildtools/check-symbols.sh: line 86: /root/SUSE15-64_K5.3.18_Clang9.0.1/x86_64-native-linuxapp-clang/506f606f3ab6446786cf88da564f1b7c/dpdk/buildtools/map-list-symbol.sh: No such file or directory
qman_modify_cgr is flagged as internal
but is not listed in version map
Please add qman_modify_cgr to the version map
/root/SUSE15-64_K5.3.18_Clang9.0.1/x86_64-native-linuxapp-clang/506f606f3ab6446786cf88da564f1b7c/dpdk/buildtools/check-symbols.sh: line 86: /root/SUSE15-64_K5.3.18_Clang9.0.1/x86_64-native-linuxapp-clang/506f606f3ab6446786cf88da564f1b7c/dpdk/buildtools/map-list-symbol.sh: No such file or directory
qman_oos_fq is flagged as internal
but is not listed in version map
Please add qman_oos_fq to the version map
/root/SUSE15-64_K5.3.18_Clang9.0.1/x86_64-native-linuxapp-clang/506f606f3ab6446786cf88da564f1b7c/dpdk/buildtools/check-symbols.sh: line 86: /root/SUSE15-64_K5.3.18_Clang9.0.1/x86_64-native-linuxapp-clang/506f606f3ab6446786cf88da564f1b7c/dpdk/buildtools/map-list-symbol.sh: No such file or directory
qman_poll_dqrr is flagged as internal
but is not listed in version map
Please add qman_poll_dqrr to the version map
/root/SUSE15-64_K5.3.18_Clang9.0.1/x86_64-native-linuxapp-clang/506f606f3ab6446786cf88da564f1b7c/dpdk/buildtools/check-symbols.sh: line 86: /root/SUSE15-64_K5.3.18_Clang9.0.1/x86_64-native-linuxapp-clang/506f606f3ab6446786cf88da564f1b7c/dpdk/buildtools/map-list-symbol.sh: No such file or directory
qman_portal_dequeue is flagged as internal
but is not listed in version map
Please add qman_portal_dequeue to the version map
/root/SUSE15-64_K5.3.18_Clang9.0.1/x86_64-native-linuxapp-clang/506f606f3ab6446786cf88da564f1b7c/dpdk/buildtools/check-symbols.sh: line 86: /root/SUSE15-64_K5.3.18_Clang9.0.1/x86_64-native-linuxapp-clang/506f606f3ab6446786cf88da564f1b7c/dpdk/buildtools/map-list-symbol.sh: No such file or directory
qman_portal_poll_rx is flagged as internal
but is not listed in version map
Please add qman_portal_poll_rx to the version map
/root/SUSE15-64_K5.3.18_Clang9.0.1/x86_64-native-linuxapp-clang/506f606f3ab6446786cf88da564f1b7c/dpdk/buildtools/check-symbols.sh: line 86: /root/SUSE15-64_K5.3.18_Clang9.0.1/x86_64-native-linuxapp-clang/506f606f3ab6446786cf88da564f1b7c/dpdk/buildtools/map-list-symbol.sh: No such file or directory
qman_query_fq_frm_cnt is flagged as internal
but is not listed in version map
Please add qman_query_fq_frm_cnt to the version map
/root/SUSE15-64_K5.3.18_Clang9.0.1/x86_64-native-linuxapp-clang/506f606f3ab6446786cf88da564f1b7c/dpdk/buildtools/check-symbols.sh: line 86: /root/SUSE15-64_K5.3.18_Clang9.0.1/x86_64-native-linuxapp-clang/506f606f3ab6446786cf88da564f1b7c/dpdk/buildtools/map-list-symbol.sh: No such file or directory
qman_query_fq_np is flagged as internal
but is not listed in version map
Please add qman_query_fq_np to the version map
/root/SUSE15-64_K5.3.18_Clang9.0.1/x86_64-native-linuxapp-clang/506f606f3ab6446786cf88da564f1b7c/dpdk/buildtools/check-symbols.sh: line 86: /root/SUSE15-64_K5.3.18_Clang9.0.1/x86_64-native-linuxapp-clang/506f606f3ab6446786cf88da564f1b7c/dpdk/buildtools/map-list-symbol.sh: No such file or directory
qman_retire_fq is flagged as internal
but is not listed in version map
Please add qman_retire_fq to the version map
/root/SUSE15-64_K5.3.18_Clang9.0.1/x86_64-native-linuxapp-clang/506f606f3ab6446786cf88da564f1b7c/dpdk/buildtools/check-symbols.sh: line 86: /root/SUSE15-64_K5.3.18_Clang9.0.1/x86_64-native-linuxapp-clang/506f606f3ab6446786cf88da564f1b7c/dpdk/buildtools/map-list-symbol.sh: No such file or directory
qman_set_fq_lookup_table is flagged as internal
but is not listed in version map
Please add qman_set_fq_lookup_table to the version map
/root/SUSE15-64_K5.3.18_Clang9.0.1/x86_64-native-linuxapp-clang/506f606f3ab6446786cf88da564f1b7c/dpdk/buildtools/check-symbols.sh: line 86: /root/SUSE15-64_K5.3.18_Clang9.0.1/x86_64-native-linuxapp-clang/506f606f3ab6446786cf88da564f1b7c/dpdk/buildtools/map-list-symbol.sh: No such file or directory
qman_set_vdq is flagged as internal
but is not listed in version map
Please add qman_set_vdq to the version map
/root/SUSE15-64_K5.3.18_Clang9.0.1/x86_64-native-linuxapp-clang/506f606f3ab6446786cf88da564f1b7c/dpdk/buildtools/check-symbols.sh: line 86: /root/SUSE15-64_K5.3.18_Clang9.0.1/x86_64-native-linuxapp-clang/506f606f3ab6446786cf88da564f1b7c/dpdk/buildtools/map-list-symbol.sh: No such file or directory
qman_static_dequeue_add is flagged as internal
but is not listed in version map
Please add qman_static_dequeue_add to the version map
/root/SUSE15-64_K5.3.18_Clang9.0.1/x86_64-native-linuxapp-clang/506f606f3ab6446786cf88da564f1b7c/dpdk/buildtools/check-symbols.sh: line 86: /root/SUSE15-64_K5.3.18_Clang9.0.1/x86_64-native-linuxapp-clang/506f606f3ab6446786cf88da564f1b7c/dpdk/buildtools/map-list-symbol.sh: No such file or directory
qman_volatile_dequeue is flagged as internal
but is not listed in version map
Please add qman_volatile_dequeue to the version map
/root/SUSE15-64_K5.3.18_Clang9.0.1/x86_64-native-linuxapp-clang/506f606f3ab6446786cf88da564f1b7c/dpdk/buildtools/check-symbols.sh: line 86: /root/SUSE15-64_K5.3.18_Clang9.0.1/x86_64-native-linuxapp-clang/506f606f3ab6446786cf88da564f1b7c/dpdk/buildtools/map-list-symbol.sh: No such file or directory
dpaa_get_qm_channel_caam is flagged as internal
but is not listed in version map
Please add dpaa_get_qm_channel_caam to the version map
/root/SUSE15-64_K5.3.18_Clang9.0.1/x86_64-native-linuxapp-clang/506f606f3ab6446786cf88da564f1b7c/dpdk/buildtools/check-symbols.sh: line 86: /root/SUSE15-64_K5.3.18_Clang9.0.1/x86_64-native-linuxapp-clang/506f606f3ab6446786cf88da564f1b7c/dpdk/buildtools/map-list-symbol.sh: No such file or directory
dpaa_get_qm_channel_pool is flagged as internal
but is not listed in version map
Please add dpaa_get_qm_channel_pool to the version map
/root/SUSE15-64_K5.3.18_Clang9.0.1/x86_64-native-linuxapp-clang/506f606f3ab6446786cf88da564f1b7c/dpdk/buildtools/check-symbols.sh: line 86: /root/SUSE15-64_K5.3.18_Clang9.0.1/x86_64-native-linuxapp-clang/506f606f3ab6446786cf88da564f1b7c/dpdk/buildtools/map-list-symbol.sh: No such file or directory
fsl_qman_fq_portal_create is flagged as internal
but is not listed in version map
Please add fsl_qman_fq_portal_create to the version map
/root/SUSE15-64_K5.3.18_Clang9.0.1/x86_64-native-linuxapp-clang/506f606f3ab6446786cf88da564f1b7c/dpdk/buildtools/check-symbols.sh: line 86: /root/SUSE15-64_K5.3.18_Clang9.0.1/x86_64-native-linuxapp-clang/506f606f3ab6446786cf88da564f1b7c/dpdk/buildtools/map-list-symbol.sh: No such file or directory
qman_fq_portal_thread_irq is flagged as internal
but is not listed in version map
Please add qman_fq_portal_thread_irq to the version map
/root/SUSE15-64_K5.3.18_Clang9.0.1/x86_64-native-linuxapp-clang/506f606f3ab6446786cf88da564f1b7c/dpdk/buildtools/check-symbols.sh: line 86: /root/SUSE15-64_K5.3.18_Clang9.0.1/x86_64-native-linuxapp-clang/506f606f3ab6446786cf88da564f1b7c/dpdk/buildtools/map-list-symbol.sh: No such file or directory
qman_thread_fd is flagged as internal
but is not listed in version map
Please add qman_thread_fd to the version map
/root/SUSE15-64_K5.3.18_Clang9.0.1/x86_64-native-linuxapp-clang/506f606f3ab6446786cf88da564f1b7c/dpdk/buildtools/check-symbols.sh: line 86: /root/SUSE15-64_K5.3.18_Clang9.0.1/x86_64-native-linuxapp-clang/506f606f3ab6446786cf88da564f1b7c/dpdk/buildtools/map-list-symbol.sh: No such file or directory
qman_thread_irq is flagged as internal
but is not listed in version map
Please add qman_thread_irq to the version map
/root/SUSE15-64_K5.3.18_Clang9.0.1/x86_64-native-linuxapp-clang/506f606f3ab6446786cf88da564f1b7c/dpdk/buildtools/check-symbols.sh: line 86: /root/SUSE15-64_K5.3.18_Clang9.0.1/x86_64-native-linuxapp-clang/506f606f3ab6446786cf88da564f1b7c/dpdk/buildtools/map-list-symbol.sh: No such file or directory
dpaa_get_eth_port_cfg is flagged as internal
but is not listed in version map
Please add dpaa_get_eth_port_cfg to the version map
/root/SUSE15-64_K5.3.18_Clang9.0.1/x86_64-native-linuxapp-clang/506f606f3ab6446786cf88da564f1b7c/dpdk/buildtools/check-symbols.sh: line 86: /root/SUSE15-64_K5.3.18_Clang9.0.1/x86_64-native-linuxapp-clang/506f606f3ab6446786cf88da564f1b7c/dpdk/buildtools/map-list-symbol.sh: No such file or directory
rte_dpaa_driver_register is flagged as internal
but is not listed in version map
Please add rte_dpaa_driver_register to the version map
/root/SUSE15-64_K5.3.18_Clang9.0.1/x86_64-native-linuxapp-clang/506f606f3ab6446786cf88da564f1b7c/dpdk/buildtools/check-symbols.sh: line 86: /root/SUSE15-64_K5.3.18_Clang9.0.1/x86_64-native-linuxapp-clang/506f606f3ab6446786cf88da564f1b7c/dpdk/buildtools/map-list-symbol.sh: No such file or directory
rte_dpaa_driver_unregister is flagged as internal
but is not listed in version map
Please add rte_dpaa_driver_unregister to the version map
/root/SUSE15-64_K5.3.18_Clang9.0.1/x86_64-native-linuxapp-clang/506f606f3ab6446786cf88da564f1b7c/dpdk/buildtools/check-symbols.sh: line 86: /root/SUSE15-64_K5.3.18_Clang9.0.1/x86_64-native-linuxapp-clang/506f606f3ab6446786cf88da564f1b7c/dpdk/buildtools/map-list-symbol.sh: No such file or directory
rte_dpaa_portal_fq_close is flagged as internal
but is not listed in version map
Please add rte_dpaa_portal_fq_close to the version map
/root/SUSE15-64_K5.3.18_Clang9.0.1/x86_64-native-linuxapp-clang/506f606f3ab6446786cf88da564f1b7c/dpdk/buildtools/check-symbols.sh: line 86: /root/SUSE15-64_K5.3.18_Clang9.0.1/x86_64-native-linuxapp-clang/506f606f3ab6446786cf88da564f1b7c/dpdk/buildtools/map-list-symbol.sh: No such file or directory
rte_dpaa_portal_fq_init is flagged as internal
but is not listed in version map
Please add rte_dpaa_portal_fq_init to the version map
/root/SUSE15-64_K5.3.18_Clang9.0.1/x86_64-native-linuxapp-clang/506f606f3ab6446786cf88da564f1b7c/dpdk/buildtools/check-symbols.sh: line 86: /root/SUSE15-64_K5.3.18_Clang9.0.1/x86_64-native-linuxapp-clang/506f606f3ab6446786cf88da564f1b7c/dpdk/buildtools/map-list-symbol.sh: No such file or directory
rte_dpaa_portal_init is flagged as internal
but is not listed in version map
Please add rte_dpaa_portal_init to the version map
[777/3068] Generating rte_bus_fslmc.sym_chk with a custom command (wrapped by meson to capture output)
FAILED: drivers/rte_bus_fslmc.sym_chk 
/usr/bin/meson --internal exe --capture drivers/rte_bus_fslmc.sym_chk -- /root/SUSE15-64_K5.3.18_Clang9.0.1/x86_64-native-linuxapp-clang/506f606f3ab6446786cf88da564f1b7c/dpdk/buildtools/check-symbols.sh /root/SUSE15-64_K5.3.18_Clang9.0.1/x86_64-native-linuxapp-clang/506f606f3ab6446786cf88da564f1b7c/dpdk/drivers/bus/fslmc/version.map drivers/librte_bus_fslmc.a
/root/SUSE15-64_K5.3.18_Clang9.0.1/x86_64-native-linuxapp-clang/506f606f3ab6446786cf88da564f1b7c/dpdk/buildtools/check-symbols.sh: line 86: /root/SUSE15-64_K5.3.18_Clang9.0.1/x86_64-native-linuxapp-clang/506f606f3ab6446786cf88da564f1b7c/dpdk/buildtools/map-list-symbol.sh: No such file or directory
rte_fslmc_driver_register is flagged as internal
but is not listed in version map
Please add rte_fslmc_driver_register to the version map
/root/SUSE15-64_K5.3.18_Clang9.0.1/x86_64-native-linuxapp-clang/506f606f3ab6446786cf88da564f1b7c/dpdk/buildtools/check-symbols.sh: line 86: /root/SUSE15-64_K5.3.18_Clang9.0.1/x86_64-native-linuxapp-clang/506f606f3ab6446786cf88da564f1b7c/dpdk/buildtools/map-list-symbol.sh: No such file or directory
rte_fslmc_driver_unregister is flagged as internal
but is not listed in version map
Please add rte_fslmc_driver_unregister to the version map
/root/SUSE15-64_K5.3.18_Clang9.0.1/x86_64-native-linuxapp-clang/506f606f3ab6446786cf88da564f1b7c/dpdk/buildtools/check-symbols.sh: line 86: /root/SUSE15-64_K5.3.18_Clang9.0.1/x86_64-native-linuxapp-clang/506f606f3ab6446786cf88da564f1b7c/dpdk/buildtools/map-list-symbol.sh: No such file or directory
rte_fslmc_get_device_count is flagged as internal
but is not listed in version map
Please add rte_fslmc_get_device_count to the version map
/root/SUSE15-64_K5.3.18_Clang9.0.1/x86_64-native-linuxapp-clang/506f606f3ab6446786cf88da564f1b7c/dpdk/buildtools/check-symbols.sh: line 86: /root/SUSE15-64_K5.3.18_Clang9.0.1/x86_64-native-linuxapp-clang/506f606f3ab6446786cf88da564f1b7c/dpdk/buildtools/map-list-symbol.sh: No such file or directory
dpaa2_get_mcp_ptr is flagged as internal
but is not listed in version map
Please add dpaa2_get_mcp_ptr to the version map
/root/SUSE15-64_K5.3.18_Clang9.0.1/x86_64-native-linuxapp-clang/506f606f3ab6446786cf88da564f1b7c/dpdk/buildtools/check-symbols.sh: line 86: /root/SUSE15-64_K5.3.18_Clang9.0.1/x86_64-native-linuxapp-clang/506f606f3ab6446786cf88da564f1b7c/dpdk/buildtools/map-list-symbol.sh: No such file or directory
rte_dpaa2_intr_disable is flagged as internal
but is not listed in version map
Please add rte_dpaa2_intr_disable to the version map
/root/SUSE15-64_K5.3.18_Clang9.0.1/x86_64-native-linuxapp-clang/506f606f3ab6446786cf88da564f1b7c/dpdk/buildtools/check-symbols.sh: line 86: /root/SUSE15-64_K5.3.18_Clang9.0.1/x86_64-native-linuxapp-clang/506f606f3ab6446786cf88da564f1b7c/dpdk/buildtools/map-list-symbol.sh: No such file or directory
rte_dpaa2_intr_enable is flagged as internal
but is not listed in version map
Please add rte_dpaa2_intr_enable to the version map
/root/SUSE15-64_K5.3.18_Clang9.0.1/x86_64-native-linuxapp-clang/506f606f3ab6446786cf88da564f1b7c/dpdk/buildtools/check-symbols.sh: line 86: /root/SUSE15-64_K5.3.18_Clang9.0.1/x86_64-native-linuxapp-clang/506f606f3ab6446786cf88da564f1b7c/dpdk/buildtools/map-list-symbol.sh: No such file or directory
rte_fslmc_object_register is flagged as internal
but is not listed in version map
Please add rte_fslmc_object_register to the version map
/root/SUSE15-64_K5.3.18_Clang9.0.1/x86_64-native-linuxapp-clang/506f606f3ab6446786cf88da564f1b7c/dpdk/buildtools/check-symbols.sh: line 86: /root/SUSE15-64_K5.3.18_Clang9.0.1/x86_64-native-linuxapp-clang/506f606f3ab6446786cf88da564f1b7c/dpdk/buildtools/map-list-symbol.sh: No such file or directory
dpbp_disable is flagged as internal
but is not listed in version map
Please add dpbp_disable to the version map
/root/SUSE15-64_K5.3.18_Clang9.0.1/x86_64-native-linuxapp-clang/506f606f3ab6446786cf88da564f1b7c/dpdk/buildtools/check-symbols.sh: line 86: /root/SUSE15-64_K5.3.18_Clang9.0.1/x86_64-native-linuxapp-clang/506f606f3ab6446786cf88da564f1b7c/dpdk/buildtools/map-list-symbol.sh: No such file or directory
dpbp_enable is flagged as internal
but is not listed in version map
Please add dpbp_enable to the version map
/root/SUSE15-64_K5.3.18_Clang9.0.1/x86_64-native-linuxapp-clang/506f606f3ab6446786cf88da564f1b7c/dpdk/buildtools/check-symbols.sh: line 86: /root/SUSE15-64_K5.3.18_Clang9.0.1/x86_64-native-linuxapp-clang/506f606f3ab6446786cf88da564f1b7c/dpdk/buildtools/map-list-symbol.sh: No such file or directory
dpbp_get_attributes is flagged as internal
but is not listed in version map
Please add dpbp_get_attributes to the version map
/root/SUSE15-64_K5.3.18_Clang9.0.1/x86_64-native-linuxapp-clang/506f606f3ab6446786cf88da564f1b7c/dpdk/buildtools/check-symbols.sh: line 86: /root/SUSE15-64_K5.3.18_Clang9.0.1/x86_64-native-linuxapp-clang/506f606f3ab6446786cf88da564f1b7c/dpdk/buildtools/map-list-symbol.sh: No such file or directory
dpbp_get_num_free_bufs is flagged as internal
but is not listed in version map
Please add dpbp_get_num_free_bufs to the version map
/root/SUSE15-64_K5.3.18_Clang9.0.1/x86_64-native-linuxapp-clang/506f606f3ab6446786cf88da564f1b7c/dpdk/buildtools/check-symbols.sh: line 86: /root/SUSE15-64_K5.3.18_Clang9.0.1/x86_64-native-linuxapp-clang/506f606f3ab6446786cf88da564f1b7c/dpdk/buildtools/map-list-symbol.sh: No such file or directory
dpbp_open is flagged as internal
but is not listed in version map
Please add dpbp_open to the version map
/root/SUSE15-64_K5.3.18_Clang9.0.1/x86_64-native-linuxapp-clang/506f606f3ab6446786cf88da564f1b7c/dpdk/buildtools/check-symbols.sh: line 86: /root/SUSE15-64_K5.3.18_Clang9.0.1/x86_64-native-linuxapp-clang/506f606f3ab6446786cf88da564f1b7c/dpdk/buildtools/map-list-symbol.sh: No such file or directory
dpbp_reset is flagged as internal
but is not listed in version map
Please add dpbp_reset to the version map
/root/SUSE15-64_K5.3.18_Clang9.0.1/x86_64-native-linuxapp-clang/506f606f3ab6446786cf88da564f1b7c/dpdk/buildtools/check-symbols.sh: line 86: /root/SUSE15-64_K5.3.18_Clang9.0.1/x86_64-native-linuxapp-clang/506f606f3ab6446786cf88da564f1b7c/dpdk/buildtools/map-list-symbol.sh: No such file or directory
dpci_get_opr is flagged as internal
but is not listed in version map
Please add dpci_get_opr to the version map
/root/SUSE15-64_K5.3.18_Clang9.0.1/x86_64-native-linuxapp-clang/506f606f3ab6446786cf88da564f1b7c/dpdk/buildtools/check-symbols.sh: line 86: /root/SUSE15-64_K5.3.18_Clang9.0.1/x86_64-native-linuxapp-clang/506f606f3ab6446786cf88da564f1b7c/dpdk/buildtools/map-list-symbol.sh: No such file or directory
dpci_set_opr is flagged as internal
but is not listed in version map
Please add dpci_set_opr to the version map
/root/SUSE15-64_K5.3.18_Clang9.0.1/x86_64-native-linuxapp-clang/506f606f3ab6446786cf88da564f1b7c/dpdk/buildtools/check-symbols.sh: line 86: /root/SUSE15-64_K5.3.18_Clang9.0.1/x86_64-native-linuxapp-clang/506f606f3ab6446786cf88da564f1b7c/dpdk/buildtools/map-list-symbol.sh: No such file or directory
dpci_set_rx_queue is flagged as internal
but is not listed in version map
Please add dpci_set_rx_queue to the version map
/root/SUSE15-64_K5.3.18_Clang9.0.1/x86_64-native-linuxapp-clang/506f606f3ab6446786cf88da564f1b7c/dpdk/buildtools/check-symbols.sh: line 86: /root/SUSE15-64_K5.3.18_Clang9.0.1/x86_64-native-linuxapp-clang/506f606f3ab6446786cf88da564f1b7c/dpdk/buildtools/map-list-symbol.sh: No such file or directory
dpcon_get_attributes is flagged as internal
but is not listed in version map
Please add dpcon_get_attributes to the version map
/root/SUSE15-64_K5.3.18_Clang9.0.1/x86_64-native-linuxapp-clang/506f606f3ab6446786cf88da564f1b7c/dpdk/buildtools/check-symbols.sh: line 86: /root/SUSE15-64_K5.3.18_Clang9.0.1/x86_64-native-linuxapp-clang/506f606f3ab6446786cf88da564f1b7c/dpdk/buildtools/map-list-symbol.sh: No such file or directory
dpcon_open is flagged as internal
but is not listed in version map
Please add dpcon_open to the version map
/root/SUSE15-64_K5.3.18_Clang9.0.1/x86_64-native-linuxapp-clang/506f606f3ab6446786cf88da564f1b7c/dpdk/buildtools/check-symbols.sh: line 86: /root/SUSE15-64_K5.3.18_Clang9.0.1/x86_64-native-linuxapp-clang/506f606f3ab6446786cf88da564f1b7c/dpdk/buildtools/map-list-symbol.sh: No such file or directory
dpdmai_close is flagged as internal
but is not listed in version map
Please add dpdmai_close to the version map
/root/SUSE15-64_K5.3.18_Clang9.0.1/x86_64-native-linuxapp-clang/506f606f3ab6446786cf88da564f1b7c/dpdk/buildtools/check-symbols.sh: line 86: /root/SUSE15-64_K5.3.18_Clang9.0.1/x86_64-native-linuxapp-clang/506f606f3ab6446786cf88da564f1b7c/dpdk/buildtools/map-list-symbol.sh: No such file or directory
dpdmai_disable is flagged as internal
but is not listed in version map
Please add dpdmai_disable to the version map
/root/SUSE15-64_K5.3.18_Clang9.0.1/x86_64-native-linuxapp-clang/506f606f3ab6446786cf88da564f1b7c/dpdk/buildtools/check-symbols.sh: line 86: /root/SUSE15-64_K5.3.18_Clang9.0.1/x86_64-native-linuxapp-clang/506f606f3ab6446786cf88da564f1b7c/dpdk/buildtools/map-list-symbol.sh: No such file or directory
dpdmai_enable is flagged as internal
but is not listed in version map
Please add dpdmai_enable to the version map
/root/SUSE15-64_K5.3.18_Clang9.0.1/x86_64-native-linuxapp-clang/506f606f3ab6446786cf88da564f1b7c/dpdk/buildtools/check-symbols.sh: line 86: /root/SUSE15-64_K5.3.18_Clang9.0.1/x86_64-native-linuxapp-clang/506f606f3ab6446786cf88da564f1b7c/dpdk/buildtools/map-list-symbol.sh: No such file or directory
dpdmai_get_attributes is flagged as internal
but is not listed in version map
Please add dpdmai_get_attributes to the version map
/root/SUSE15-64_K5.3.18_Clang9.0.1/x86_64-native-linuxapp-clang/506f606f3ab6446786cf88da564f1b7c/dpdk/buildtools/check-symbols.sh: line 86: /root/SUSE15-64_K5.3.18_Clang9.0.1/x86_64-native-linuxapp-clang/506f606f3ab6446786cf88da564f1b7c/dpdk/buildtools/map-list-symbol.sh: No such file or directory
dpdmai_get_rx_queue is flagged as internal
but is not listed in version map
Please add dpdmai_get_rx_queue to the version map
/root/SUSE15-64_K5.3.18_Clang9.0.1/x86_64-native-linuxapp-clang/506f606f3ab6446786cf88da564f1b7c/dpdk/buildtools/check-symbols.sh: line 86: /root/SUSE15-64_K5.3.18_Clang9.0.1/x86_64-native-linuxapp-clang/506f606f3ab6446786cf88da564f1b7c/dpdk/buildtools/map-list-symbol.sh: No such file or directory
dpdmai_get_tx_queue is flagged as internal
but is not listed in version map
Please add dpdmai_get_tx_queue to the version map
/root/SUSE15-64_K5.3.18_Clang9.0.1/x86_64-native-linuxapp-clang/506f606f3ab6446786cf88da564f1b7c/dpdk/buildtools/check-symbols.sh: line 86: /root/SUSE15-64_K5.3.18_Clang9.0.1/x86_64-native-linuxapp-clang/506f606f3ab6446786cf88da564f1b7c/dpdk/buildtools/map-list-symbol.sh: No such file or directory
dpdmai_open is flagged as internal
but is not listed in version map
Please add dpdmai_open to the version map
/root/SUSE15-64_K5.3.18_Clang9.0.1/x86_64-native-linuxapp-clang/506f606f3ab6446786cf88da564f1b7c/dpdk/buildtools/check-symbols.sh: line 86: /root/SUSE15-64_K5.3.18_Clang9.0.1/x86_64-native-linuxapp-clang/506f606f3ab6446786cf88da564f1b7c/dpdk/buildtools/map-list-symbol.sh: No such file or directory
dpdmai_set_rx_queue is flagged as internal
but is not listed in version map
Please add dpdmai_set_rx_queue to the version map
/root/SUSE15-64_K5.3.18_Clang9.0.1/x86_64-native-linuxapp-clang/506f606f3ab6446786cf88da564f1b7c/dpdk/buildtools/check-symbols.sh: line 86: /root/SUSE15-64_K5.3.18_Clang9.0.1/x86_64-native-linuxapp-clang/506f606f3ab6446786cf88da564f1b7c/dpdk/buildtools/map-list-symbol.sh: No such file or directory
dpio_add_static_dequeue_channel is flagged as internal
but is not listed in version map
Please add dpio_add_static_dequeue_channel to the version map
/root/SUSE15-64_K5.3.18_Clang9.0.1/x86_64-native-linuxapp-clang/506f606f3ab6446786cf88da564f1b7c/dpdk/buildtools/check-symbols.sh: line 86: /root/SUSE15-64_K5.3.18_Clang9.0.1/x86_64-native-linuxapp-clang/506f606f3ab6446786cf88da564f1b7c/dpdk/buildtools/map-list-symbol.sh: No such file or directory
dpio_close is flagged as internal
but is not listed in version map
Please add dpio_close to the version map
/root/SUSE15-64_K5.3.18_Clang9.0.1/x86_64-native-linuxapp-clang/506f606f3ab6446786cf88da564f1b7c/dpdk/buildtools/check-symbols.sh: line 86: /root/SUSE15-64_K5.3.18_Clang9.0.1/x86_64-native-linuxapp-clang/506f606f3ab6446786cf88da564f1b7c/dpdk/buildtools/map-list-symbol.sh: No such file or directory
dpio_disable is flagged as internal
but is not listed in version map
Please add dpio_disable to the version map
/root/SUSE15-64_K5.3.18_Clang9.0.1/x86_64-native-linuxapp-clang/506f606f3ab6446786cf88da564f1b7c/dpdk/buildtools/check-symbols.sh: line 86: /root/SUSE15-64_K5.3.18_Clang9.0.1/x86_64-native-linuxapp-clang/506f606f3ab6446786cf88da564f1b7c/dpdk/buildtools/map-list-symbol.sh: No such file or directory
dpio_enable is flagged as internal
but is not listed in version map
Please add dpio_enable to the version map
/root/SUSE15-64_K5.3.18_Clang9.0.1/x86_64-native-linuxapp-clang/506f606f3ab6446786cf88da564f1b7c/dpdk/buildtools/check-symbols.sh: line 86: /root/SUSE15-64_K5.3.18_Clang9.0.1/x86_64-native-linuxapp-clang/506f606f3ab6446786cf88da564f1b7c/dpdk/buildtools/map-list-symbol.sh: No such file or directory
dpio_get_attributes is flagged as internal
but is not listed in version map
Please add dpio_get_attributes to the version map
/root/SUSE15-64_K5.3.18_Clang9.0.1/x86_64-native-linuxapp-clang/506f606f3ab6446786cf88da564f1b7c/dpdk/buildtools/check-symbols.sh: line 86: /root/SUSE15-64_K5.3.18_Clang9.0.1/x86_64-native-linuxapp-clang/506f606f3ab6446786cf88da564f1b7c/dpdk/buildtools/map-list-symbol.sh: No such file or directory
dpio_open is flagged as internal
but is not listed in version map
Please add dpio_open to the version map
/root/SUSE15-64_K5.3.18_Clang9.0.1/x86_64-native-linuxapp-clang/506f606f3ab6446786cf88da564f1b7c/dpdk/buildtools/check-symbols.sh: line 86: /root/SUSE15-64_K5.3.18_Clang9.0.1/x86_64-native-linuxapp-clang/506f606f3ab6446786cf88da564f1b7c/dpdk/buildtools/map-list-symbol.sh: No such file or directory
dpio_remove_static_dequeue_channel is flagged as internal
but is not listed in version map
Please add dpio_remove_static_dequeue_channel to the version map
/root/SUSE15-64_K5.3.18_Clang9.0.1/x86_64-native-linuxapp-clang/506f606f3ab6446786cf88da564f1b7c/dpdk/buildtools/check-symbols.sh: line 86: /root/SUSE15-64_K5.3.18_Clang9.0.1/x86_64-native-linuxapp-clang/506f606f3ab6446786cf88da564f1b7c/dpdk/buildtools/map-list-symbol.sh: No such file or directory
dpio_reset is flagged as internal
but is not listed in version map
Please add dpio_reset to the version map
/root/SUSE15-64_K5.3.18_Clang9.0.1/x86_64-native-linuxapp-clang/506f606f3ab6446786cf88da564f1b7c/dpdk/buildtools/check-symbols.sh: line 86: /root/SUSE15-64_K5.3.18_Clang9.0.1/x86_64-native-linuxapp-clang/506f606f3ab6446786cf88da564f1b7c/dpdk/buildtools/map-list-symbol.sh: No such file or directory
dpio_set_stashing_destination is flagged as internal
but is not listed in version map
Please add dpio_set_stashing_destination to the version map
/root/SUSE15-64_K5.3.18_Clang9.0.1/x86_64-native-linuxapp-clang/506f606f3ab6446786cf88da564f1b7c/dpdk/buildtools/check-symbols.sh: line 86: /root/SUSE15-64_K5.3.18_Clang9.0.1/x86_64-native-linuxapp-clang/506f606f3ab6446786cf88da564f1b7c/dpdk/buildtools/map-list-symbol.sh: No such file or directory
mc_get_soc_version is flagged as internal
but is not listed in version map
Please add mc_get_soc_version to the version map
/root/SUSE15-64_K5.3.18_Clang9.0.1/x86_64-native-linuxapp-clang/506f606f3ab6446786cf88da564f1b7c/dpdk/buildtools/check-symbols.sh: line 86: /root/SUSE15-64_K5.3.18_Clang9.0.1/x86_64-native-linuxapp-clang/506f606f3ab6446786cf88da564f1b7c/dpdk/buildtools/map-list-symbol.sh: No such file or directory
mc_get_version is flagged as internal
but is not listed in version map
Please add mc_get_version to the version map
/root/SUSE15-64_K5.3.18_Clang9.0.1/x86_64-native-linuxapp-clang/506f606f3ab6446786cf88da564f1b7c/dpdk/buildtools/check-symbols.sh: line 86: /root/SUSE15-64_K5.3.18_Clang9.0.1/x86_64-native-linuxapp-clang/506f606f3ab6446786cf88da564f1b7c/dpdk/buildtools/map-list-symbol.sh: No such file or directory
mc_send_command is flagged as internal
but is not listed in version map
Please add mc_send_command to the version map
/root/SUSE15-64_K5.3.18_Clang9.0.1/x86_64-native-linuxapp-clang/506f606f3ab6446786cf88da564f1b7c/dpdk/buildtools/check-symbols.sh: line 86: /root/SUSE15-64_K5.3.18_Clang9.0.1/x86_64-native-linuxapp-clang/506f606f3ab6446786cf88da564f1b7c/dpdk/buildtools/map-list-symbol.sh: No such file or directory
dpaa2_alloc_dpbp_dev is flagged as internal
but is not listed in version map
Please add dpaa2_alloc_dpbp_dev to the version map
/root/SUSE15-64_K5.3.18_Clang9.0.1/x86_64-native-linuxapp-clang/506f606f3ab6446786cf88da564f1b7c/dpdk/buildtools/check-symbols.sh: line 86: /root/SUSE15-64_K5.3.18_Clang9.0.1/x86_64-native-linuxapp-clang/506f606f3ab6446786cf88da564f1b7c/dpdk/buildtools/map-list-symbol.sh: No such file or directory
dpaa2_dpbp_supported is flagged as internal
but is not listed in version map
Please add dpaa2_dpbp_supported to the version map
/root/SUSE15-64_K5.3.18_Clang9.0.1/x86_64-native-linuxapp-clang/506f606f3ab6446786cf88da564f1b7c/dpdk/buildtools/check-symbols.sh: line 86: /root/SUSE15-64_K5.3.18_Clang9.0.1/x86_64-native-linuxapp-clang/506f606f3ab6446786cf88da564f1b7c/dpdk/buildtools/map-list-symbol.sh: No such file or directory
dpaa2_free_dpbp_dev is flagged as internal
but is not listed in version map
Please add dpaa2_free_dpbp_dev to the version map
/root/SUSE15-64_K5.3.18_Clang9.0.1/x86_64-native-linuxapp-clang/506f606f3ab6446786cf88da564f1b7c/dpdk/buildtools/check-symbols.sh: line 86: /root/SUSE15-64_K5.3.18_Clang9.0.1/x86_64-native-linuxapp-clang/506f606f3ab6446786cf88da564f1b7c/dpdk/buildtools/map-list-symbol.sh: No such file or directory
rte_dpaa2_alloc_dpci_dev is flagged as internal
but is not listed in version map
Please add rte_dpaa2_alloc_dpci_dev to the version map
/root/SUSE15-64_K5.3.18_Clang9.0.1/x86_64-native-linuxapp-clang/506f606f3ab6446786cf88da564f1b7c/dpdk/buildtools/check-symbols.sh: line 86: /root/SUSE15-64_K5.3.18_Clang9.0.1/x86_64-native-linuxapp-clang/506f606f3ab6446786cf88da564f1b7c/dpdk/buildtools/map-list-symbol.sh: No such file or directory
rte_dpaa2_free_dpci_dev is flagged as internal
but is not listed in version map
Please add rte_dpaa2_free_dpci_dev to the version map
/root/SUSE15-64_K5.3.18_Clang9.0.1/x86_64-native-linuxapp-clang/506f606f3ab6446786cf88da564f1b7c/dpdk/buildtools/check-symbols.sh: line 86: /root/SUSE15-64_K5.3.18_Clang9.0.1/x86_64-native-linuxapp-clang/506f606f3ab6446786cf88da564f1b7c/dpdk/buildtools/map-list-symbol.sh: No such file or directory
dpaa2_affine_qbman_ethrx_swp is flagged as internal
but is not listed in version map
Please add dpaa2_affine_qbman_ethrx_swp to the version map
/root/SUSE15-64_K5.3.18_Clang9.0.1/x86_64-native-linuxapp-clang/506f606f3ab6446786cf88da564f1b7c/dpdk/buildtools/check-symbols.sh: line 86: /root/SUSE15-64_K5.3.18_Clang9.0.1/x86_64-native-linuxapp-clang/506f606f3ab6446786cf88da564f1b7c/dpdk/buildtools/map-list-symbol.sh: No such file or directory
dpaa2_affine_qbman_swp is flagged as internal
but is not listed in version map
Please add dpaa2_affine_qbman_swp to the version map
/root/SUSE15-64_K5.3.18_Clang9.0.1/x86_64-native-linuxapp-clang/506f606f3ab6446786cf88da564f1b7c/dpdk/buildtools/check-symbols.sh: line 86: /root/SUSE15-64_K5.3.18_Clang9.0.1/x86_64-native-linuxapp-clang/506f606f3ab6446786cf88da564f1b7c/dpdk/buildtools/map-list-symbol.sh: No such file or directory
dpaa2_alloc_dq_storage is flagged as internal
but is not listed in version map
Please add dpaa2_alloc_dq_storage to the version map
/root/SUSE15-64_K5.3.18_Clang9.0.1/x86_64-native-linuxapp-clang/506f606f3ab6446786cf88da564f1b7c/dpdk/buildtools/check-symbols.sh: line 86: /root/SUSE15-64_K5.3.18_Clang9.0.1/x86_64-native-linuxapp-clang/506f606f3ab6446786cf88da564f1b7c/dpdk/buildtools/map-list-symbol.sh: No such file or directory
dpaa2_free_dq_storage is flagged as internal
but is not listed in version map
Please add dpaa2_free_dq_storage to the version map
/root/SUSE15-64_K5.3.18_Clang9.0.1/x86_64-native-linuxapp-clang/506f606f3ab6446786cf88da564f1b7c/dpdk/buildtools/check-symbols.sh: line 86: /root/SUSE15-64_K5.3.18_Clang9.0.1/x86_64-native-linuxapp-clang/506f606f3ab6446786cf88da564f1b7c/dpdk/buildtools/map-list-symbol.sh: No such file or directory
dpaa2_free_eq_descriptors is flagged as internal
but is not listed in version map
Please add dpaa2_free_eq_descriptors to the version map
/root/SUSE15-64_K5.3.18_Clang9.0.1/x86_64-native-linuxapp-clang/506f606f3ab6446786cf88da564f1b7c/dpdk/buildtools/check-symbols.sh: line 86: /root/SUSE15-64_K5.3.18_Clang9.0.1/x86_64-native-linuxapp-clang/506f606f3ab6446786cf88da564f1b7c/dpdk/buildtools/map-list-symbol.sh: No such file or directory
qbman_check_command_complete is flagged as internal
but is not listed in version map
Please add qbman_check_command_complete to the version map
/root/SUSE15-64_K5.3.18_Clang9.0.1/x86_64-native-linuxapp-clang/506f606f3ab6446786cf88da564f1b7c/dpdk/buildtools/check-symbols.sh: line 86: /root/SUSE15-64_K5.3.18_Clang9.0.1/x86_64-native-linuxapp-clang/506f606f3ab6446786cf88da564f1b7c/dpdk/buildtools/map-list-symbol.sh: No such file or directory
qbman_check_new_result is flagged as internal
but is not listed in version map
Please add qbman_check_new_result to the version map
/root/SUSE15-64_K5.3.18_Clang9.0.1/x86_64-native-linuxapp-clang/506f606f3ab6446786cf88da564f1b7c/dpdk/buildtools/check-symbols.sh: line 86: /root/SUSE15-64_K5.3.18_Clang9.0.1/x86_64-native-linuxapp-clang/506f606f3ab6446786cf88da564f1b7c/dpdk/buildtools/map-list-symbol.sh: No such file or directory
qbman_eq_desc_clear is flagged as internal
but is not listed in version map
Please add qbman_eq_desc_clear to the version map
/root/SUSE15-64_K5.3.18_Clang9.0.1/x86_64-native-linuxapp-clang/506f606f3ab6446786cf88da564f1b7c/dpdk/buildtools/check-symbols.sh: line 86: /root/SUSE15-64_K5.3.18_Clang9.0.1/x86_64-native-linuxapp-clang/506f606f3ab6446786cf88da564f1b7c/dpdk/buildtools/map-list-symbol.sh: No such file or directory
qbman_eq_desc_set_dca is flagged as internal
but is not listed in version map
Please add qbman_eq_desc_set_dca to the version map
/root/SUSE15-64_K5.3.18_Clang9.0.1/x86_64-native-linuxapp-clang/506f606f3ab6446786cf88da564f1b7c/dpdk/buildtools/check-symbols.sh: line 86: /root/SUSE15-64_K5.3.18_Clang9.0.1/x86_64-native-linuxapp-clang/506f606f3ab6446786cf88da564f1b7c/dpdk/buildtools/map-list-symbol.sh: No such file or directory
qbman_eq_desc_set_fq is flagged as internal
but is not listed in version map
Please add qbman_eq_desc_set_fq to the version map
/root/SUSE15-64_K5.3.18_Clang9.0.1/x86_64-native-linuxapp-clang/506f606f3ab6446786cf88da564f1b7c/dpdk/buildtools/check-symbols.sh: line 86: /root/SUSE15-64_K5.3.18_Clang9.0.1/x86_64-native-linuxapp-clang/506f606f3ab6446786cf88da564f1b7c/dpdk/buildtools/map-list-symbol.sh: No such file or directory
qbman_eq_desc_set_no_orp is flagged as internal
but is not listed in version map
Please add qbman_eq_desc_set_no_orp to the version map
/root/SUSE15-64_K5.3.18_Clang9.0.1/x86_64-native-linuxapp-clang/506f606f3ab6446786cf88da564f1b7c/dpdk/buildtools/check-symbols.sh: line 86: /root/SUSE15-64_K5.3.18_Clang9.0.1/x86_64-native-linuxapp-clang/506f606f3ab6446786cf88da564f1b7c/dpdk/buildtools/map-list-symbol.sh: No such file or directory
qbman_eq_desc_set_orp is flagged as internal
but is not listed in version map
Please add qbman_eq_desc_set_orp to the version map
/root/SUSE15-64_K5.3.18_Clang9.0.1/x86_64-native-linuxapp-clang/506f606f3ab6446786cf88da564f1b7c/dpdk/buildtools/check-symbols.sh: line 86: /root/SUSE15-64_K5.3.18_Clang9.0.1/x86_64-native-linuxapp-clang/506f606f3ab6446786cf88da564f1b7c/dpdk/buildtools/map-list-symbol.sh: No such file or directory
qbman_eq_desc_set_qd is flagged as internal
but is not listed in version map
Please add qbman_eq_desc_set_qd to the version map
/root/SUSE15-64_K5.3.18_Clang9.0.1/x86_64-native-linuxapp-clang/506f606f3ab6446786cf88da564f1b7c/dpdk/buildtools/check-symbols.sh: line 86: /root/SUSE15-64_K5.3.18_Clang9.0.1/x86_64-native-linuxapp-clang/506f606f3ab6446786cf88da564f1b7c/dpdk/buildtools/map-list-symbol.sh: No such file or directory
qbman_eq_desc_set_response is flagged as internal
but is not listed in version map
Please add qbman_eq_desc_set_response to the version map
/root/SUSE15-64_K5.3.18_Clang9.0.1/x86_64-native-linuxapp-clang/506f606f3ab6446786cf88da564f1b7c/dpdk/buildtools/check-symbols.sh: line 86: /root/SUSE15-64_K5.3.18_Clang9.0.1/x86_64-native-linuxapp-clang/506f606f3ab6446786cf88da564f1b7c/dpdk/buildtools/map-list-symbol.sh: No such file or directory
qbman_eq_desc_set_token is flagged as internal
but is not listed in version map
Please add qbman_eq_desc_set_token to the version map
/root/SUSE15-64_K5.3.18_Clang9.0.1/x86_64-native-linuxapp-clang/506f606f3ab6446786cf88da564f1b7c/dpdk/buildtools/check-symbols.sh: line 86: /root/SUSE15-64_K5.3.18_Clang9.0.1/x86_64-native-linuxapp-clang/506f606f3ab6446786cf88da564f1b7c/dpdk/buildtools/map-list-symbol.sh: No such file or directory
qbman_get_dqrr_from_idx is flagged as internal
but is not listed in version map
Please add qbman_get_dqrr_from_idx to the version map
/root/SUSE15-64_K5.3.18_Clang9.0.1/x86_64-native-linuxapp-clang/506f606f3ab6446786cf88da564f1b7c/dpdk/buildtools/check-symbols.sh: line 86: /root/SUSE15-64_K5.3.18_Clang9.0.1/x86_64-native-linuxapp-clang/506f606f3ab6446786cf88da564f1b7c/dpdk/buildtools/map-list-symbol.sh: No such file or directory
qbman_get_dqrr_idx is flagged as internal
but is not listed in version map
Please add qbman_get_dqrr_idx to the version map
/root/SUSE15-64_K5.3.18_Clang9.0.1/x86_64-native-linuxapp-clang/506f606f3ab6446786cf88da564f1b7c/dpdk/buildtools/check-symbols.sh: line 86: /root/SUSE15-64_K5.3.18_Clang9.0.1/x86_64-native-linuxapp-clang/506f606f3ab6446786cf88da564f1b7c/dpdk/buildtools/map-list-symbol.sh: No such file or directory
qbman_pull_desc_clear is flagged as internal
but is not listed in version map
Please add qbman_pull_desc_clear to the version map
/root/SUSE15-64_K5.3.18_Clang9.0.1/x86_64-native-linuxapp-clang/506f606f3ab6446786cf88da564f1b7c/dpdk/buildtools/check-symbols.sh: line 86: /root/SUSE15-64_K5.3.18_Clang9.0.1/x86_64-native-linuxapp-clang/506f606f3ab6446786cf88da564f1b7c/dpdk/buildtools/map-list-symbol.sh: No such file or directory
qbman_pull_desc_set_fq is flagged as internal
but is not listed in version map
Please add qbman_pull_desc_set_fq to the version map
/root/SUSE15-64_K5.3.18_Clang9.0.1/x86_64-native-linuxapp-clang/506f606f3ab6446786cf88da564f1b7c/dpdk/buildtools/check-symbols.sh: line 86: /root/SUSE15-64_K5.3.18_Clang9.0.1/x86_64-native-linuxapp-clang/506f606f3ab6446786cf88da564f1b7c/dpdk/buildtools/map-list-symbol.sh: No such file or directory
qbman_pull_desc_set_numframes is flagged as internal
but is not listed in version map
Please add qbman_pull_desc_set_numframes to the version map
/root/SUSE15-64_K5.3.18_Clang9.0.1/x86_64-native-linuxapp-clang/506f606f3ab6446786cf88da564f1b7c/dpdk/buildtools/check-symbols.sh: line 86: /root/SUSE15-64_K5.3.18_Clang9.0.1/x86_64-native-linuxapp-clang/506f606f3ab6446786cf88da564f1b7c/dpdk/buildtools/map-list-symbol.sh: No such file or directory
qbman_pull_desc_set_storage is flagged as internal
but is not listed in version map
Please add qbman_pull_desc_set_storage to the version map
/root/SUSE15-64_K5.3.18_Clang9.0.1/x86_64-native-linuxapp-clang/506f606f3ab6446786cf88da564f1b7c/dpdk/buildtools/check-symbols.sh: line 86: /root/SUSE15-64_K5.3.18_Clang9.0.1/x86_64-native-linuxapp-clang/506f606f3ab6446786cf88da564f1b7c/dpdk/buildtools/map-list-symbol.sh: No such file or directory
qbman_release_desc_clear is flagged as internal
but is not listed in version map
Please add qbman_release_desc_clear to the version map
/root/SUSE15-64_K5.3.18_Clang9.0.1/x86_64-native-linuxapp-clang/506f606f3ab6446786cf88da564f1b7c/dpdk/buildtools/check-symbols.sh: line 86: /root/SUSE15-64_K5.3.18_Clang9.0.1/x86_64-native-linuxapp-clang/506f606f3ab6446786cf88da564f1b7c/dpdk/buildtools/map-list-symbol.sh: No such file or directory
qbman_release_desc_set_bpid is flagged as internal
but is not listed in version map
Please add qbman_release_desc_set_bpid to the version map
/root/SUSE15-64_K5.3.18_Clang9.0.1/x86_64-native-linuxapp-clang/506f606f3ab6446786cf88da564f1b7c/dpdk/buildtools/check-symbols.sh: line 86: /root/SUSE15-64_K5.3.18_Clang9.0.1/x86_64-native-linuxapp-clang/506f606f3ab6446786cf88da564f1b7c/dpdk/buildtools/map-list-symbol.sh: No such file or directory
qbman_result_DQ_fd is flagged as internal
but is not listed in version map
Please add qbman_result_DQ_fd to the version map
/root/SUSE15-64_K5.3.18_Clang9.0.1/x86_64-native-linuxapp-clang/506f606f3ab6446786cf88da564f1b7c/dpdk/buildtools/check-symbols.sh: line 86: /root/SUSE15-64_K5.3.18_Clang9.0.1/x86_64-native-linuxapp-clang/506f606f3ab6446786cf88da564f1b7c/dpdk/buildtools/map-list-symbol.sh: No such file or directory
qbman_result_DQ_flags is flagged as internal
but is not listed in version map
Please add qbman_result_DQ_flags to the version map
/root/SUSE15-64_K5.3.18_Clang9.0.1/x86_64-native-linuxapp-clang/506f606f3ab6446786cf88da564f1b7c/dpdk/buildtools/check-symbols.sh: line 86: /root/SUSE15-64_K5.3.18_Clang9.0.1/x86_64-native-linuxapp-clang/506f606f3ab6446786cf88da564f1b7c/dpdk/buildtools/map-list-symbol.sh: No such file or directory
qbman_result_DQ_fqd_ctx is flagged as internal
but is not listed in version map
Please add qbman_result_DQ_fqd_ctx to the version map
/root/SUSE15-64_K5.3.18_Clang9.0.1/x86_64-native-linuxapp-clang/506f606f3ab6446786cf88da564f1b7c/dpdk/buildtools/check-symbols.sh: line 86: /root/SUSE15-64_K5.3.18_Clang9.0.1/x86_64-native-linuxapp-clang/506f606f3ab6446786cf88da564f1b7c/dpdk/buildtools/map-list-symbol.sh: No such file or directory
qbman_result_DQ_odpid is flagged as internal
but is not listed in version map
Please add qbman_result_DQ_odpid to the version map
/root/SUSE15-64_K5.3.18_Clang9.0.1/x86_64-native-linuxapp-clang/506f606f3ab6446786cf88da564f1b7c/dpdk/buildtools/check-symbols.sh: line 86: /root/SUSE15-64_K5.3.18_Clang9.0.1/x86_64-native-linuxapp-clang/506f606f3ab6446786cf88da564f1b7c/dpdk/buildtools/map-list-symbol.sh: No such file or directory
qbman_result_DQ_seqnum is flagged as internal
but is not listed in version map
Please add qbman_result_DQ_seqnum to the version map
/root/SUSE15-64_K5.3.18_Clang9.0.1/x86_64-native-linuxapp-clang/506f606f3ab6446786cf88da564f1b7c/dpdk/buildtools/check-symbols.sh: line 86: /root/SUSE15-64_K5.3.18_Clang9.0.1/x86_64-native-linuxapp-clang/506f606f3ab6446786cf88da564f1b7c/dpdk/buildtools/map-list-symbol.sh: No such file or directory
qbman_result_SCN_state is flagged as internal
but is not listed in version map
Please add qbman_result_SCN_state to the version map
/root/SUSE15-64_K5.3.18_Clang9.0.1/x86_64-native-linuxapp-clang/506f606f3ab6446786cf88da564f1b7c/dpdk/buildtools/check-symbols.sh: line 86: /root/SUSE15-64_K5.3.18_Clang9.0.1/x86_64-native-linuxapp-clang/506f606f3ab6446786cf88da564f1b7c/dpdk/buildtools/map-list-symbol.sh: No such file or directory
qbman_result_eqresp_fd is flagged as internal
but is not listed in version map
Please add qbman_result_eqresp_fd to the version map
/root/SUSE15-64_K5.3.18_Clang9.0.1/x86_64-native-linuxapp-clang/506f606f3ab6446786cf88da564f1b7c/dpdk/buildtools/check-symbols.sh: line 86: /root/SUSE15-64_K5.3.18_Clang9.0.1/x86_64-native-linuxapp-clang/506f606f3ab6446786cf88da564f1b7c/dpdk/buildtools/map-list-symbol.sh: No such file or directory
qbman_result_eqresp_rc is flagged as internal
but is not listed in version map
Please add qbman_result_eqresp_rc to the version map
/root/SUSE15-64_K5.3.18_Clang9.0.1/x86_64-native-linuxapp-clang/506f606f3ab6446786cf88da564f1b7c/dpdk/buildtools/check-symbols.sh: line 86: /root/SUSE15-64_K5.3.18_Clang9.0.1/x86_64-native-linuxapp-clang/506f606f3ab6446786cf88da564f1b7c/dpdk/buildtools/map-list-symbol.sh: No such file or directory
qbman_result_eqresp_rspid is flagged as internal
but is not listed in version map
Please add qbman_result_eqresp_rspid to the version map
/root/SUSE15-64_K5.3.18_Clang9.0.1/x86_64-native-linuxapp-clang/506f606f3ab6446786cf88da564f1b7c/dpdk/buildtools/check-symbols.sh: line 86: /root/SUSE15-64_K5.3.18_Clang9.0.1/x86_64-native-linuxapp-clang/506f606f3ab6446786cf88da564f1b7c/dpdk/buildtools/map-list-symbol.sh: No such file or directory
qbman_result_eqresp_set_rspid is flagged as internal
but is not listed in version map
Please add qbman_result_eqresp_set_rspid to the version map
/root/SUSE15-64_K5.3.18_Clang9.0.1/x86_64-native-linuxapp-clang/506f606f3ab6446786cf88da564f1b7c/dpdk/buildtools/check-symbols.sh: line 86: /root/SUSE15-64_K5.3.18_Clang9.0.1/x86_64-native-linuxapp-clang/506f606f3ab6446786cf88da564f1b7c/dpdk/buildtools/map-list-symbol.sh: No such file or directory
qbman_result_has_new_result is flagged as internal
but is not listed in version map
Please add qbman_result_has_new_result to the version map
/root/SUSE15-64_K5.3.18_Clang9.0.1/x86_64-native-linuxapp-clang/506f606f3ab6446786cf88da564f1b7c/dpdk/buildtools/check-symbols.sh: line 86: /root/SUSE15-64_K5.3.18_Clang9.0.1/x86_64-native-linuxapp-clang/506f606f3ab6446786cf88da564f1b7c/dpdk/buildtools/map-list-symbol.sh: No such file or directory
qbman_swp_acquire is flagged as internal
but is not listed in version map
Please add qbman_swp_acquire to the version map
/root/SUSE15-64_K5.3.18_Clang9.0.1/x86_64-native-linuxapp-clang/506f606f3ab6446786cf88da564f1b7c/dpdk/buildtools/check-symbols.sh: line 86: /root/SUSE15-64_K5.3.18_Clang9.0.1/x86_64-native-linuxapp-clang/506f606f3ab6446786cf88da564f1b7c/dpdk/buildtools/map-list-symbol.sh: No such file or directory
qbman_swp_dqrr_consume is flagged as internal
but is not listed in version map
Please add qbman_swp_dqrr_consume to the version map
/root/SUSE15-64_K5.3.18_Clang9.0.1/x86_64-native-linuxapp-clang/506f606f3ab6446786cf88da564f1b7c/dpdk/buildtools/check-symbols.sh: line 86: /root/SUSE15-64_K5.3.18_Clang9.0.1/x86_64-native-linuxapp-clang/506f606f3ab6446786cf88da564f1b7c/dpdk/buildtools/map-list-symbol.sh: No such file or directory
qbman_swp_dqrr_idx_consume is flagged as internal
but is not listed in version map
Please add qbman_swp_dqrr_idx_consume to the version map
/root/SUSE15-64_K5.3.18_Clang9.0.1/x86_64-native-linuxapp-clang/506f606f3ab6446786cf88da564f1b7c/dpdk/buildtools/check-symbols.sh: line 86: /root/SUSE15-64_K5.3.18_Clang9.0.1/x86_64-native-linuxapp-clang/506f606f3ab6446786cf88da564f1b7c/dpdk/buildtools/map-list-symbol.sh: No such file or directory
qbman_swp_dqrr_next is flagged as internal
but is not listed in version map
Please add qbman_swp_dqrr_next to the version map
/root/SUSE15-64_K5.3.18_Clang9.0.1/x86_64-native-linuxapp-clang/506f606f3ab6446786cf88da564f1b7c/dpdk/buildtools/check-symbols.sh: line 86: /root/SUSE15-64_K5.3.18_Clang9.0.1/x86_64-native-linuxapp-clang/506f606f3ab6446786cf88da564f1b7c/dpdk/buildtools/map-list-symbol.sh: No such file or directory
qbman_swp_enqueue_multiple is flagged as internal
but is not listed in version map
Please add qbman_swp_enqueue_multiple to the version map
/root/SUSE15-64_K5.3.18_Clang9.0.1/x86_64-native-linuxapp-clang/506f606f3ab6446786cf88da564f1b7c/dpdk/buildtools/check-symbols.sh: line 86: /root/SUSE15-64_K5.3.18_Clang9.0.1/x86_64-native-linuxapp-clang/506f606f3ab6446786cf88da564f1b7c/dpdk/buildtools/map-list-symbol.sh: No such file or directory
qbman_swp_enqueue_multiple_desc is flagged as internal
but is not listed in version map
Please add qbman_swp_enqueue_multiple_desc to the version map
/root/SUSE15-64_K5.3.18_Clang9.0.1/x86_64-native-linuxapp-clang/506f606f3ab6446786cf88da564f1b7c/dpdk/buildtools/check-symbols.sh: line 86: /root/SUSE15-64_K5.3.18_Clang9.0.1/x86_64-native-linuxapp-clang/506f606f3ab6446786cf88da564f1b7c/dpdk/buildtools/map-list-symbol.sh: No such file or directory
qbman_swp_enqueue_multiple_fd is flagged as internal
but is not listed in version map
Please add qbman_swp_enqueue_multiple_fd to the version map
/root/SUSE15-64_K5.3.18_Clang9.0.1/x86_64-native-linuxapp-clang/506f606f3ab6446786cf88da564f1b7c/dpdk/buildtools/check-symbols.sh: line 86: /root/SUSE15-64_K5.3.18_Clang9.0.1/x86_64-native-linuxapp-clang/506f606f3ab6446786cf88da564f1b7c/dpdk/buildtools/map-list-symbol.sh: No such file or directory
qbman_swp_interrupt_clear_status is flagged as internal
but is not listed in version map
Please add qbman_swp_interrupt_clear_status to the version map
/root/SUSE15-64_K5.3.18_Clang9.0.1/x86_64-native-linuxapp-clang/506f606f3ab6446786cf88da564f1b7c/dpdk/buildtools/check-symbols.sh: line 86: /root/SUSE15-64_K5.3.18_Clang9.0.1/x86_64-native-linuxapp-clang/506f606f3ab6446786cf88da564f1b7c/dpdk/buildtools/map-list-symbol.sh: No such file or directory
qbman_swp_prefetch_dqrr_next is flagged as internal
but is not listed in version map
Please add qbman_swp_prefetch_dqrr_next to the version map
/root/SUSE15-64_K5.3.18_Clang9.0.1/x86_64-native-linuxapp-clang/506f606f3ab6446786cf88da564f1b7c/dpdk/buildtools/check-symbols.sh: line 86: /root/SUSE15-64_K5.3.18_Clang9.0.1/x86_64-native-linuxapp-clang/506f606f3ab6446786cf88da564f1b7c/dpdk/buildtools/map-list-symbol.sh: No such file or directory
qbman_swp_pull is flagged as internal
but is not listed in version map
Please add qbman_swp_pull to the version map
/root/SUSE15-64_K5.3.18_Clang9.0.1/x86_64-native-linuxapp-clang/506f606f3ab6446786cf88da564f1b7c/dpdk/buildtools/check-symbols.sh: line 86: /root/SUSE15-64_K5.3.18_Clang9.0.1/x86_64-native-linuxapp-clang/506f606f3ab6446786cf88da564f1b7c/dpdk/buildtools/map-list-symbol.sh: No such file or directory
qbman_swp_push_set is flagged as internal
but is not listed in version map
Please add qbman_swp_push_set to the version map
/root/SUSE15-64_K5.3.18_Clang9.0.1/x86_64-native-linuxapp-clang/506f606f3ab6446786cf88da564f1b7c/dpdk/buildtools/check-symbols.sh: line 86: /root/SUSE15-64_K5.3.18_Clang9.0.1/x86_64-native-linuxapp-clang/506f606f3ab6446786cf88da564f1b7c/dpdk/buildtools/map-list-symbol.sh: No such file or directory
qbman_swp_release is flagged as internal
but is not listed in version map
Please add qbman_swp_release to the version map
/root/SUSE15-64_K5.3.18_Clang9.0.1/x86_64-native-linuxapp-clang/506f606f3ab6446786cf88da564f1b7c/dpdk/buildtools/check-symbols.sh: line 86: /root/SUSE15-64_K5.3.18_Clang9.0.1/x86_64-native-linuxapp-clang/506f606f3ab6446786cf88da564f1b7c/dpdk/buildtools/map-list-symbol.sh: No such file or directory
qbman_fq_query_state is flagged as internal
but is not listed in version map
Please add qbman_fq_query_state to the version map
/root/SUSE15-64_K5.3.18_Clang9.0.1/x86_64-native-linuxapp-clang/506f606f3ab6446786cf88da564f1b7c/dpdk/buildtools/check-symbols.sh: line 86: /root/SUSE15-64_K5.3.18_Clang9.0.1/x86_64-native-linuxapp-clang/506f606f3ab6446786cf88da564f1b7c/dpdk/buildtools/map-list-symbol.sh: No such file or directory
qbman_fq_state_frame_count is flagged as internal
but is not listed in version map
Please add qbman_fq_state_frame_count to the version map
[778/3068] Generating pipeline.sym_chk with a custom command (wrapped by meson to capture output)
FAILED: lib/pipeline.sym_chk 
/usr/bin/meson --internal exe --capture lib/pipeline.sym_chk -- /root/SUSE15-64_K5.3.18_Clang9.0.1/x86_64-native-linuxapp-clang/506f606f3ab6446786cf88da564f1b7c/dpdk/buildtools/check-symbols.sh /root/SUSE15-64_K5.3.18_Clang9.0.1/x86_64-native-linuxapp-clang/506f606f3ab6446786cf88da564f1b7c/dpdk/lib/pipeline/version.map lib/librte_pipeline.a
Found only in symbol map file:
	/root/SUSE15-64_K5.3.18_Clang9.0.1/x86_64-native-linuxapp-clang/506f606f3ab6446786cf88da564f1b7c/dpdk/lib/pipeline/version.map: rte_port_in_action_profile_freeze
	/root/SUSE15-64_K5.3.18_Clang9.0.1/x86_64-native-linuxapp-clang/506f606f3ab6446786cf88da564f1b7c/dpdk/lib/pipeline/version.map: rte_table_action_apply
	/root/SUSE15-64_K5.3.18_Clang9.0.1/x86_64-native-linuxapp-clang/506f606f3ab6446786cf88da564f1b7c/dpdk/lib/pipeline/version.map: rte_table_action_create
	/root/SUSE15-64_K5.3.18_Clang9.0.1/x86_64-native-linuxapp-clang/506f606f3ab6446786cf88da564f1b7c/dpdk/lib/pipeline/version.map: rte_table_action_dscp_table_update
	/root/SUSE15-64_K5.3.18_Clang9.0.1/x86_64-native-linuxapp-clang/506f606f3ab6446786cf88da564f1b7c/dpdk/lib/pipeline/version.map: rte_table_action_free
	/root/SUSE15-64_K5.3.18_Clang9.0.1/x86_64-native-linuxapp-clang/506f606f3ab6446786cf88da564f1b7c/dpdk/lib/pipeline/version.map: rte_table_action_meter_profile_add
	/root/SUSE15-64_K5.3.18_Clang9.0.1/x86_64-native-linuxapp-clang/506f606f3ab6446786cf88da564f1b7c/dpdk/lib/pipeline/version.map: rte_table_action_meter_profile_delete
	/root/SUSE15-64_K5.3.18_Clang9.0.1/x86_64-native-linuxapp-clang/506f606f3ab6446786cf88da564f1b7c/dpdk/lib/pipeline/version.map: rte_table_action_meter_read
	/root/SUSE15-64_K5.3.18_Clang9.0.1/x86_64-native-linuxapp-clang/506f606f3ab6446786cf88da564f1b7c/dpdk/lib/pipeline/version.map: rte_table_action_profile_action_register
	/root/SUSE15-64_K5.3.18_Clang9.0.1/x86_64-native-linuxapp-clang/506f606f3ab6446786cf88da564f1b7c/dpdk/lib/pipeline/version.map: rte_table_action_profile_create
	/root/SUSE15-64_K5.3.18_Clang9.0.1/x86_64-native-linuxapp-clang/506f606f3ab6446786cf88da564f1b7c/dpdk/lib/pipeline/version.map: rte_table_action_profile_free
	/root/SUSE15-64_K5.3.18_Clang9.0.1/x86_64-native-linuxapp-clang/506f606f3ab6446786cf88da564f1b7c/dpdk/lib/pipeline/version.map: rte_table_action_profile_freeze
	/root/SUSE15-64_K5.3.18_Clang9.0.1/x86_64-native-linuxapp-clang/506f606f3ab6446786cf88da564f1b7c/dpdk/lib/pipeline/version.map: rte_table_action_stats_read
	/root/SUSE15-64_K5.3.18_Clang9.0.1/x86_64-native-linuxapp-clang/506f606f3ab6446786cf88da564f1b7c/dpdk/lib/pipeline/version.map: rte_table_action_table_params_get
	/root/SUSE15-64_K5.3.18_Clang9.0.1/x86_64-native-linuxapp-clang/506f606f3ab6446786cf88da564f1b7c/dpdk/lib/pipeline/version.map: rte_table_action_time_read
	/root/SUSE15-64_K5.3.18_Clang9.0.1/x86_64-native-linuxapp-clang/506f606f3ab6446786cf88da564f1b7c/dpdk/lib/pipeline/version.map: rte_table_action_ttl_read
	/root/SUSE15-64_K5.3.18_Clang9.0.1/x86_64-native-linuxapp-clang/506f606f3ab6446786cf88da564f1b7c/dpdk/lib/pipeline/version.map: rte_table_action_crypto_sym_session_get
	/root/SUSE15-64_K5.3.18_Clang9.0.1/x86_64-native-linuxapp-clang/506f606f3ab6446786cf88da564f1b7c/dpdk/lib/pipeline/version.map: rte_swx_ctl_action_arg_info_get
	/root/SUSE15-64_K5.3.18_Clang9.0.1/x86_64-native-linuxapp-clang/506f606f3ab6446786cf88da564f1b7c/dpdk/lib/pipeline/version.map: rte_swx_ctl_action_info_get
	/root/SUSE15-64_K5.3.18_Clang9.0.1/x86_64-native-linuxapp-clang/506f606f3ab6446786cf88da564f1b7c/dpdk/lib/pipeline/version.map: rte_swx_ctl_pipeline_abort
	/root/SUSE15-64_K5.3.18_Clang9.0.1/x86_64-native-linuxapp-clang/506f606f3ab6446786cf88da564f1b7c/dpdk/lib/pipeline/version.map: rte_swx_ctl_pipeline_commit
	/root/SUSE15-64_K5.3.18_Clang9.0.1/x86_64-native-linuxapp-clang/506f606f3ab6446786cf88da564f1b7c/dpdk/lib/pipeline/version.map: rte_swx_ctl_pipeline_create
	/root/SUSE15-64_K5.3.18_Clang9.0.1/x86_64-native-linuxapp-clang/506f606f3ab6446786cf88da564f1b7c/dpdk/lib/pipeline/version.map: rte_swx_ctl_pipeline_free
	/root/SUSE15-64_K5.3.18_Clang9.0.1/x86_64-native-linuxapp-clang/506f606f3ab6446786cf88da564f1b7c/dpdk/lib/pipeline/version.map: rte_swx_ctl_pipeline_info_get
	/root/SUSE15-64_K5.3.18_Clang9.0.1/x86_64-native-linuxapp-clang/506f606f3ab6446786cf88da564f1b7c/dpdk/lib/pipeline/version.map: rte_swx_ctl_pipeline_numa_node_get
	/root/SUSE15-64_K5.3.18_Clang9.0.1/x86_64-native-linuxapp-clang/506f606f3ab6446786cf88da564f1b7c/dpdk/lib/pipeline/version.map: rte_swx_ctl_pipeline_port_in_stats_read
	/root/SUSE15-64_K5.3.18_Clang9.0.1/x86_64-native-linuxapp-clang/506f606f3ab6446786cf88da564f1b7c/dpdk/lib/pipeline/version.map: rte_swx_ctl_pipeline_port_out_stats_read
	/root/SUSE15-64_K5.3.18_Clang9.0.1/x86_64-native-linuxapp-clang/506f606f3ab6446786cf88da564f1b7c/dpdk/lib/pipeline/version.map: rte_swx_ctl_pipeline_table_default_entry_add
	/root/SUSE15-64_K5.3.18_Clang9.0.1/x86_64-native-linuxapp-clang/506f606f3ab6446786cf88da564f1b7c/dpdk/lib/pipeline/version.map: rte_swx_ctl_pipeline_table_entry_add
	/root/SUSE15-64_K5.3.18_Clang9.0.1/x86_64-native-linuxapp-clang/506f606f3ab6446786cf88da564f1b7c/dpdk/lib/pipeline/version.map: rte_swx_ctl_pipeline_table_entry_delete
	/root/SUSE15-64_K5.3.18_Clang9.0.1/x86_64-native-linuxapp-clang/506f606f3ab6446786cf88da564f1b7c/dpdk/lib/pipeline/version.map: rte_swx_ctl_pipeline_table_entry_read
	/root/SUSE15-64_K5.3.18_Clang9.0.1/x86_64-native-linuxapp-clang/506f606f3ab6446786cf88da564f1b7c/dpdk/lib/pipeline/version.map: rte_swx_ctl_pipeline_table_fprintf
	/root/SUSE15-64_K5.3.18_Clang9.0.1/x86_64-native-linuxapp-clang/506f606f3ab6446786cf88da564f1b7c/dpdk/lib/pipeline/version.map: rte_swx_ctl_table_action_info_get
	/root/SUSE15-64_K5.3.18_Clang9.0.1/x86_64-native-linuxapp-clang/506f606f3ab6446786cf88da564f1b7c/dpdk/lib/pipeline/version.map: rte_swx_ctl_table_info_get
	/root/SUSE15-64_K5.3.18_Clang9.0.1/x86_64-native-linuxapp-clang/506f606f3ab6446786cf88da564f1b7c/dpdk/lib/pipeline/version.map: rte_swx_ctl_table_match_field_info_get
	/root/SUSE15-64_K5.3.18_Clang9.0.1/x86_64-native-linuxapp-clang/506f606f3ab6446786cf88da564f1b7c/dpdk/lib/pipeline/version.map: rte_swx_ctl_table_ops_get
	/root/SUSE15-64_K5.3.18_Clang9.0.1/x86_64-native-linuxapp-clang/506f606f3ab6446786cf88da564f1b7c/dpdk/lib/pipeline/version.map: rte_swx_pipeline_action_config
	/root/SUSE15-64_K5.3.18_Clang9.0.1/x86_64-native-linuxapp-clang/506f606f3ab6446786cf88da564f1b7c/dpdk/lib/pipeline/version.map: rte_swx_pipeline_build
	/root/SUSE15-64_K5.3.18_Clang9.0.1/x86_64-native-linuxapp-clang/506f606f3ab6446786cf88da564f1b7c/dpdk/lib/pipeline/version.map: rte_swx_pipeline_build_from_spec
	/root/SUSE15-64_K5.3.18_Clang9.0.1/x86_64-native-linuxapp-clang/506f606f3ab6446786cf88da564f1b7c/dpdk/lib/pipeline/version.map: rte_swx_pipeline_config
	/root/SUSE15-64_K5.3.18_Clang9.0.1/x86_64-native-linuxapp-clang/506f606f3ab6446786cf88da564f1b7c/dpdk/lib/pipeline/version.map: rte_swx_pipeline_extern_func_register
	/root/SUSE15-64_K5.3.18_Clang9.0.1/x86_64-native-linuxapp-clang/506f606f3ab6446786cf88da564f1b7c/dpdk/lib/pipeline/version.map: rte_swx_pipeline_extern_object_config
	/root/SUSE15-64_K5.3.18_Clang9.0.1/x86_64-native-linuxapp-clang/506f606f3ab6446786cf88da564f1b7c/dpdk/lib/pipeline/version.map: rte_swx_pipeline_extern_type_member_func_register
	/root/SUSE15-64_K5.3.18_Clang9.0.1/x86_64-native-linuxapp-clang/506f606f3ab6446786cf88da564f1b7c/dpdk/lib/pipeline/version.map: rte_swx_pipeline_extern_type_register
	/root/SUSE15-64_K5.3.18_Clang9.0.1/x86_64-native-linuxapp-clang/506f606f3ab6446786cf88da564f1b7c/dpdk/lib/pipeline/version.map: rte_swx_pipeline_flush
	/root/SUSE15-64_K5.3.18_Clang9.0.1/x86_64-native-linuxapp-clang/506f606f3ab6446786cf88da564f1b7c/dpdk/lib/pipeline/version.map: rte_swx_pipeline_free
	/root/SUSE15-64_K5.3.18_Clang9.0.1/x86_64-native-linuxapp-clang/506f606f3ab6446786cf88da564f1b7c/dpdk/lib/pipeline/version.map: rte_swx_pipeline_instructions_config
	/root/SUSE15-64_K5.3.18_Clang9.0.1/x86_64-native-linuxapp-clang/506f606f3ab6446786cf88da564f1b7c/dpdk/lib/pipeline/version.map: rte_swx_pipeline_packet_header_register
	/root/SUSE15-64_K5.3.18_Clang9.0.1/x86_64-native-linuxapp-clang/506f606f3ab6446786cf88da564f1b7c/dpdk/lib/pipeline/version.map: rte_swx_pipeline_packet_metadata_register
	/root/SUSE15-64_K5.3.18_Clang9.0.1/x86_64-native-linuxapp-clang/506f606f3ab6446786cf88da564f1b7c/dpdk/lib/pipeline/version.map: rte_swx_pipeline_port_in_config
	/root/SUSE15-64_K5.3.18_Clang9.0.1/x86_64-native-linuxapp-clang/506f606f3ab6446786cf88da564f1b7c/dpdk/lib/pipeline/version.map: rte_swx_pipeline_port_in_type_register
	/root/SUSE15-64_K5.3.18_Clang9.0.1/x86_64-native-linuxapp-clang/506f606f3ab6446786cf88da564f1b7c/dpdk/lib/pipeline/version.map: rte_swx_pipeline_port_out_config
	/root/SUSE15-64_K5.3.18_Clang9.0.1/x86_64-native-linuxapp-clang/506f606f3ab6446786cf88da564f1b7c/dpdk/lib/pipeline/version.map: rte_swx_pipeline_port_out_type_register
	/root/SUSE15-64_K5.3.18_Clang9.0.1/x86_64-native-linuxapp-clang/506f606f3ab6446786cf88da564f1b7c/dpdk/lib/pipeline/version.map: rte_swx_pipeline_run
	/root/SUSE15-64_K5.3.18_Clang9.0.1/x86_64-native-linuxapp-clang/506f606f3ab6446786cf88da564f1b7c/dpdk/lib/pipeline/version.map: rte_swx_pipeline_struct_type_register
	/root/SUSE15-64_K5.3.18_Clang9.0.1/x86_64-native-linuxapp-clang/506f606f3ab6446786cf88da564f1b7c/dpdk/lib/pipeline/version.map: rte_swx_pipeline_table_config
	/root/SUSE15-64_K5.3.18_Clang9.0.1/x86_64-native-linuxapp-clang/506f606f3ab6446786cf88da564f1b7c/dpdk/lib/pipeline/version.map: rte_swx_pipeline_table_state_get
	/root/SUSE15-64_K5.3.18_Clang9.0.1/x86_64-native-linuxapp-clang/506f606f3ab6446786cf88da564f1b7c/dpdk/lib/pipeline/version.map: rte_swx_pipeline_table_state_set
	/root/SUSE15-64_K5.3.18_Clang9.0.1/x86_64-native-linuxapp-clang/506f606f3ab6446786cf88da564f1b7c/dpdk/lib/pipeline/version.map: rte_swx_pipeline_table_type_register
	/root/SUSE15-64_K5.3.18_Clang9.0.1/x86_64-native-linuxapp-clang/506f606f3ab6446786cf88da564f1b7c/dpdk/lib/pipeline/version.map: rte_swx_ctl_metarray_info_get
	/root/SUSE15-64_K5.3.18_Clang9.0.1/x86_64-native-linuxapp-clang/506f606f3ab6446786cf88da564f1b7c/dpdk/lib/pipeline/version.map: rte_swx_ctl_meter_profile_add
	/root/SUSE15-64_K5.3.18_Clang9.0.1/x86_64-native-linuxapp-clang/506f606f3ab6446786cf88da564f1b7c/dpdk/lib/pipeline/version.map: rte_swx_ctl_meter_profile_delete
	/root/SUSE15-64_K5.3.18_Clang9.0.1/x86_64-native-linuxapp-clang/506f606f3ab6446786cf88da564f1b7c/dpdk/lib/pipeline/version.map: rte_swx_ctl_meter_reset
	/root/SUSE15-64_K5.3.18_Clang9.0.1/x86_64-native-linuxapp-clang/506f606f3ab6446786cf88da564f1b7c/dpdk/lib/pipeline/version.map: rte_swx_ctl_meter_set
	/root/SUSE15-64_K5.3.18_Clang9.0.1/x86_64-native-linuxapp-clang/506f606f3ab6446786cf88da564f1b7c/dpdk/lib/pipeline/version.map: rte_swx_ctl_meter_stats_read
	/root/SUSE15-64_K5.3.18_Clang9.0.1/x86_64-native-linuxapp-clang/506f606f3ab6446786cf88da564f1b7c/dpdk/lib/pipeline/version.map: rte_swx_ctl_pipeline_regarray_read
	/root/SUSE15-64_K5.3.18_Clang9.0.1/x86_64-native-linuxapp-clang/506f606f3ab6446786cf88da564f1b7c/dpdk/lib/pipeline/version.map: rte_swx_ctl_pipeline_regarray_write
	/root/SUSE15-64_K5.3.18_Clang9.0.1/x86_64-native-linuxapp-clang/506f606f3ab6446786cf88da564f1b7c/dpdk/lib/pipeline/version.map: rte_swx_ctl_pipeline_table_stats_read
	/root/SUSE15-64_K5.3.18_Clang9.0.1/x86_64-native-linuxapp-clang/506f606f3ab6446786cf88da564f1b7c/dpdk/lib/pipeline/version.map: rte_swx_ctl_regarray_info_get
	/root/SUSE15-64_K5.3.18_Clang9.0.1/x86_64-native-linuxapp-clang/506f606f3ab6446786cf88da564f1b7c/dpdk/lib/pipeline/version.map: rte_swx_pipeline_metarray_config
	/root/SUSE15-64_K5.3.18_Clang9.0.1/x86_64-native-linuxapp-clang/506f606f3ab6446786cf88da564f1b7c/dpdk/lib/pipeline/version.map: rte_swx_pipeline_regarray_config
	/root/SUSE15-64_K5.3.18_Clang9.0.1/x86_64-native-linuxapp-clang/506f606f3ab6446786cf88da564f1b7c/dpdk/lib/pipeline/version.map: rte_swx_pipeline_selector_config
	/root/SUSE15-64_K5.3.18_Clang9.0.1/x86_64-native-linuxapp-clang/506f606f3ab6446786cf88da564f1b7c/dpdk/lib/pipeline/version.map: rte_swx_ctl_pipeline_selector_fprintf
	/root/SUSE15-64_K5.3.18_Clang9.0.1/x86_64-native-linuxapp-clang/506f606f3ab6446786cf88da564f1b7c/dpdk/lib/pipeline/version.map: rte_swx_ctl_pipeline_selector_group_add
	/root/SUSE15-64_K5.3.18_Clang9.0.1/x86_64-native-linuxapp-clang/506f606f3ab6446786cf88da564f1b7c/dpdk/lib/pipeline/version.map: rte_swx_ctl_pipeline_selector_group_delete
	/root/SUSE15-64_K5.3.18_Clang9.0.1/x86_64-native-linuxapp-clang/506f606f3ab6446786cf88da564f1b7c/dpdk/lib/pipeline/version.map: rte_swx_ctl_pipeline_selector_group_member_add
	/root/SUSE15-64_K5.3.18_Clang9.0.1/x86_64-native-linuxapp-clang/506f606f3ab6446786cf88da564f1b7c/dpdk/lib/pipeline/version.map: rte_swx_ctl_pipeline_selector_group_member_delete
	/root/SUSE15-64_K5.3.18_Clang9.0.1/x86_64-native-linuxapp-clang/506f606f3ab6446786cf88da564f1b7c/dpdk/lib/pipeline/version.map: rte_swx_ctl_pipeline_selector_stats_read
	/root/SUSE15-64_K5.3.18_Clang9.0.1/x86_64-native-linuxapp-clang/506f606f3ab6446786cf88da564f1b7c/dpdk/lib/pipeline/version.map: rte_swx_ctl_selector_info_get
	/root/SUSE15-64_K5.3.18_Clang9.0.1/x86_64-native-linuxapp-clang/506f606f3ab6446786cf88da564f1b7c/dpdk/lib/pipeline/version.map: rte_swx_ctl_selector_field_info_get
	/root/SUSE15-64_K5.3.18_Clang9.0.1/x86_64-native-linuxapp-clang/506f606f3ab6446786cf88da564f1b7c/dpdk/lib/pipeline/version.map: rte_swx_ctl_selector_group_id_field_info_get
	/root/SUSE15-64_K5.3.18_Clang9.0.1/x86_64-native-linuxapp-clang/506f606f3ab6446786cf88da564f1b7c/dpdk/lib/pipeline/version.map: rte_swx_ctl_selector_member_id_field_info_get
	/root/SUSE15-64_K5.3.18_Clang9.0.1/x86_64-native-linuxapp-clang/506f606f3ab6446786cf88da564f1b7c/dpdk/lib/pipeline/version.map: rte_swx_ctl_pipeline_learner_default_entry_add
	/root/SUSE15-64_K5.3.18_Clang9.0.1/x86_64-native-linuxapp-clang/506f606f3ab6446786cf88da564f1b7c/dpdk/lib/pipeline/version.map: rte_swx_ctl_pipeline_learner_default_entry_read
	/root/SUSE15-64_K5.3.18_Clang9.0.1/x86_64-native-linuxapp-clang/506f606f3ab6446786cf88da564f1b7c/dpdk/lib/pipeline/version.map: rte_swx_ctl_pipeline_learner_stats_read
	/root/SUSE15-64_K5.3.18_Clang9.0.1/x86_64-native-linuxapp-clang/506f606f3ab6446786cf88da564f1b7c/dpdk/lib/pipeline/version.map: rte_swx_ctl_learner_action_info_get
	/root/SUSE15-64_K5.3.18_Clang9.0.1/x86_64-native-linuxapp-clang/506f606f3ab6446786cf88da564f1b7c/dpdk/lib/pipeline/version.map: rte_swx_ctl_learner_info_get
	/root/SUSE15-64_K5.3.18_Clang9.0.1/x86_64-native-linuxapp-clang/506f606f3ab6446786cf88da564f1b7c/dpdk/lib/pipeline/version.map: rte_swx_ctl_learner_match_field_info_get
	/root/SUSE15-64_K5.3.18_Clang9.0.1/x86_64-native-linuxapp-clang/506f606f3ab6446786cf88da564f1b7c/dpdk/lib/pipeline/version.map: rte_swx_pipeline_learner_config
grep: /root/SUSE15-64_K5.3.18_Clang9.0.1/x86_64-native-linuxapp-clang/506f606f3ab6446786cf88da564f1b7c/dpdk/lib/pipeline: No such file or directory
grep: /root/SUSE15-64_K5.3.18_Clang9.0.1/x86_64-native-linuxapp-clang/506f606f3ab6446786cf88da564f1b7c/dpdk/lib/pipeline: No such file or directory
grep: /root/SUSE15-64_K5.3.18_Clang9.0.1/x86_64-native-linuxapp-clang/506f606f3ab6446786cf88da564f1b7c/dpdk/lib/pipeline: No such file or directory
grep: /root/SUSE15-64_K5.3.18_Clang9.0.1/x86_64-native-linuxapp-clang/506f606f3ab6446786cf88da564f1b7c/dpdk/lib/pipeline: No such file or directory
grep: /root/SUSE15-64_K5.3.18_Clang9.0.1/x86_64-native-linuxapp-clang/506f606f3ab6446786cf88da564f1b7c/dpdk/lib/pipeline: No such file or directory
grep: /root/SUSE15-64_K5.3.18_Clang9.0.1/x86_64-native-linuxapp-clang/506f606f3ab6446786cf88da564f1b7c/dpdk/lib/pipeline: No such file or directory
grep: /root/SUSE15-64_K5.3.18_Clang9.0.1/x86_64-native-linuxapp-clang/506f606f3ab6446786cf88da564f1b7c/dpdk/lib/pipeline: No such file or directory
grep: /root/SUSE15-64_K5.3.18_Clang9.0.1/x86_64-native-linuxapp-clang/506f606f3ab6446786cf88da564f1b7c/dpdk/lib/pipeline: No such file or directory
grep: /root/SUSE15-64_K5.3.18_Clang9.0.1/x86_64-native-linuxapp-clang/506f606f3ab6446786cf88da564f1b7c/dpdk/lib/pipeline: No such file or directory
grep: /root/SUSE15-64_K5.3.18_Clang9.0.1/x86_64-native-linuxapp-clang/506f606f3ab6446786cf88da564f1b7c/dpdk/lib/pipeline: No such file or directory
grep: /root/SUSE15-64_K5.3.18_Clang9.0.1/x86_64-native-linuxapp-clang/506f606f3ab6446786cf88da564f1b7c/dpdk/lib/pipeline: No such file or directory
grep: /root/SUSE15-64_K5.3.18_Clang9.0.1/x86_64-native-linuxapp-clang/506f606f3ab6446786cf88da564f1b7c/dpdk/lib/pipeline: No such file or directory
grep: /root/SUSE15-64_K5.3.18_Clang9.0.1/x86_64-native-linuxapp-clang/506f606f3ab6446786cf88da564f1b7c/dpdk/lib/pipeline: No such file or directory
grep: /root/SUSE15-64_K5.3.18_Clang9.0.1/x86_64-native-linuxapp-clang/506f606f3ab6446786cf88da564f1b7c/dpdk/lib/pipeline: No such file or directory
grep: /root/SUSE15-64_K5.3.18_Clang9.0.1/x86_64-native-linuxapp-clang/506f606f3ab6446786cf88da564f1b7c/dpdk/lib/pipeline: No such file or directory
grep: /root/SUSE15-64_K5.3.18_Clang9.0.1/x86_64-native-linuxapp-clang/506f606f3ab6446786cf88da564f1b7c/dpdk/lib/pipeline: No such file or directory
grep: /root/SUSE15-64_K5.3.18_Clang9.0.1/x86_64-native-linuxapp-clang/506f606f3ab6446786cf88da564f1b7c/dpdk/lib/pipeline: No such file or directory
grep: /root/SUSE15-64_K5.3.18_Clang9.0.1/x86_64-native-linuxapp-clang/506f606f3ab6446786cf88da564f1b7c/dpdk/lib/pipeline: No such file or directory
grep: /root/SUSE15-64_K5.3.18_Clang9.0.1/x86_64-native-linuxapp-clang/506f606f3ab6446786cf88da564f1b7c/dpdk/lib/pipeline: No such file or directory
grep: /root/SUSE15-64_K5.3.18_Clang9.0.1/x86_64-native-linuxapp-clang/506f606f3ab6446786cf88da564f1b7c/dpdk/lib/pipeline: No such file or directory
grep: /root/SUSE15-64_K5.3.18_Clang9.0.1/x86_64-native-linuxapp-clang/506f606f3ab6446786cf88da564f1b7c/dpdk/lib/pipeline: No such file or directory
grep: /root/SUSE15-64_K5.3.18_Clang9.0.1/x86_64-native-linuxapp-clang/506f606f3ab6446786cf88da564f1b7c/dpdk/lib/pipeline: No such file or directory
grep: /root/SUSE15-64_K5.3.18_Clang9.0.1/x86_64-native-linuxapp-clang/506f606f3ab6446786cf88da564f1b7c/dpdk/lib/pipeline: No such file or directory
grep: /root/SUSE15-64_K5.3.18_Clang9.0.1/x86_64-native-linuxapp-clang/506f606f3ab6446786cf88da564f1b7c/dpdk/lib/pipeline: No such file or directory
grep: /root/SUSE15-64_K5.3.18_Clang9.0.1/x86_64-native-linuxapp-clang/506f606f3ab6446786cf88da564f1b7c/dpdk/lib/pipeline: No such file or directory
grep: /root/SUSE15-64_K5.3.18_Clang9.0.1/x86_64-native-linuxapp-clang/506f606f3ab6446786cf88da564f1b7c/dpdk/lib/pipeline: No such file or directory
grep: /root/SUSE15-64_K5.3.18_Clang9.0.1/x86_64-native-linuxapp-clang/506f606f3ab6446786cf88da564f1b7c/dpdk/lib/pipeline: No such file or directory
grep: /root/SUSE15-64_K5.3.18_Clang9.0.1/x86_64-native-linuxapp-clang/506f606f3ab6446786cf88da564f1b7c/dpdk/lib/pipeline: No such file or directory
grep: /root/SUSE15-64_K5.3.18_Clang9.0.1/x86_64-native-linuxapp-clang/506f606f3ab6446786cf88da564f1b7c/dpdk/lib/pipeline: No such file or directory
grep: /root/SUSE15-64_K5.3.18_Clang9.0.1/x86_64-native-linuxapp-clang/506f606f3ab6446786cf88da564f1b7c/dpdk/lib/pipeline: No such file or directory
grep: /root/SUSE15-64_K5.3.18_Clang9.0.1/x86_64-native-linuxapp-clang/506f606f3ab6446786cf88da564f1b7c/dpdk/lib/pipeline: No such file or directory
grep: /root/SUSE15-64_K5.3.18_Clang9.0.1/x86_64-native-linuxapp-clang/506f606f3ab6446786cf88da564f1b7c/dpdk/lib/pipeline: No such file or directory
grep: /root/SUSE15-64_K5.3.18_Clang9.0.1/x86_64-native-linuxapp-clang/506f606f3ab6446786cf88da564f1b7c/dpdk/lib/pipeline: No such file or directory
grep: /root/SUSE15-64_K5.3.18_Clang9.0.1/x86_64-native-linuxapp-clang/506f606f3ab6446786cf88da564f1b7c/dpdk/lib/pipeline: No such file or directory
grep: /root/SUSE15-64_K5.3.18_Clang9.0.1/x86_64-native-linuxapp-clang/506f606f3ab6446786cf88da564f1b7c/dpdk/lib/pipeline: No such file or directory
grep: /root/SUSE15-64_K5.3.18_Clang9.0.1/x86_64-native-linuxapp-clang/506f606f3ab6446786cf88da564f1b7c/dpdk/lib/pipeline: No such file or directory
grep: /root/SUSE15-64_K5.3.18_Clang9.0.1/x86_64-native-linuxapp-clang/506f606f3ab6446786cf88da564f1b7c/dpdk/lib/pipeline: No such file or directory
grep: /root/SUSE15-64_K5.3.18_Clang9.0.1/x86_64-native-linuxapp-clang/506f606f3ab6446786cf88da564f1b7c/dpdk/lib/pipeline: No such file or directory
grep: /root/SUSE15-64_K5.3.18_Clang9.0.1/x86_64-native-linuxapp-clang/506f606f3ab6446786cf88da564f1b7c/dpdk/lib/pipeline: No such file or directory
grep: /root/SUSE15-64_K5.3.18_Clang9.0.1/x86_64-native-linuxapp-clang/506f606f3ab6446786cf88da564f1b7c/dpdk/lib/pipeline: No such file or directory
grep: /root/SUSE15-64_K5.3.18_Clang9.0.1/x86_64-native-linuxapp-clang/506f606f3ab6446786cf88da564f1b7c/dpdk/lib/pipeline: No such file or directory
grep: /root/SUSE15-64_K5.3.18_Clang9.0.1/x86_64-native-linuxapp-clang/506f606f3ab6446786cf88da564f1b7c/dpdk/lib/pipeline: No such file or directory
grep: /root/SUSE15-64_K5.3.18_Clang9.0.1/x86_64-native-linuxapp-clang/506f606f3ab6446786cf88da564f1b7c/dpdk/lib/pipeline: No such file or directory
grep: /root/SUSE15-64_K5.3.18_Clang9.0.1/x86_64-native-linuxapp-clang/506f606f3ab6446786cf88da564f1b7c/dpdk/lib/pipeline: No such file or directory
grep: /root/SUSE15-64_K5.3.18_Clang9.0.1/x86_64-native-linuxapp-clang/506f606f3ab6446786cf88da564f1b7c/dpdk/lib/pipeline: No such file or directory
grep: /root/SUSE15-64_K5.3.18_Clang9.0.1/x86_64-native-linuxapp-clang/506f606f3ab6446786cf88da564f1b7c/dpdk/lib/pipeline: No such file or directory
grep: /root/SUSE15-64_K5.3.18_Clang9.0.1/x86_64-native-linuxapp-clang/506f606f3ab6446786cf88da564f1b7c/dpdk/lib/pipeline: No such file or directory
grep: /root/SUSE15-64_K5.3.18_Clang9.0.1/x86_64-native-linuxapp-clang/506f606f3ab6446786cf88da564f1b7c/dpdk/lib/pipeline: No such file or directory
grep: /root/SUSE15-64_K5.3.18_Clang9.0.1/x86_64-native-linuxapp-clang/506f606f3ab6446786cf88da564f1b7c/dpdk/lib/pipeline: No such file or directory
grep: /root/SUSE15-64_K5.3.18_Clang9.0.1/x86_64-native-linuxapp-clang/506f606f3ab6446786cf88da564f1b7c/dpdk/lib/pipeline: No such file or directory
grep: /root/SUSE15-64_K5.3.18_Clang9.0.1/x86_64-native-linuxapp-clang/506f606f3ab6446786cf88da564f1b7c/dpdk/lib/pipeline: No such file or directory
grep: /root/SUSE15-64_K5.3.18_Clang9.0.1/x86_64-native-linuxapp-clang/506f606f3ab6446786cf88da564f1b7c/dpdk/lib/pipeline: No such file or directory
grep: /root/SUSE15-64_K5.3.18_Clang9.0.1/x86_64-native-linuxapp-clang/506f606f3ab6446786cf88da564f1b7c/dpdk/lib/pipeline: No such file or directory
grep: /root/SUSE15-64_K5.3.18_Clang9.0.1/x86_64-native-linuxapp-clang/506f606f3ab6446786cf88da564f1b7c/dpdk/lib/pipeline: No such file or directory
grep: /root/SUSE15-64_K5.3.18_Clang9.0.1/x86_64-native-linuxapp-clang/506f606f3ab6446786cf88da564f1b7c/dpdk/lib/pipeline: No such file or directory
grep: /root/SUSE15-64_K5.3.18_Clang9.0.1/x86_64-native-linuxapp-clang/506f606f3ab6446786cf88da564f1b7c/dpdk/lib/pipeline: No such file or directory
grep: /root/SUSE15-64_K5.3.18_Clang9.0.1/x86_64-native-linuxapp-clang/506f606f3ab6446786cf88da564f1b7c/dpdk/lib/pipeline: No such file or directory
grep: /root/SUSE15-64_K5.3.18_Clang9.0.1/x86_64-native-linuxapp-clang/506f606f3ab6446786cf88da564f1b7c/dpdk/lib/pipeline: No such file or directory
grep: /root/SUSE15-64_K5.3.18_Clang9.0.1/x86_64-native-linuxapp-clang/506f606f3ab6446786cf88da564f1b7c/dpdk/lib/pipeline: No such file or directory
grep: /root/SUSE15-64_K5.3.18_Clang9.0.1/x86_64-native-linuxapp-clang/506f606f3ab6446786cf88da564f1b7c/dpdk/lib/pipeline: No such file or directory
grep: /root/SUSE15-64_K5.3.18_Clang9.0.1/x86_64-native-linuxapp-clang/506f606f3ab6446786cf88da564f1b7c/dpdk/lib/pipeline: No such file or directory
grep: /root/SUSE15-64_K5.3.18_Clang9.0.1/x86_64-native-linuxapp-clang/506f606f3ab6446786cf88da564f1b7c/dpdk/lib/pipeline: No such file or directory
grep: /root/SUSE15-64_K5.3.18_Clang9.0.1/x86_64-native-linuxapp-clang/506f606f3ab6446786cf88da564f1b7c/dpdk/lib/pipeline: No such file or directory
grep: /root/SUSE15-64_K5.3.18_Clang9.0.1/x86_64-native-linuxapp-clang/506f606f3ab6446786cf88da564f1b7c/dpdk/lib/pipeline: No such file or directory
grep: /root/SUSE15-64_K5.3.18_Clang9.0.1/x86_64-native-linuxapp-clang/506f606f3ab6446786cf88da564f1b7c/dpdk/lib/pipeline: No such file or directory
grep: /root/SUSE15-64_K5.3.18_Clang9.0.1/x86_64-native-linuxapp-clang/506f606f3ab6446786cf88da564f1b7c/dpdk/lib/pipeline: No such file or directory
grep: /root/SUSE15-64_K5.3.18_Clang9.0.1/x86_64-native-linuxapp-clang/506f606f3ab6446786cf88da564f1b7c/dpdk/lib/pipeline: No such file or directory
grep: /root/SUSE15-64_K5.3.18_Clang9.0.1/x86_64-native-linuxapp-clang/506f606f3ab6446786cf88da564f1b7c/dpdk/lib/pipeline: No such file or directory
grep: /root/SUSE15-64_K5.3.18_Clang9.0.1/x86_64-native-linuxapp-clang/506f606f3ab6446786cf88da564f1b7c/dpdk/lib/pipeline: No such file or directory
grep: /root/SUSE15-64_K5.3.18_Clang9.0.1/x86_64-native-linuxapp-clang/506f606f3ab6446786cf88da564f1b7c/dpdk/lib/pipeline: No such file or directory
grep: /root/SUSE15-64_K5.3.18_Clang9.0.1/x86_64-native-linuxapp-clang/506f606f3ab6446786cf88da564f1b7c/dpdk/lib/pipeline: No such file or directory
grep: /root/SUSE15-64_K5.3.18_Clang9.0.1/x86_64-native-linuxapp-clang/506f606f3ab6446786cf88da564f1b7c/dpdk/lib/pipeline: No such file or directory
grep: /root/SUSE15-64_K5.3.18_Clang9.0.1/x86_64-native-linuxapp-clang/506f606f3ab6446786cf88da564f1b7c/dpdk/lib/pipeline: No such file or directory
grep: /root/SUSE15-64_K5.3.18_Clang9.0.1/x86_64-native-linuxapp-clang/506f606f3ab6446786cf88da564f1b7c/dpdk/lib/pipeline: No such file or directory
grep: /root/SUSE15-64_K5.3.18_Clang9.0.1/x86_64-native-linuxapp-clang/506f606f3ab6446786cf88da564f1b7c/dpdk/lib/pipeline: No such file or directory
grep: /root/SUSE15-64_K5.3.18_Clang9.0.1/x86_64-native-linuxapp-clang/506f606f3ab6446786cf88da564f1b7c/dpdk/lib/pipeline: No such file or directory
grep: /root/SUSE15-64_K5.3.18_Clang9.0.1/x86_64-native-linuxapp-clang/506f606f3ab6446786cf88da564f1b7c/dpdk/lib/pipeline: No such file or directory
grep: /root/SUSE15-64_K5.3.18_Clang9.0.1/x86_64-native-linuxapp-clang/506f606f3ab6446786cf88da564f1b7c/dpdk/lib/pipeline: No such file or directory
grep: /root/SUSE15-64_K5.3.18_Clang9.0.1/x86_64-native-linuxapp-clang/506f606f3ab6446786cf88da564f1b7c/dpdk/lib/pipeline: No such file or directory
grep: /root/SUSE15-64_K5.3.18_Clang9.0.1/x86_64-native-linuxapp-clang/506f606f3ab6446786cf88da564f1b7c/dpdk/lib/pipeline: No such file or directory
grep: /root/SUSE15-64_K5.3.18_Clang9.0.1/x86_64-native-linuxapp-clang/506f606f3ab6446786cf88da564f1b7c/dpdk/lib/pipeline: No such file or directory
grep: /root/SUSE15-64_K5.3.18_Clang9.0.1/x86_64-native-linuxapp-clang/506f606f3ab6446786cf88da564f1b7c/dpdk/lib/pipeline: No such file or directory
grep: /root/SUSE15-64_K5.3.18_Clang9.0.1/x86_64-native-linuxapp-clang/506f606f3ab6446786cf88da564f1b7c/dpdk/lib/pipeline: No such file or directory
grep: /root/SUSE15-64_K5.3.18_Clang9.0.1/x86_64-native-linuxapp-clang/506f606f3ab6446786cf88da564f1b7c/dpdk/lib/pipeline: No such file or directory
grep: /root/SUSE15-64_K5.3.18_Clang9.0.1/x86_64-native-linuxapp-clang/506f606f3ab6446786cf88da564f1b7c/dpdk/lib/pipeline: No such file or directory
grep: /root/SUSE15-64_K5.3.18_Clang9.0.1/x86_64-native-linuxapp-clang/506f606f3ab6446786cf88da564f1b7c/dpdk/lib/pipeline: No such file or directory
grep: /root/SUSE15-64_K5.3.18_Clang9.0.1/x86_64-native-linuxapp-clang/506f606f3ab6446786cf88da564f1b7c/dpdk/lib/pipeline: No such file or directory
grep: /root/SUSE15-64_K5.3.18_Clang9.0.1/x86_64-native-linuxapp-clang/506f606f3ab6446786cf88da564f1b7c/dpdk/lib/pipeline: No such file or directory
grep: /root/SUSE15-64_K5.3.18_Clang9.0.1/x86_64-native-linuxapp-clang/506f606f3ab6446786cf88da564f1b7c/dpdk/lib/pipeline: No such file or directory
/root/SUSE15-64_K5.3.18_Clang9.0.1/x86_64-native-linuxapp-clang/506f606f3ab6446786cf88da564f1b7c/dpdk/devtools/check-symbol-maps.sh: line 44: buildtools/map-list-symbol.sh: No such file or directory
/root/SUSE15-64_K5.3.18_Clang9.0.1/x86_64-native-linuxapp-clang/506f606f3ab6446786cf88da564f1b7c/dpdk/buildtools/check-symbols.sh: line 33: /root/SUSE15-64_K5.3.18_Clang9.0.1/x86_64-native-linuxapp-clang/506f606f3ab6446786cf88da564f1b7c/dpdk/buildtools/map-list-symbol.sh: No such file or directory
/root/SUSE15-64_K5.3.18_Clang9.0.1/x86_64-native-linuxapp-clang/506f606f3ab6446786cf88da564f1b7c/dpdk/buildtools/check-symbols.sh: line 55: /root/SUSE15-64_K5.3.18_Clang9.0.1/x86_64-native-linuxapp-clang/506f606f3ab6446786cf88da564f1b7c/dpdk/buildtools/map-list-symbol.sh: No such file or directory
rte_port_in_action_apply is flagged as experimental
but is not listed in version map
Please add rte_port_in_action_apply to the version map
/root/SUSE15-64_K5.3.18_Clang9.0.1/x86_64-native-linuxapp-clang/506f606f3ab6446786cf88da564f1b7c/dpdk/buildtools/check-symbols.sh: line 55: /root/SUSE15-64_K5.3.18_Clang9.0.1/x86_64-native-linuxapp-clang/506f606f3ab6446786cf88da564f1b7c/dpdk/buildtools/map-list-symbol.sh: No such file or directory
rte_port_in_action_create is flagged as experimental
but is not listed in version map
Please add rte_port_in_action_create to the version map
/root/SUSE15-64_K5.3.18_Clang9.0.1/x86_64-native-linuxapp-clang/506f606f3ab6446786cf88da564f1b7c/dpdk/buildtools/check-symbols.sh: line 55: /root/SUSE15-64_K5.3.18_Clang9.0.1/x86_64-native-linuxapp-clang/506f606f3ab6446786cf88da564f1b7c/dpdk/buildtools/map-list-symbol.sh: No such file or directory
rte_port_in_action_free is flagged as experimental
but is not listed in version map
Please add rte_port_in_action_free to the version map
/root/SUSE15-64_K5.3.18_Clang9.0.1/x86_64-native-linuxapp-clang/506f606f3ab6446786cf88da564f1b7c/dpdk/buildtools/check-symbols.sh: line 55: /root/SUSE15-64_K5.3.18_Clang9.0.1/x86_64-native-linuxapp-clang/506f606f3ab6446786cf88da564f1b7c/dpdk/buildtools/map-list-symbol.sh: No such file or directory
rte_port_in_action_params_get is flagged as experimental
but is not listed in version map
Please add rte_port_in_action_params_get to the version map
/root/SUSE15-64_K5.3.18_Clang9.0.1/x86_64-native-linuxapp-clang/506f606f3ab6446786cf88da564f1b7c/dpdk/buildtools/check-symbols.sh: line 55: /root/SUSE15-64_K5.3.18_Clang9.0.1/x86_64-native-linuxapp-clang/506f606f3ab6446786cf88da564f1b7c/dpdk/buildtools/map-list-symbol.sh: No such file or directory
rte_port_in_action_profile_action_register is flagged as experimental
but is not listed in version map
Please add rte_port_in_action_profile_action_register to the version map
/root/SUSE15-64_K5.3.18_Clang9.0.1/x86_64-native-linuxapp-clang/506f606f3ab6446786cf88da564f1b7c/dpdk/buildtools/check-symbols.sh: line 55: /root/SUSE15-64_K5.3.18_Clang9.0.1/x86_64-native-linuxapp-clang/506f606f3ab6446786cf88da564f1b7c/dpdk/buildtools/map-list-symbol.sh: No such file or directory
rte_port_in_action_profile_create is flagged as experimental
but is not listed in version map
Please add rte_port_in_action_profile_create to the version map
/root/SUSE15-64_K5.3.18_Clang9.0.1/x86_64-native-linuxapp-clang/506f606f3ab6446786cf88da564f1b7c/dpdk/buildtools/check-symbols.sh: line 55: /root/SUSE15-64_K5.3.18_Clang9.0.1/x86_64-native-linuxapp-clang/506f606f3ab6446786cf88da564f1b7c/dpdk/buildtools/map-list-symbol.sh: No such file or directory
rte_port_in_action_profile_free is flagged as experimental
but is not listed in version map
Please add rte_port_in_action_profile_free to the version map
/root/SUSE15-64_K5.3.18_Clang9.0.1/x86_64-native-linuxapp-clang/506f606f3ab6446786cf88da564f1b7c/dpdk/buildtools/check-symbols.sh: line 55: /root/SUSE15-64_K5.3.18_Clang9.0.1/x86_64-native-linuxapp-clang/506f606f3ab6446786cf88da564f1b7c/dpdk/buildtools/map-list-symbol.sh: No such file or directory
rte_port_in_action_profile_freeze is flagged as experimental
but is not listed in version map
Please add rte_port_in_action_profile_freeze to the version map
/root/SUSE15-64_K5.3.18_Clang9.0.1/x86_64-native-linuxapp-clang/506f606f3ab6446786cf88da564f1b7c/dpdk/buildtools/check-symbols.sh: line 55: /root/SUSE15-64_K5.3.18_Clang9.0.1/x86_64-native-linuxapp-clang/506f606f3ab6446786cf88da564f1b7c/dpdk/buildtools/map-list-symbol.sh: No such file or directory
rte_table_action_apply is flagged as experimental
but is not listed in version map
Please add rte_table_action_apply to the version map
/root/SUSE15-64_K5.3.18_Clang9.0.1/x86_64-native-linuxapp-clang/506f606f3ab6446786cf88da564f1b7c/dpdk/buildtools/check-symbols.sh: line 55: /root/SUSE15-64_K5.3.18_Clang9.0.1/x86_64-native-linuxapp-clang/506f606f3ab6446786cf88da564f1b7c/dpdk/buildtools/map-list-symbol.sh: No such file or directory
rte_table_action_create is flagged as experimental
but is not listed in version map
Please add rte_table_action_create to the version map
/root/SUSE15-64_K5.3.18_Clang9.0.1/x86_64-native-linuxapp-clang/506f606f3ab6446786cf88da564f1b7c/dpdk/buildtools/check-symbols.sh: line 55: /root/SUSE15-64_K5.3.18_Clang9.0.1/x86_64-native-linuxapp-clang/506f606f3ab6446786cf88da564f1b7c/dpdk/buildtools/map-list-symbol.sh: No such file or directory
rte_table_action_crypto_sym_session_get is flagged as experimental
but is not listed in version map
Please add rte_table_action_crypto_sym_session_get to the version map
/root/SUSE15-64_K5.3.18_Clang9.0.1/x86_64-native-linuxapp-clang/506f606f3ab6446786cf88da564f1b7c/dpdk/buildtools/check-symbols.sh: line 55: /root/SUSE15-64_K5.3.18_Clang9.0.1/x86_64-native-linuxapp-clang/506f606f3ab6446786cf88da564f1b7c/dpdk/buildtools/map-list-symbol.sh: No such file or directory
rte_table_action_dscp_table_update is flagged as experimental
but is not listed in version map
Please add rte_table_action_dscp_table_update to the version map
/root/SUSE15-64_K5.3.18_Clang9.0.1/x86_64-native-linuxapp-clang/506f606f3ab6446786cf88da564f1b7c/dpdk/buildtools/check-symbols.sh: line 55: /root/SUSE15-64_K5.3.18_Clang9.0.1/x86_64-native-linuxapp-clang/506f606f3ab6446786cf88da564f1b7c/dpdk/buildtools/map-list-symbol.sh: No such file or directory
rte_table_action_free is flagged as experimental
but is not listed in version map
Please add rte_table_action_free to the version map
/root/SUSE15-64_K5.3.18_Clang9.0.1/x86_64-native-linuxapp-clang/506f606f3ab6446786cf88da564f1b7c/dpdk/buildtools/check-symbols.sh: line 55: /root/SUSE15-64_K5.3.18_Clang9.0.1/x86_64-native-linuxapp-clang/506f606f3ab6446786cf88da564f1b7c/dpdk/buildtools/map-list-symbol.sh: No such file or directory
rte_table_action_meter_profile_add is flagged as experimental
but is not listed in version map
Please add rte_table_action_meter_profile_add to the version map
/root/SUSE15-64_K5.3.18_Clang9.0.1/x86_64-native-linuxapp-clang/506f606f3ab6446786cf88da564f1b7c/dpdk/buildtools/check-symbols.sh: line 55: /root/SUSE15-64_K5.3.18_Clang9.0.1/x86_64-native-linuxapp-clang/506f606f3ab6446786cf88da564f1b7c/dpdk/buildtools/map-list-symbol.sh: No such file or directory
rte_table_action_meter_profile_delete is flagged as experimental
but is not listed in version map
Please add rte_table_action_meter_profile_delete to the version map
/root/SUSE15-64_K5.3.18_Clang9.0.1/x86_64-native-linuxapp-clang/506f606f3ab6446786cf88da564f1b7c/dpdk/buildtools/check-symbols.sh: line 55: /root/SUSE15-64_K5.3.18_Clang9.0.1/x86_64-native-linuxapp-clang/506f606f3ab6446786cf88da564f1b7c/dpdk/buildtools/map-list-symbol.sh: No such file or directory
rte_table_action_meter_read is flagged as experimental
but is not listed in version map
Please add rte_table_action_meter_read to the version map
/root/SUSE15-64_K5.3.18_Clang9.0.1/x86_64-native-linuxapp-clang/506f606f3ab6446786cf88da564f1b7c/dpdk/buildtools/check-symbols.sh: line 55: /root/SUSE15-64_K5.3.18_Clang9.0.1/x86_64-native-linuxapp-clang/506f606f3ab6446786cf88da564f1b7c/dpdk/buildtools/map-list-symbol.sh: No such file or directory
rte_table_action_profile_action_register is flagged as experimental
but is not listed in version map
Please add rte_table_action_profile_action_register to the version map
/root/SUSE15-64_K5.3.18_Clang9.0.1/x86_64-native-linuxapp-clang/506f606f3ab6446786cf88da564f1b7c/dpdk/buildtools/check-symbols.sh: line 55: /root/SUSE15-64_K5.3.18_Clang9.0.1/x86_64-native-linuxapp-clang/506f606f3ab6446786cf88da564f1b7c/dpdk/buildtools/map-list-symbol.sh: No such file or directory
rte_table_action_profile_create is flagged as experimental
but is not listed in version map
Please add rte_table_action_profile_create to the version map
/root/SUSE15-64_K5.3.18_Clang9.0.1/x86_64-native-linuxapp-clang/506f606f3ab6446786cf88da564f1b7c/dpdk/buildtools/check-symbols.sh: line 55: /root/SUSE15-64_K5.3.18_Clang9.0.1/x86_64-native-linuxapp-clang/506f606f3ab6446786cf88da564f1b7c/dpdk/buildtools/map-list-symbol.sh: No such file or directory
rte_table_action_profile_free is flagged as experimental
but is not listed in version map
Please add rte_table_action_profile_free to the version map
/root/SUSE15-64_K5.3.18_Clang9.0.1/x86_64-native-linuxapp-clang/506f606f3ab6446786cf88da564f1b7c/dpdk/buildtools/check-symbols.sh: line 55: /root/SUSE15-64_K5.3.18_Clang9.0.1/x86_64-native-linuxapp-clang/506f606f3ab6446786cf88da564f1b7c/dpdk/buildtools/map-list-symbol.sh: No such file or directory
rte_table_action_profile_freeze is flagged as experimental
but is not listed in version map
Please add rte_table_action_profile_freeze to the version map
/root/SUSE15-64_K5.3.18_Clang9.0.1/x86_64-native-linuxapp-clang/506f606f3ab6446786cf88da564f1b7c/dpdk/buildtools/check-symbols.sh: line 55: /root/SUSE15-64_K5.3.18_Clang9.0.1/x86_64-native-linuxapp-clang/506f606f3ab6446786cf88da564f1b7c/dpdk/buildtools/map-list-symbol.sh: No such file or directory
rte_table_action_stats_read is flagged as experimental
but is not listed in version map
Please add rte_table_action_stats_read to the version map
/root/SUSE15-64_K5.3.18_Clang9.0.1/x86_64-native-linuxapp-clang/506f606f3ab6446786cf88da564f1b7c/dpdk/buildtools/check-symbols.sh: line 55: /root/SUSE15-64_K5.3.18_Clang9.0.1/x86_64-native-linuxapp-clang/506f606f3ab6446786cf88da564f1b7c/dpdk/buildtools/map-list-symbol.sh: No such file or directory
rte_table_action_table_params_get is flagged as experimental
but is not listed in version map
Please add rte_table_action_table_params_get to the version map
/root/SUSE15-64_K5.3.18_Clang9.0.1/x86_64-native-linuxapp-clang/506f606f3ab6446786cf88da564f1b7c/dpdk/buildtools/check-symbols.sh: line 55: /root/SUSE15-64_K5.3.18_Clang9.0.1/x86_64-native-linuxapp-clang/506f606f3ab6446786cf88da564f1b7c/dpdk/buildtools/map-list-symbol.sh: No such file or directory
rte_table_action_time_read is flagged as experimental
but is not listed in version map
Please add rte_table_action_time_read to the version map
/root/SUSE15-64_K5.3.18_Clang9.0.1/x86_64-native-linuxapp-clang/506f606f3ab6446786cf88da564f1b7c/dpdk/buildtools/check-symbols.sh: line 55: /root/SUSE15-64_K5.3.18_Clang9.0.1/x86_64-native-linuxapp-clang/506f606f3ab6446786cf88da564f1b7c/dpdk/buildtools/map-list-symbol.sh: No such file or directory
rte_table_action_ttl_read is flagged as experimental
but is not listed in version map
Please add rte_table_action_ttl_read to the version map
/root/SUSE15-64_K5.3.18_Clang9.0.1/x86_64-native-linuxapp-clang/506f606f3ab6446786cf88da564f1b7c/dpdk/buildtools/check-symbols.sh: line 55: /root/SUSE15-64_K5.3.18_Clang9.0.1/x86_64-native-linuxapp-clang/506f606f3ab6446786cf88da564f1b7c/dpdk/buildtools/map-list-symbol.sh: No such file or directory
rte_swx_ctl_action_arg_info_get is flagged as experimental
but is not listed in version map
Please add rte_swx_ctl_action_arg_info_get to the version map
/root/SUSE15-64_K5.3.18_Clang9.0.1/x86_64-native-linuxapp-clang/506f606f3ab6446786cf88da564f1b7c/dpdk/buildtools/check-symbols.sh: line 55: /root/SUSE15-64_K5.3.18_Clang9.0.1/x86_64-native-linuxapp-clang/506f606f3ab6446786cf88da564f1b7c/dpdk/buildtools/map-list-symbol.sh: No such file or directory
rte_swx_ctl_action_info_get is flagged as experimental
but is not listed in version map
Please add rte_swx_ctl_action_info_get to the version map
/root/SUSE15-64_K5.3.18_Clang9.0.1/x86_64-native-linuxapp-clang/506f606f3ab6446786cf88da564f1b7c/dpdk/buildtools/check-symbols.sh: line 55: /root/SUSE15-64_K5.3.18_Clang9.0.1/x86_64-native-linuxapp-clang/506f606f3ab6446786cf88da564f1b7c/dpdk/buildtools/map-list-symbol.sh: No such file or directory
rte_swx_ctl_learner_action_info_get is flagged as experimental
but is not listed in version map
Please add rte_swx_ctl_learner_action_info_get to the version map
/root/SUSE15-64_K5.3.18_Clang9.0.1/x86_64-native-linuxapp-clang/506f606f3ab6446786cf88da564f1b7c/dpdk/buildtools/check-symbols.sh: line 55: /root/SUSE15-64_K5.3.18_Clang9.0.1/x86_64-native-linuxapp-clang/506f606f3ab6446786cf88da564f1b7c/dpdk/buildtools/map-list-symbol.sh: No such file or directory
rte_swx_ctl_learner_info_get is flagged as experimental
but is not listed in version map
Please add rte_swx_ctl_learner_info_get to the version map
/root/SUSE15-64_K5.3.18_Clang9.0.1/x86_64-native-linuxapp-clang/506f606f3ab6446786cf88da564f1b7c/dpdk/buildtools/check-symbols.sh: line 55: /root/SUSE15-64_K5.3.18_Clang9.0.1/x86_64-native-linuxapp-clang/506f606f3ab6446786cf88da564f1b7c/dpdk/buildtools/map-list-symbol.sh: No such file or directory
rte_swx_ctl_learner_match_field_info_get is flagged as experimental
but is not listed in version map
Please add rte_swx_ctl_learner_match_field_info_get to the version map
/root/SUSE15-64_K5.3.18_Clang9.0.1/x86_64-native-linuxapp-clang/506f606f3ab6446786cf88da564f1b7c/dpdk/buildtools/check-symbols.sh: line 55: /root/SUSE15-64_K5.3.18_Clang9.0.1/x86_64-native-linuxapp-clang/506f606f3ab6446786cf88da564f1b7c/dpdk/buildtools/map-list-symbol.sh: No such file or directory
rte_swx_ctl_metarray_info_get is flagged as experimental
but is not listed in version map
Please add rte_swx_ctl_metarray_info_get to the version map
/root/SUSE15-64_K5.3.18_Clang9.0.1/x86_64-native-linuxapp-clang/506f606f3ab6446786cf88da564f1b7c/dpdk/buildtools/check-symbols.sh: line 55: /root/SUSE15-64_K5.3.18_Clang9.0.1/x86_64-native-linuxapp-clang/506f606f3ab6446786cf88da564f1b7c/dpdk/buildtools/map-list-symbol.sh: No such file or directory
rte_swx_ctl_meter_profile_add is flagged as experimental
but is not listed in version map
Please add rte_swx_ctl_meter_profile_add to the version map
/root/SUSE15-64_K5.3.18_Clang9.0.1/x86_64-native-linuxapp-clang/506f606f3ab6446786cf88da564f1b7c/dpdk/buildtools/check-symbols.sh: line 55: /root/SUSE15-64_K5.3.18_Clang9.0.1/x86_64-native-linuxapp-clang/506f606f3ab6446786cf88da564f1b7c/dpdk/buildtools/map-list-symbol.sh: No such file or directory
rte_swx_ctl_meter_profile_delete is flagged as experimental
but is not listed in version map
Please add rte_swx_ctl_meter_profile_delete to the version map
/root/SUSE15-64_K5.3.18_Clang9.0.1/x86_64-native-linuxapp-clang/506f606f3ab6446786cf88da564f1b7c/dpdk/buildtools/check-symbols.sh: line 55: /root/SUSE15-64_K5.3.18_Clang9.0.1/x86_64-native-linuxapp-clang/506f606f3ab6446786cf88da564f1b7c/dpdk/buildtools/map-list-symbol.sh: No such file or directory
rte_swx_ctl_meter_reset is flagged as experimental
but is not listed in version map
Please add rte_swx_ctl_meter_reset to the version map
/root/SUSE15-64_K5.3.18_Clang9.0.1/x86_64-native-linuxapp-clang/506f606f3ab6446786cf88da564f1b7c/dpdk/buildtools/check-symbols.sh: line 55: /root/SUSE15-64_K5.3.18_Clang9.0.1/x86_64-native-linuxapp-clang/506f606f3ab6446786cf88da564f1b7c/dpdk/buildtools/map-list-symbol.sh: No such file or directory
rte_swx_ctl_meter_set is flagged as experimental
but is not listed in version map
Please add rte_swx_ctl_meter_set to the version map
/root/SUSE15-64_K5.3.18_Clang9.0.1/x86_64-native-linuxapp-clang/506f606f3ab6446786cf88da564f1b7c/dpdk/buildtools/check-symbols.sh: line 55: /root/SUSE15-64_K5.3.18_Clang9.0.1/x86_64-native-linuxapp-clang/506f606f3ab6446786cf88da564f1b7c/dpdk/buildtools/map-list-symbol.sh: No such file or directory
rte_swx_ctl_meter_stats_read is flagged as experimental
but is not listed in version map
Please add rte_swx_ctl_meter_stats_read to the version map
/root/SUSE15-64_K5.3.18_Clang9.0.1/x86_64-native-linuxapp-clang/506f606f3ab6446786cf88da564f1b7c/dpdk/buildtools/check-symbols.sh: line 55: /root/SUSE15-64_K5.3.18_Clang9.0.1/x86_64-native-linuxapp-clang/506f606f3ab6446786cf88da564f1b7c/dpdk/buildtools/map-list-symbol.sh: No such file or directory
rte_swx_ctl_pipeline_info_get is flagged as experimental
but is not listed in version map
Please add rte_swx_ctl_pipeline_info_get to the version map
/root/SUSE15-64_K5.3.18_Clang9.0.1/x86_64-native-linuxapp-clang/506f606f3ab6446786cf88da564f1b7c/dpdk/buildtools/check-symbols.sh: line 55: /root/SUSE15-64_K5.3.18_Clang9.0.1/x86_64-native-linuxapp-clang/506f606f3ab6446786cf88da564f1b7c/dpdk/buildtools/map-list-symbol.sh: No such file or directory
rte_swx_ctl_pipeline_learner_stats_read is flagged as experimental
but is not listed in version map
Please add rte_swx_ctl_pipeline_learner_stats_read to the version map
/root/SUSE15-64_K5.3.18_Clang9.0.1/x86_64-native-linuxapp-clang/506f606f3ab6446786cf88da564f1b7c/dpdk/buildtools/check-symbols.sh: line 55: /root/SUSE15-64_K5.3.18_Clang9.0.1/x86_64-native-linuxapp-clang/506f606f3ab6446786cf88da564f1b7c/dpdk/buildtools/map-list-symbol.sh: No such file or directory
rte_swx_ctl_pipeline_numa_node_get is flagged as experimental
but is not listed in version map
Please add rte_swx_ctl_pipeline_numa_node_get to the version map
/root/SUSE15-64_K5.3.18_Clang9.0.1/x86_64-native-linuxapp-clang/506f606f3ab6446786cf88da564f1b7c/dpdk/buildtools/check-symbols.sh: line 55: /root/SUSE15-64_K5.3.18_Clang9.0.1/x86_64-native-linuxapp-clang/506f606f3ab6446786cf88da564f1b7c/dpdk/buildtools/map-list-symbol.sh: No such file or directory
rte_swx_ctl_pipeline_port_in_stats_read is flagged as experimental
but is not listed in version map
Please add rte_swx_ctl_pipeline_port_in_stats_read to the version map
/root/SUSE15-64_K5.3.18_Clang9.0.1/x86_64-native-linuxapp-clang/506f606f3ab6446786cf88da564f1b7c/dpdk/buildtools/check-symbols.sh: line 55: /root/SUSE15-64_K5.3.18_Clang9.0.1/x86_64-native-linuxapp-clang/506f606f3ab6446786cf88da564f1b7c/dpdk/buildtools/map-list-symbol.sh: No such file or directory
rte_swx_ctl_pipeline_port_out_stats_read is flagged as experimental
but is not listed in version map
Please add rte_swx_ctl_pipeline_port_out_stats_read to the version map
/root/SUSE15-64_K5.3.18_Clang9.0.1/x86_64-native-linuxapp-clang/506f606f3ab6446786cf88da564f1b7c/dpdk/buildtools/check-symbols.sh: line 55: /root/SUSE15-64_K5.3.18_Clang9.0.1/x86_64-native-linuxapp-clang/506f606f3ab6446786cf88da564f1b7c/dpdk/buildtools/map-list-symbol.sh: No such file or directory
rte_swx_ctl_pipeline_regarray_read is flagged as experimental
but is not listed in version map
Please add rte_swx_ctl_pipeline_regarray_read to the version map
/root/SUSE15-64_K5.3.18_Clang9.0.1/x86_64-native-linuxapp-clang/506f606f3ab6446786cf88da564f1b7c/dpdk/buildtools/check-symbols.sh: line 55: /root/SUSE15-64_K5.3.18_Clang9.0.1/x86_64-native-linuxapp-clang/506f606f3ab6446786cf88da564f1b7c/dpdk/buildtools/map-list-symbol.sh: No such file or directory
rte_swx_ctl_pipeline_regarray_write is flagged as experimental
but is not listed in version map
Please add rte_swx_ctl_pipeline_regarray_write to the version map
/root/SUSE15-64_K5.3.18_Clang9.0.1/x86_64-native-linuxapp-clang/506f606f3ab6446786cf88da564f1b7c/dpdk/buildtools/check-symbols.sh: line 55: /root/SUSE15-64_K5.3.18_Clang9.0.1/x86_64-native-linuxapp-clang/506f606f3ab6446786cf88da564f1b7c/dpdk/buildtools/map-list-symbol.sh: No such file or directory
rte_swx_ctl_pipeline_selector_stats_read is flagged as experimental
but is not listed in version map
Please add rte_swx_ctl_pipeline_selector_stats_read to the version map
/root/SUSE15-64_K5.3.18_Clang9.0.1/x86_64-native-linuxapp-clang/506f606f3ab6446786cf88da564f1b7c/dpdk/buildtools/check-symbols.sh: line 55: /root/SUSE15-64_K5.3.18_Clang9.0.1/x86_64-native-linuxapp-clang/506f606f3ab6446786cf88da564f1b7c/dpdk/buildtools/map-list-symbol.sh: No such file or directory
rte_swx_ctl_pipeline_table_stats_read is flagged as experimental
but is not listed in version map
Please add rte_swx_ctl_pipeline_table_stats_read to the version map
/root/SUSE15-64_K5.3.18_Clang9.0.1/x86_64-native-linuxapp-clang/506f606f3ab6446786cf88da564f1b7c/dpdk/buildtools/check-symbols.sh: line 55: /root/SUSE15-64_K5.3.18_Clang9.0.1/x86_64-native-linuxapp-clang/506f606f3ab6446786cf88da564f1b7c/dpdk/buildtools/map-list-symbol.sh: No such file or directory
rte_swx_ctl_regarray_info_get is flagged as experimental
but is not listed in version map
Please add rte_swx_ctl_regarray_info_get to the version map
/root/SUSE15-64_K5.3.18_Clang9.0.1/x86_64-native-linuxapp-clang/506f606f3ab6446786cf88da564f1b7c/dpdk/buildtools/check-symbols.sh: line 55: /root/SUSE15-64_K5.3.18_Clang9.0.1/x86_64-native-linuxapp-clang/506f606f3ab6446786cf88da564f1b7c/dpdk/buildtools/map-list-symbol.sh: No such file or directory
rte_swx_ctl_selector_field_info_get is flagged as experimental
but is not listed in version map
Please add rte_swx_ctl_selector_field_info_get to the version map
/root/SUSE15-64_K5.3.18_Clang9.0.1/x86_64-native-linuxapp-clang/506f606f3ab6446786cf88da564f1b7c/dpdk/buildtools/check-symbols.sh: line 55: /root/SUSE15-64_K5.3.18_Clang9.0.1/x86_64-native-linuxapp-clang/506f606f3ab6446786cf88da564f1b7c/dpdk/buildtools/map-list-symbol.sh: No such file or directory
rte_swx_ctl_selector_group_id_field_info_get is flagged as experimental
but is not listed in version map
Please add rte_swx_ctl_selector_group_id_field_info_get to the version map
/root/SUSE15-64_K5.3.18_Clang9.0.1/x86_64-native-linuxapp-clang/506f606f3ab6446786cf88da564f1b7c/dpdk/buildtools/check-symbols.sh: line 55: /root/SUSE15-64_K5.3.18_Clang9.0.1/x86_64-native-linuxapp-clang/506f606f3ab6446786cf88da564f1b7c/dpdk/buildtools/map-list-symbol.sh: No such file or directory
rte_swx_ctl_selector_info_get is flagged as experimental
but is not listed in version map
Please add rte_swx_ctl_selector_info_get to the version map
/root/SUSE15-64_K5.3.18_Clang9.0.1/x86_64-native-linuxapp-clang/506f606f3ab6446786cf88da564f1b7c/dpdk/buildtools/check-symbols.sh: line 55: /root/SUSE15-64_K5.3.18_Clang9.0.1/x86_64-native-linuxapp-clang/506f606f3ab6446786cf88da564f1b7c/dpdk/buildtools/map-list-symbol.sh: No such file or directory
rte_swx_ctl_selector_member_id_field_info_get is flagged as experimental
but is not listed in version map
Please add rte_swx_ctl_selector_member_id_field_info_get to the version map
/root/SUSE15-64_K5.3.18_Clang9.0.1/x86_64-native-linuxapp-clang/506f606f3ab6446786cf88da564f1b7c/dpdk/buildtools/check-symbols.sh: line 55: /root/SUSE15-64_K5.3.18_Clang9.0.1/x86_64-native-linuxapp-clang/506f606f3ab6446786cf88da564f1b7c/dpdk/buildtools/map-list-symbol.sh: No such file or directory
rte_swx_ctl_table_action_info_get is flagged as experimental
but is not listed in version map
Please add rte_swx_ctl_table_action_info_get to the version map
/root/SUSE15-64_K5.3.18_Clang9.0.1/x86_64-native-linuxapp-clang/506f606f3ab6446786cf88da564f1b7c/dpdk/buildtools/check-symbols.sh: line 55: /root/SUSE15-64_K5.3.18_Clang9.0.1/x86_64-native-linuxapp-clang/506f606f3ab6446786cf88da564f1b7c/dpdk/buildtools/map-list-symbol.sh: No such file or directory
rte_swx_ctl_table_info_get is flagged as experimental
but is not listed in version map
Please add rte_swx_ctl_table_info_get to the version map
/root/SUSE15-64_K5.3.18_Clang9.0.1/x86_64-native-linuxapp-clang/506f606f3ab6446786cf88da564f1b7c/dpdk/buildtools/check-symbols.sh: line 55: /root/SUSE15-64_K5.3.18_Clang9.0.1/x86_64-native-linuxapp-clang/506f606f3ab6446786cf88da564f1b7c/dpdk/buildtools/map-list-symbol.sh: No such file or directory
rte_swx_ctl_table_match_field_info_get is flagged as experimental
but is not listed in version map
Please add rte_swx_ctl_table_match_field_info_get to the version map
/root/SUSE15-64_K5.3.18_Clang9.0.1/x86_64-native-linuxapp-clang/506f606f3ab6446786cf88da564f1b7c/dpdk/buildtools/check-symbols.sh: line 55: /root/SUSE15-64_K5.3.18_Clang9.0.1/x86_64-native-linuxapp-clang/506f606f3ab6446786cf88da564f1b7c/dpdk/buildtools/map-list-symbol.sh: No such file or directory
rte_swx_ctl_table_ops_get is flagged as experimental
but is not listed in version map
Please add rte_swx_ctl_table_ops_get to the version map
/root/SUSE15-64_K5.3.18_Clang9.0.1/x86_64-native-linuxapp-clang/506f606f3ab6446786cf88da564f1b7c/dpdk/buildtools/check-symbols.sh: line 55: /root/SUSE15-64_K5.3.18_Clang9.0.1/x86_64-native-linuxapp-clang/506f606f3ab6446786cf88da564f1b7c/dpdk/buildtools/map-list-symbol.sh: No such file or directory
rte_swx_pipeline_action_config is flagged as experimental
but is not listed in version map
Please add rte_swx_pipeline_action_config to the version map
/root/SUSE15-64_K5.3.18_Clang9.0.1/x86_64-native-linuxapp-clang/506f606f3ab6446786cf88da564f1b7c/dpdk/buildtools/check-symbols.sh: line 55: /root/SUSE15-64_K5.3.18_Clang9.0.1/x86_64-native-linuxapp-clang/506f606f3ab6446786cf88da564f1b7c/dpdk/buildtools/map-list-symbol.sh: No such file or directory
rte_swx_pipeline_build is flagged as experimental
but is not listed in version map
Please add rte_swx_pipeline_build to the version map
/root/SUSE15-64_K5.3.18_Clang9.0.1/x86_64-native-linuxapp-clang/506f606f3ab6446786cf88da564f1b7c/dpdk/buildtools/check-symbols.sh: line 55: /root/SUSE15-64_K5.3.18_Clang9.0.1/x86_64-native-linuxapp-clang/506f606f3ab6446786cf88da564f1b7c/dpdk/buildtools/map-list-symbol.sh: No such file or directory
rte_swx_pipeline_config is flagged as experimental
but is not listed in version map
Please add rte_swx_pipeline_config to the version map
/root/SUSE15-64_K5.3.18_Clang9.0.1/x86_64-native-linuxapp-clang/506f606f3ab6446786cf88da564f1b7c/dpdk/buildtools/check-symbols.sh: line 55: /root/SUSE15-64_K5.3.18_Clang9.0.1/x86_64-native-linuxapp-clang/506f606f3ab6446786cf88da564f1b7c/dpdk/buildtools/map-list-symbol.sh: No such file or directory
rte_swx_pipeline_extern_func_register is flagged as experimental
but is not listed in version map
Please add rte_swx_pipeline_extern_func_register to the version map
/root/SUSE15-64_K5.3.18_Clang9.0.1/x86_64-native-linuxapp-clang/506f606f3ab6446786cf88da564f1b7c/dpdk/buildtools/check-symbols.sh: line 55: /root/SUSE15-64_K5.3.18_Clang9.0.1/x86_64-native-linuxapp-clang/506f606f3ab6446786cf88da564f1b7c/dpdk/buildtools/map-list-symbol.sh: No such file or directory
rte_swx_pipeline_extern_object_config is flagged as experimental
but is not listed in version map
Please add rte_swx_pipeline_extern_object_config to the version map
/root/SUSE15-64_K5.3.18_Clang9.0.1/x86_64-native-linuxapp-clang/506f606f3ab6446786cf88da564f1b7c/dpdk/buildtools/check-symbols.sh: line 55: /root/SUSE15-64_K5.3.18_Clang9.0.1/x86_64-native-linuxapp-clang/506f606f3ab6446786cf88da564f1b7c/dpdk/buildtools/map-list-symbol.sh: No such file or directory
rte_swx_pipeline_extern_type_member_func_register is flagged as experimental
but is not listed in version map
Please add rte_swx_pipeline_extern_type_member_func_register to the version map
/root/SUSE15-64_K5.3.18_Clang9.0.1/x86_64-native-linuxapp-clang/506f606f3ab6446786cf88da564f1b7c/dpdk/buildtools/check-symbols.sh: line 55: /root/SUSE15-64_K5.3.18_Clang9.0.1/x86_64-native-linuxapp-clang/506f606f3ab6446786cf88da564f1b7c/dpdk/buildtools/map-list-symbol.sh: No such file or directory
rte_swx_pipeline_extern_type_register is flagged as experimental
but is not listed in version map
Please add rte_swx_pipeline_extern_type_register to the version map
/root/SUSE15-64_K5.3.18_Clang9.0.1/x86_64-native-linuxapp-clang/506f606f3ab6446786cf88da564f1b7c/dpdk/buildtools/check-symbols.sh: line 55: /root/SUSE15-64_K5.3.18_Clang9.0.1/x86_64-native-linuxapp-clang/506f606f3ab6446786cf88da564f1b7c/dpdk/buildtools/map-list-symbol.sh: No such file or directory
rte_swx_pipeline_flush is flagged as experimental
but is not listed in version map
Please add rte_swx_pipeline_flush to the version map
/root/SUSE15-64_K5.3.18_Clang9.0.1/x86_64-native-linuxapp-clang/506f606f3ab6446786cf88da564f1b7c/dpdk/buildtools/check-symbols.sh: line 55: /root/SUSE15-64_K5.3.18_Clang9.0.1/x86_64-native-linuxapp-clang/506f606f3ab6446786cf88da564f1b7c/dpdk/buildtools/map-list-symbol.sh: No such file or directory
rte_swx_pipeline_free is flagged as experimental
but is not listed in version map
Please add rte_swx_pipeline_free to the version map
/root/SUSE15-64_K5.3.18_Clang9.0.1/x86_64-native-linuxapp-clang/506f606f3ab6446786cf88da564f1b7c/dpdk/buildtools/check-symbols.sh: line 55: /root/SUSE15-64_K5.3.18_Clang9.0.1/x86_64-native-linuxapp-clang/506f606f3ab6446786cf88da564f1b7c/dpdk/buildtools/map-list-symbol.sh: No such file or directory
rte_swx_pipeline_instructions_config is flagged as experimental
but is not listed in version map
Please add rte_swx_pipeline_instructions_config to the version map
/root/SUSE15-64_K5.3.18_Clang9.0.1/x86_64-native-linuxapp-clang/506f606f3ab6446786cf88da564f1b7c/dpdk/buildtools/check-symbols.sh: line 55: /root/SUSE15-64_K5.3.18_Clang9.0.1/x86_64-native-linuxapp-clang/506f606f3ab6446786cf88da564f1b7c/dpdk/buildtools/map-list-symbol.sh: No such file or directory
rte_swx_pipeline_learner_config is flagged as experimental
but is not listed in version map
Please add rte_swx_pipeline_learner_config to the version map
/root/SUSE15-64_K5.3.18_Clang9.0.1/x86_64-native-linuxapp-clang/506f606f3ab6446786cf88da564f1b7c/dpdk/buildtools/check-symbols.sh: line 55: /root/SUSE15-64_K5.3.18_Clang9.0.1/x86_64-native-linuxapp-clang/506f606f3ab6446786cf88da564f1b7c/dpdk/buildtools/map-list-symbol.sh: No such file or directory
rte_swx_pipeline_metarray_config is flagged as experimental
but is not listed in version map
Please add rte_swx_pipeline_metarray_config to the version map
/root/SUSE15-64_K5.3.18_Clang9.0.1/x86_64-native-linuxapp-clang/506f606f3ab6446786cf88da564f1b7c/dpdk/buildtools/check-symbols.sh: line 55: /root/SUSE15-64_K5.3.18_Clang9.0.1/x86_64-native-linuxapp-clang/506f606f3ab6446786cf88da564f1b7c/dpdk/buildtools/map-list-symbol.sh: No such file or directory
rte_swx_pipeline_packet_header_register is flagged as experimental
but is not listed in version map
Please add rte_swx_pipeline_packet_header_register to the version map
/root/SUSE15-64_K5.3.18_Clang9.0.1/x86_64-native-linuxapp-clang/506f606f3ab6446786cf88da564f1b7c/dpdk/buildtools/check-symbols.sh: line 55: /root/SUSE15-64_K5.3.18_Clang9.0.1/x86_64-native-linuxapp-clang/506f606f3ab6446786cf88da564f1b7c/dpdk/buildtools/map-list-symbol.sh: No such file or directory
rte_swx_pipeline_packet_metadata_register is flagged as experimental
but is not listed in version map
Please add rte_swx_pipeline_packet_metadata_register to the version map
/root/SUSE15-64_K5.3.18_Clang9.0.1/x86_64-native-linuxapp-clang/506f606f3ab6446786cf88da564f1b7c/dpdk/buildtools/check-symbols.sh: line 55: /root/SUSE15-64_K5.3.18_Clang9.0.1/x86_64-native-linuxapp-clang/506f606f3ab6446786cf88da564f1b7c/dpdk/buildtools/map-list-symbol.sh: No such file or directory
rte_swx_pipeline_port_in_config is flagged as experimental
but is not listed in version map
Please add rte_swx_pipeline_port_in_config to the version map
/root/SUSE15-64_K5.3.18_Clang9.0.1/x86_64-native-linuxapp-clang/506f606f3ab6446786cf88da564f1b7c/dpdk/buildtools/check-symbols.sh: line 55: /root/SUSE15-64_K5.3.18_Clang9.0.1/x86_64-native-linuxapp-clang/506f606f3ab6446786cf88da564f1b7c/dpdk/buildtools/map-list-symbol.sh: No such file or directory
rte_swx_pipeline_port_in_type_register is flagged as experimental
but is not listed in version map
Please add rte_swx_pipeline_port_in_type_register to the version map
/root/SUSE15-64_K5.3.18_Clang9.0.1/x86_64-native-linuxapp-clang/506f606f3ab6446786cf88da564f1b7c/dpdk/buildtools/check-symbols.sh: line 55: /root/SUSE15-64_K5.3.18_Clang9.0.1/x86_64-native-linuxapp-clang/506f606f3ab6446786cf88da564f1b7c/dpdk/buildtools/map-list-symbol.sh: No such file or directory
rte_swx_pipeline_port_out_config is flagged as experimental
but is not listed in version map
Please add rte_swx_pipeline_port_out_config to the version map
/root/SUSE15-64_K5.3.18_Clang9.0.1/x86_64-native-linuxapp-clang/506f606f3ab6446786cf88da564f1b7c/dpdk/buildtools/check-symbols.sh: line 55: /root/SUSE15-64_K5.3.18_Clang9.0.1/x86_64-native-linuxapp-clang/506f606f3ab6446786cf88da564f1b7c/dpdk/buildtools/map-list-symbol.sh: No such file or directory
rte_swx_pipeline_port_out_type_register is flagged as experimental
but is not listed in version map
Please add rte_swx_pipeline_port_out_type_register to the version map
/root/SUSE15-64_K5.3.18_Clang9.0.1/x86_64-native-linuxapp-clang/506f606f3ab6446786cf88da564f1b7c/dpdk/buildtools/check-symbols.sh: line 55: /root/SUSE15-64_K5.3.18_Clang9.0.1/x86_64-native-linuxapp-clang/506f606f3ab6446786cf88da564f1b7c/dpdk/buildtools/map-list-symbol.sh: No such file or directory
rte_swx_pipeline_regarray_config is flagged as experimental
but is not listed in version map
Please add rte_swx_pipeline_regarray_config to the version map
/root/SUSE15-64_K5.3.18_Clang9.0.1/x86_64-native-linuxapp-clang/506f606f3ab6446786cf88da564f1b7c/dpdk/buildtools/check-symbols.sh: line 55: /root/SUSE15-64_K5.3.18_Clang9.0.1/x86_64-native-linuxapp-clang/506f606f3ab6446786cf88da564f1b7c/dpdk/buildtools/map-list-symbol.sh: No such file or directory
rte_swx_pipeline_run is flagged as experimental
but is not listed in version map
Please add rte_swx_pipeline_run to the version map
/root/SUSE15-64_K5.3.18_Clang9.0.1/x86_64-native-linuxapp-clang/506f606f3ab6446786cf88da564f1b7c/dpdk/buildtools/check-symbols.sh: line 55: /root/SUSE15-64_K5.3.18_Clang9.0.1/x86_64-native-linuxapp-clang/506f606f3ab6446786cf88da564f1b7c/dpdk/buildtools/map-list-symbol.sh: No such file or directory
rte_swx_pipeline_selector_config is flagged as experimental
but is not listed in version map
Please add rte_swx_pipeline_selector_config to the version map
/root/SUSE15-64_K5.3.18_Clang9.0.1/x86_64-native-linuxapp-clang/506f606f3ab6446786cf88da564f1b7c/dpdk/buildtools/check-symbols.sh: line 55: /root/SUSE15-64_K5.3.18_Clang9.0.1/x86_64-native-linuxapp-clang/506f606f3ab6446786cf88da564f1b7c/dpdk/buildtools/map-list-symbol.sh: No such file or directory
rte_swx_pipeline_struct_type_register is flagged as experimental
but is not listed in version map
Please add rte_swx_pipeline_struct_type_register to the version map
/root/SUSE15-64_K5.3.18_Clang9.0.1/x86_64-native-linuxapp-clang/506f606f3ab6446786cf88da564f1b7c/dpdk/buildtools/check-symbols.sh: line 55: /root/SUSE15-64_K5.3.18_Clang9.0.1/x86_64-native-linuxapp-clang/506f606f3ab6446786cf88da564f1b7c/dpdk/buildtools/map-list-symbol.sh: No such file or directory
rte_swx_pipeline_table_config is flagged as experimental
but is not listed in version map
Please add rte_swx_pipeline_table_config to the version map
/root/SUSE15-64_K5.3.18_Clang9.0.1/x86_64-native-linuxapp-clang/506f606f3ab6446786cf88da564f1b7c/dpdk/buildtools/check-symbols.sh: line 55: /root/SUSE15-64_K5.3.18_Clang9.0.1/x86_64-native-linuxapp-clang/506f606f3ab6446786cf88da564f1b7c/dpdk/buildtools/map-list-symbol.sh: No such file or directory
rte_swx_pipeline_table_state_get is flagged as experimental
but is not listed in version map
Please add rte_swx_pipeline_table_state_get to the version map
/root/SUSE15-64_K5.3.18_Clang9.0.1/x86_64-native-linuxapp-clang/506f606f3ab6446786cf88da564f1b7c/dpdk/buildtools/check-symbols.sh: line 55: /root/SUSE15-64_K5.3.18_Clang9.0.1/x86_64-native-linuxapp-clang/506f606f3ab6446786cf88da564f1b7c/dpdk/buildtools/map-list-symbol.sh: No such file or directory
rte_swx_pipeline_table_state_set is flagged as experimental
but is not listed in version map
Please add rte_swx_pipeline_table_state_set to the version map
/root/SUSE15-64_K5.3.18_Clang9.0.1/x86_64-native-linuxapp-clang/506f606f3ab6446786cf88da564f1b7c/dpdk/buildtools/check-symbols.sh: line 55: /root/SUSE15-64_K5.3.18_Clang9.0.1/x86_64-native-linuxapp-clang/506f606f3ab6446786cf88da564f1b7c/dpdk/buildtools/map-list-symbol.sh: No such file or directory
rte_swx_pipeline_table_type_register is flagged as experimental
but is not listed in version map
Please add rte_swx_pipeline_table_type_register to the version map
/root/SUSE15-64_K5.3.18_Clang9.0.1/x86_64-native-linuxapp-clang/506f606f3ab6446786cf88da564f1b7c/dpdk/buildtools/check-symbols.sh: line 55: /root/SUSE15-64_K5.3.18_Clang9.0.1/x86_64-native-linuxapp-clang/506f606f3ab6446786cf88da564f1b7c/dpdk/buildtools/map-list-symbol.sh: No such file or directory
rte_swx_pipeline_build_from_spec is flagged as experimental
but is not listed in version map
Please add rte_swx_pipeline_build_from_spec to the version map
/root/SUSE15-64_K5.3.18_Clang9.0.1/x86_64-native-linuxapp-clang/506f606f3ab6446786cf88da564f1b7c/dpdk/buildtools/check-symbols.sh: line 55: /root/SUSE15-64_K5.3.18_Clang9.0.1/x86_64-native-linuxapp-clang/506f606f3ab6446786cf88da564f1b7c/dpdk/buildtools/map-list-symbol.sh: No such file or directory
rte_swx_ctl_pipeline_abort is flagged as experimental
but is not listed in version map
Please add rte_swx_ctl_pipeline_abort to the version map
/root/SUSE15-64_K5.3.18_Clang9.0.1/x86_64-native-linuxapp-clang/506f606f3ab6446786cf88da564f1b7c/dpdk/buildtools/check-symbols.sh: line 55: /root/SUSE15-64_K5.3.18_Clang9.0.1/x86_64-native-linuxapp-clang/506f606f3ab6446786cf88da564f1b7c/dpdk/buildtools/map-list-symbol.sh: No such file or directory
rte_swx_ctl_pipeline_commit is flagged as experimental
but is not listed in version map
Please add rte_swx_ctl_pipeline_commit to the version map
/root/SUSE15-64_K5.3.18_Clang9.0.1/x86_64-native-linuxapp-clang/506f606f3ab6446786cf88da564f1b7c/dpdk/buildtools/check-symbols.sh: line 55: /root/SUSE15-64_K5.3.18_Clang9.0.1/x86_64-native-linuxapp-clang/506f606f3ab6446786cf88da564f1b7c/dpdk/buildtools/map-list-symbol.sh: No such file or directory
rte_swx_ctl_pipeline_create is flagged as experimental
but is not listed in version map
Please add rte_swx_ctl_pipeline_create to the version map
/root/SUSE15-64_K5.3.18_Clang9.0.1/x86_64-native-linuxapp-clang/506f606f3ab6446786cf88da564f1b7c/dpdk/buildtools/check-symbols.sh: line 55: /root/SUSE15-64_K5.3.18_Clang9.0.1/x86_64-native-linuxapp-clang/506f606f3ab6446786cf88da564f1b7c/dpdk/buildtools/map-list-symbol.sh: No such file or directory
rte_swx_ctl_pipeline_free is flagged as experimental
but is not listed in version map
Please add rte_swx_ctl_pipeline_free to the version map
/root/SUSE15-64_K5.3.18_Clang9.0.1/x86_64-native-linuxapp-clang/506f606f3ab6446786cf88da564f1b7c/dpdk/buildtools/check-symbols.sh: line 55: /root/SUSE15-64_K5.3.18_Clang9.0.1/x86_64-native-linuxapp-clang/506f606f3ab6446786cf88da564f1b7c/dpdk/buildtools/map-list-symbol.sh: No such file or directory
rte_swx_ctl_pipeline_learner_default_entry_add is flagged as experimental
but is not listed in version map
Please add rte_swx_ctl_pipeline_learner_default_entry_add to the version map
/root/SUSE15-64_K5.3.18_Clang9.0.1/x86_64-native-linuxapp-clang/506f606f3ab6446786cf88da564f1b7c/dpdk/buildtools/check-symbols.sh: line 55: /root/SUSE15-64_K5.3.18_Clang9.0.1/x86_64-native-linuxapp-clang/506f606f3ab6446786cf88da564f1b7c/dpdk/buildtools/map-list-symbol.sh: No such file or directory
rte_swx_ctl_pipeline_learner_default_entry_read is flagged as experimental
but is not listed in version map
Please add rte_swx_ctl_pipeline_learner_default_entry_read to the version map
/root/SUSE15-64_K5.3.18_Clang9.0.1/x86_64-native-linuxapp-clang/506f606f3ab6446786cf88da564f1b7c/dpdk/buildtools/check-symbols.sh: line 55: /root/SUSE15-64_K5.3.18_Clang9.0.1/x86_64-native-linuxapp-clang/506f606f3ab6446786cf88da564f1b7c/dpdk/buildtools/map-list-symbol.sh: No such file or directory
rte_swx_ctl_pipeline_selector_fprintf is flagged as experimental
but is not listed in version map
Please add rte_swx_ctl_pipeline_selector_fprintf to the version map
/root/SUSE15-64_K5.3.18_Clang9.0.1/x86_64-native-linuxapp-clang/506f606f3ab6446786cf88da564f1b7c/dpdk/buildtools/check-symbols.sh: line 55: /root/SUSE15-64_K5.3.18_Clang9.0.1/x86_64-native-linuxapp-clang/506f606f3ab6446786cf88da564f1b7c/dpdk/buildtools/map-list-symbol.sh: No such file or directory
rte_swx_ctl_pipeline_selector_group_add is flagged as experimental
but is not listed in version map
Please add rte_swx_ctl_pipeline_selector_group_add to the version map
/root/SUSE15-64_K5.3.18_Clang9.0.1/x86_64-native-linuxapp-clang/506f606f3ab6446786cf88da564f1b7c/dpdk/buildtools/check-symbols.sh: line 55: /root/SUSE15-64_K5.3.18_Clang9.0.1/x86_64-native-linuxapp-clang/506f606f3ab6446786cf88da564f1b7c/dpdk/buildtools/map-list-symbol.sh: No such file or directory
rte_swx_ctl_pipeline_selector_group_delete is flagged as experimental
but is not listed in version map
Please add rte_swx_ctl_pipeline_selector_group_delete to the version map
/root/SUSE15-64_K5.3.18_Clang9.0.1/x86_64-native-linuxapp-clang/506f606f3ab6446786cf88da564f1b7c/dpdk/buildtools/check-symbols.sh: line 55: /root/SUSE15-64_K5.3.18_Clang9.0.1/x86_64-native-linuxapp-clang/506f606f3ab6446786cf88da564f1b7c/dpdk/buildtools/map-list-symbol.sh: No such file or directory
rte_swx_ctl_pipeline_selector_group_member_add is flagged as experimental
but is not listed in version map
Please add rte_swx_ctl_pipeline_selector_group_member_add to the version map
/root/SUSE15-64_K5.3.18_Clang9.0.1/x86_64-native-linuxapp-clang/506f606f3ab6446786cf88da564f1b7c/dpdk/buildtools/check-symbols.sh: line 55: /root/SUSE15-64_K5.3.18_Clang9.0.1/x86_64-native-linuxapp-clang/506f606f3ab6446786cf88da564f1b7c/dpdk/buildtools/map-list-symbol.sh: No such file or directory
rte_swx_ctl_pipeline_selector_group_member_delete is flagged as experimental
but is not listed in version map
Please add rte_swx_ctl_pipeline_selector_group_member_delete to the version map
/root/SUSE15-64_K5.3.18_Clang9.0.1/x86_64-native-linuxapp-clang/506f606f3ab6446786cf88da564f1b7c/dpdk/buildtools/check-symbols.sh: line 55: /root/SUSE15-64_K5.3.18_Clang9.0.1/x86_64-native-linuxapp-clang/506f606f3ab6446786cf88da564f1b7c/dpdk/buildtools/map-list-symbol.sh: No such file or directory
rte_swx_ctl_pipeline_table_default_entry_add is flagged as experimental
but is not listed in version map
Please add rte_swx_ctl_pipeline_table_default_entry_add to the version map
/root/SUSE15-64_K5.3.18_Clang9.0.1/x86_64-native-linuxapp-clang/506f606f3ab6446786cf88da564f1b7c/dpdk/buildtools/check-symbols.sh: line 55: /root/SUSE15-64_K5.3.18_Clang9.0.1/x86_64-native-linuxapp-clang/506f606f3ab6446786cf88da564f1b7c/dpdk/buildtools/map-list-symbol.sh: No such file or directory
rte_swx_ctl_pipeline_table_entry_add is flagged as experimental
but is not listed in version map
Please add rte_swx_ctl_pipeline_table_entry_add to the version map
/root/SUSE15-64_K5.3.18_Clang9.0.1/x86_64-native-linuxapp-clang/506f606f3ab6446786cf88da564f1b7c/dpdk/buildtools/check-symbols.sh: line 55: /root/SUSE15-64_K5.3.18_Clang9.0.1/x86_64-native-linuxapp-clang/506f606f3ab6446786cf88da564f1b7c/dpdk/buildtools/map-list-symbol.sh: No such file or directory
rte_swx_ctl_pipeline_table_entry_delete is flagged as experimental
but is not listed in version map
Please add rte_swx_ctl_pipeline_table_entry_delete to the version map
/root/SUSE15-64_K5.3.18_Clang9.0.1/x86_64-native-linuxapp-clang/506f606f3ab6446786cf88da564f1b7c/dpdk/buildtools/check-symbols.sh: line 55: /root/SUSE15-64_K5.3.18_Clang9.0.1/x86_64-native-linuxapp-clang/506f606f3ab6446786cf88da564f1b7c/dpdk/buildtools/map-list-symbol.sh: No such file or directory
rte_swx_ctl_pipeline_table_entry_read is flagged as experimental
but is not listed in version map
Please add rte_swx_ctl_pipeline_table_entry_read to the version map
/root/SUSE15-64_K5.3.18_Clang9.0.1/x86_64-native-linuxapp-clang/506f606f3ab6446786cf88da564f1b7c/dpdk/buildtools/check-symbols.sh: line 55: /root/SUSE15-64_K5.3.18_Clang9.0.1/x86_64-native-linuxapp-clang/506f606f3ab6446786cf88da564f1b7c/dpdk/buildtools/map-list-symbol.sh: No such file or directory
rte_swx_ctl_pipeline_table_fprintf is flagged as experimental
but is not listed in version map
Please add rte_swx_ctl_pipeline_table_fprintf to the version map
/root/SUSE15-64_K5.3.18_Clang9.0.1/x86_64-native-linuxapp-clang/506f606f3ab6446786cf88da564f1b7c/dpdk/buildtools/check-symbols.sh: line 65: /root/SUSE15-64_K5.3.18_Clang9.0.1/x86_64-native-linuxapp-clang/506f606f3ab6446786cf88da564f1b7c/dpdk/buildtools/map-list-symbol.sh: No such file or directory
ninja: build stopped




*Build Failed #5:
OS: SUSE15-64
Target: x86_64-native-linuxapp-gcc

DPDK STV team

             reply	other threads:[~2021-10-14  3:04 UTC|newest]

Thread overview: 14+ messages / expand[flat|nested]  mbox.gz  Atom feed  top
2021-10-14  3:03 sys_stv [this message]
  -- strict thread matches above, loose matches on Subject: below --
2021-10-22 22:14 sys_stv
2021-08-15 22:10 sys_stv
2021-06-29 15:39 sys_stv
2021-05-27 22:08 sys_stv
2021-05-07  1:05 sys_stv
2021-03-22 22:07 sys_stv
2021-01-28 22:07 sys_stv
2021-01-27 22:07 sys_stv
2021-01-26 22:08 sys_stv
2021-01-26  6:13 sys_stv
2020-11-05 22:08 sys_stv
2020-11-03 22:07 sys_stv
2020-10-20  5:41 sys_stv

Reply instructions:

You may reply publicly to this message via plain-text email
using any one of the following methods:

* Save the following mbox file, import it into your mail client,
  and reply-to-all from there: mbox

  Avoid top-posting and favor interleaved quoting:
  https://en.wikipedia.org/wiki/Posting_style#Interleaved_style

* Reply using the --to, --cc, and --in-reply-to
  switches of git-send-email(1):

  git send-email \
    --in-reply-to='746b4b$ekuuh0@orsmga008-auth.jf.intel.com' \
    --to=sys_stv@intel.com \
    --cc=dpdk_sw_eng@intel.com \
    --cc=npg.sw.core.tools.prc@intel.com \
    --cc=test-report@dpdk.org \
    --cc=thomas@monjalon.net \
    /path/to/YOUR_REPLY

  https://kernel.org/pub/software/scm/git/docs/git-send-email.html

* If your mail client supports setting the In-Reply-To header
  via mailto: links, try the mailto: link

automatic DPDK test reports

This inbox may be cloned and mirrored by anyone:

	git clone --mirror http://inbox.dpdk.org/test-report/0 test-report/git/0.git

	# If you have public-inbox 1.1+ installed, you may
	# initialize and index your mirror using the following commands:
	public-inbox-init -V2 test-report test-report/ http://inbox.dpdk.org/test-report \
		test-report@dpdk.org
	public-inbox-index test-report

Example config snippet for mirrors.
Newsgroup available over NNTP:
	nntp://inbox.dpdk.org/inbox.dpdk.test-report


AGPL code for this site: git clone https://public-inbox.org/public-inbox.git