automatic DPDK test reports
 help / color / mirror / Atom feed
From: sys_stv@intel.com
To: test-report@dpdk.org, thomas@monjalon.net
Cc: dpdk_sw_eng@intel.com, npg.sw.core.tools.prc@intel.com
Subject: [dpdk-test-report] |FAILURE| dpdk daily Intel builds
Date: 22 Oct 2021 15:14:57 -0700
Message-ID: <746b4b$eos9u3@orsmga008-auth.jf.intel.com> (raw)

[-- Attachment #1: Type: text/plain, Size: 9161 bytes --]


Test-Label: Intel-compilation
Test-Status: FAILURE
_Compilation issues_


commit 2f5c4025abb325144e53cedc1b1ecb52d03f38dc
Author: Gowrishankar Muthukrishnan <gmuthukrishn@marvell.com>
Date:   Fri Oct 22 21:41:42 2021 +0530

    mempool: add telemetry endpoint

DPDK git Repo: dpdk 


Meson Build Summary: 22 Builds Done, 21 Successful, 1 Failures, 0 Blocked

+--------------+------------+--------------+------------+------------+-----------+----------+
| os           | gcc-static | clang-static | icc-static | gcc-shared | gcc-debug | document |
+--------------+------------+--------------+------------+------------+-----------+----------+
| UB2004-64    | pass       | pass         | pass       |            |           | pass     |
| FC34-64      | pass       | pass         |            |            |           |          |
| WIN10-64     |            | fail         |            |            |           |          |
| UB2004-32    | pass       |              |            |            |           |          |
| FreeBSD13-64 | pass       | pass         |            | pass       | pass      |          |
| UB2110-64    | pass       |              |            |            |           |          |
| UB2004-64N   | pass       |              |            | pass       |           |          |
| SUSE15-64    | pass       | pass         |            |            |           |          |
| RHEL84-64    | pass       | pass         | pass       | pass       | pass      |          |
+--------------+------------+--------------+------------+------------+-----------+----------+
Test environment and configuration as below:


OS: UB2004-64
	Kernel Version: 5.8.0-48-generic
	GCC Version: gcc (Ubuntu 10.3.0-1ubuntu1~20.04) 10.3.0
	Clang Version: 10.0.0-4ubuntu1
	x86_64-native-linuxapp-clang
	x86_64-native-linuxapp-gcc
	x86_64-native-linuxapp-icc
	x86_64-native-linuxapp-doc

OS: FC34-64
	Kernel Version: 5.11.15-300.fc34.x86_64
	GCC Version: gcc (GCC) 11.0.1 20210324 (Red Hat 11.0.1-0)
	Clang Version: 12.0.0 (Fedora 12.0.0-0.3.rc1.fc34)
	x86_64-native-linuxapp-gcc
	x86_64-native-linuxapp-clang

OS: WIN10-64
	Kernel Version: N/A
	GCC Version: N/A
	Clang Version: Clang 8.0.0
	x86_64-windows-clang

OS: UB2004-32
	Kernel Version: 5.8.0-48-generic
	GCC Version: gcc (Ubuntu 10.3.0-1ubuntu1~20.04) 10.3.0
	Clang Version: 10.0.0-4ubuntu1
	i686-native-linuxapp-gcc

OS: FreeBSD13-64
	Kernel Version: 13.0-RELEASE
	GCC Version: gcc (FreeBSD Ports Collection) 10.3.0
	Clang Version: 11.0.1 (git@github.com:llvm/llvm-project.git llvmorg-11.0.1-0-g43ff75f2c3fe)
	x86_64-native-bsdapp-gcc
	x86_64-native-bsdapp-clang
	x86_64-native-bsdapp-gcc+shared
	x86_64-native-bsdapp-gcc+debug

OS: UB2110-64
	Kernel Version: 5.13.0-19-generic
	GCC Version: gcc (Ubuntu 11.2.0-7ubuntu2) 11.2.0
	Clang Version: 13.0.0-2
	x86_64-native-linuxapp-gcc

OS: UB2004-64N
	Kernel Version: 5.11.16-051116-generic
	GCC Version: gcc (Ubuntu 9.3.0-17ubuntu1~20.04) 9.3.0
	Clang Version: 10.0.0-4ubuntu1
	x86_64-native-linuxapp-gcc
	x86_64-native-linuxapp-gcc+shared

OS: SUSE15-64
	Kernel Version: 5.3.18-lp152.57-default
	GCC Version: gcc (SUSE Linux) 7.5.0
	Clang Version: 9.0.1
	x86_64-native-linuxapp-clang
	x86_64-native-linuxapp-gcc

OS: RHEL84-64
	Kernel Version: 4.18.0-305.19.1.el8_4.x86_64
	GCC Version: gcc (GCC) 8.4.1 20200928 (Red Hat 8.4.1-1)
	Clang Version: 11.0.0 (Red Hat 11.0.0-1.module_el8.4.0+587+5187cac0)
	x86_64-native-linuxapp-gcc
	x86_64-native-linuxapp-clang
	x86_64-native-linuxapp-gcc+shared
	x86_64-native-linuxapp-gcc+debug
	x86_64-native-linuxapp-icc



*Build Failed #1:
OS: WIN10-64
Target: x86_64-windows-clang
FAILED: drivers/libtmp_rte_dma_idxd.a.p/dma_idxd_idxd_common.c.obj 
"clang" "-Idrivers\libtmp_rte_dma_idxd.a.p" "-Idrivers" "-I..\drivers" "-Idrivers\dma\idxd" "-I..\drivers\dma\idxd" "-Ilib\dmadev" "-I..\lib\dmadev" "-I." "-I.." "-Iconfig" "-I..\config" "-Ilib\eal\include" "-I..\lib\eal\include" "-Ilib\eal\windows\include" "-I..\lib\eal\windows\include" "-Ilib\eal\x86\include" "-I..\lib\eal\x86\include" "-Ilib\eal\common" "-I..\lib\eal\common" "-Ilib\eal" "-I..\lib\eal" "-Ilib\kvargs" "-I..\lib\kvargs" "-Idrivers\bus\pci" "-I..\drivers\bus\pci" "-I..\drivers\bus\pci\windows" "-Ilib\pci" "-I..\lib\pci" "-Xclang" "-fcolor-diagnostics" "-pipe" "-D_FILE_OFFSET_BITS=64" "-Wall" "-Winvalid-pch" "-O3" "-include" "rte_config.h" "-Wextra" "-Wcast-qual" "-Wdeprecated" "-Wformat" "-Wformat-nonliteral" "-Wformat-security" "-Wmissing-declarations" "-Wmissing-prototypes" "-Wnested-externs" "-Wold-style-definition" "-Wpointer-arith" "-Wsign-compare" "-Wstrict-prototypes" "-Wundef" "-Wwrite-strings" "-Wno-address-of-packed-member" "-Wno-missing-field-initializers" "-D_GNU_SOURCE" "-D_WIN32_WINNT=0x0A00" "-D_CRT_SECURE_NO_WARNINGS" "-march=native" "-DALLOW_EXPERIMENTAL_API" "-DALLOW_INTERNAL_API" "-mavx2" "-DRTE_LOG_DEFAULT_LOGTYPE=pmd.dma.idxd" -MD -MQ drivers/libtmp_rte_dma_idxd.a.p/dma_idxd_idxd_common.c.obj -MF "drivers\libtmp_rte_dma_idxd.a.p\dma_idxd_idxd_common.c.obj.d" -o drivers/libtmp_rte_dma_idxd.a.p/dma_idxd_idxd_common.c.obj "-c" ../drivers/dma/idxd/idxd_common.c
In file included from ../drivers/dma/idxd/idxd_common.c:12:
In file included from ..\drivers\dma\idxd/idxd_internal.h:11:
..\drivers\dma\idxd/idxd_hw_defs.h:46:21: error: expected member name or ';' after declaration specifiers
        uint16_t __reserved[13];
        ~~~~~~~~           ^
../drivers/dma/idxd/idxd_common.c:551:2: error: array size is negative
        RTE_BUILD_BUG_ON(sizeof(struct idxd_hw_desc) != 64);
        ^~~~~~~~~~~~~~~~~~~~~~~~~~~~~~~~~~~~~~~~~~~~~~~~~~~
..\lib\eal\include/rte_common.h:377:56: note: expanded from macro 'RTE_BUILD_BUG_ON'
#define RTE_BUILD_BUG_ON(condition) ((void)sizeof(char[1 - 2*!!(condition)]))
                                                       ^~~~~~~~~~~~~~~~~~~
2 errors generated.
[288/493] Compiling C object drivers/libtmp_rte_dma_idxd.a.p/dma_idxd_idxd_pci.c.obj
FAILED: drivers/libtmp_rte_dma_idxd.a.p/dma_idxd_idxd_pci.c.obj 
"clang" "-Idrivers\libtmp_rte_dma_idxd.a.p" "-Idrivers" "-I..\drivers" "-Idrivers\dma\idxd" "-I..\drivers\dma\idxd" "-Ilib\dmadev" "-I..\lib\dmadev" "-I." "-I.." "-Iconfig" "-I..\config" "-Ilib\eal\include" "-I..\lib\eal\include" "-Ilib\eal\windows\include" "-I..\lib\eal\windows\include" "-Ilib\eal\x86\include" "-I..\lib\eal\x86\include" "-Ilib\eal\common" "-I..\lib\eal\common" "-Ilib\eal" "-I..\lib\eal" "-Ilib\kvargs" "-I..\lib\kvargs" "-Idrivers\bus\pci" "-I..\drivers\bus\pci" "-I..\drivers\bus\pci\windows" "-Ilib\pci" "-I..\lib\pci" "-Xclang" "-fcolor-diagnostics" "-pipe" "-D_FILE_OFFSET_BITS=64" "-Wall" "-Winvalid-pch" "-O3" "-include" "rte_config.h" "-Wextra" "-Wcast-qual" "-Wdeprecated" "-Wformat" "-Wformat-nonliteral" "-Wformat-security" "-Wmissing-declarations" "-Wmissing-prototypes" "-Wnested-externs" "-Wold-style-definition" "-Wpointer-arith" "-Wsign-compare" "-Wstrict-prototypes" "-Wundef" "-Wwrite-strings" "-Wno-address-of-packed-member" "-Wno-missing-field-initializers" "-D_GNU_SOURCE" "-D_WIN32_WINNT=0x0A00" "-D_CRT_SECURE_NO_WARNINGS" "-march=native" "-DALLOW_EXPERIMENTAL_API" "-DALLOW_INTERNAL_API" "-mavx2" "-DRTE_LOG_DEFAULT_LOGTYPE=pmd.dma.idxd" -MD -MQ drivers/libtmp_rte_dma_idxd.a.p/dma_idxd_idxd_pci.c.obj -MF "drivers\libtmp_rte_dma_idxd.a.p\dma_idxd_idxd_pci.c.obj.d" -o drivers/libtmp_rte_dma_idxd.a.p/dma_idxd_idxd_pci.c.obj "-c" ../drivers/dma/idxd/idxd_pci.c
In file included from ../drivers/dma/idxd/idxd_pci.c:10:
In file included from ..\drivers\dma\idxd/idxd_internal.h:11:
..\drivers\dma\idxd/idxd_hw_defs.h:46:21: error: expected member name or ';' after declaration specifiers
        uint16_t __reserved[13];
        ~~~~~~~~           ^
1 error generated.
[289/493] Linking target drivers/rte_common_iavf-22.dll
   Creating library drivers\rte_common_iavf.lib and object drivers\rte_common_iavf.exp
[290/493] Linking target lib/rte_gro-22.dll
   Creating library lib\rte_gro.lib and object lib\rte_gro.exp
[291/493] Linking target lib/rte_metrics-22.dll
   Creating library lib\rte_metrics.lib and object lib\rte_metrics.exp
[292/493] Linking target lib/rte_gso-22.dll
   Creating library lib\rte_gso.lib and object lib\rte_gso.exp
[293/493] Compiling C object drivers/librte_bus_pci.a.p/meson-generated_.._rte_bus_pci.pmd.c.obj
[294/493] Linking target drivers/rte_bus_auxiliary-22.dll
   Creating library drivers\rte_bus_auxiliary.lib and object drivers\rte_bus_auxiliary.exp
[295/493] Compiling C object drivers/libtmp_rte_dma_ioat.a.p/dma_ioat_ioat_dmadev.c.obj
[296/493] Generating rte_mempool_ring.pmd.c with a custom command (wrapped by meson to set PATH)
[297/493] Compiling C object drivers/librte_dma_skeleton.a.p/meson-generated_.._rte_dma_skeleton.pmd.c.obj
[298/493] Linking target drivers/rte_bus_vdev-22.dll
   Creating library drivers\rte_bus_vdev.lib and object drivers\rte_bus_vdev.exp
[299/493] Compiling C object drivers/librte_bus_vdev.a.p/meson-generated_.._rte_bus_vdev.pmd.c.obj
[300/493] Linking target drivers/rte_bus_pci-22.dll
   Creating library drivers\rte_bus_pci.lib and object drivers\rte_bus_pci.exp
ninja: build stopped


DPDK STV team

             reply	other threads:[~2021-10-22 22:15 UTC|newest]

Thread overview: 17+ messages / expand[flat|nested]  mbox.gz  Atom feed  top
2021-10-22 22:14 sys_stv [this message]
  -- strict thread matches above, loose matches on Subject: below --
2022-01-21  7:59 sys_stv
2022-01-21  7:55 sys_stv
2021-12-18 21:50 sys_stv
2021-10-14  3:03 sys_stv
2021-08-15 22:10 sys_stv
2021-06-29 15:39 sys_stv
2021-05-27 22:08 sys_stv
2021-05-07  1:05 sys_stv
2021-03-22 22:07 sys_stv
2021-01-28 22:07 sys_stv
2021-01-27 22:07 sys_stv
2021-01-26 22:08 sys_stv
2021-01-26  6:13 sys_stv
2020-11-05 22:08 sys_stv
2020-11-03 22:07 sys_stv
2020-10-20  5:41 sys_stv

Reply instructions:

You may reply publicly to this message via plain-text email
using any one of the following methods:

* Save the following mbox file, import it into your mail client,
  and reply-to-all from there: mbox

  Avoid top-posting and favor interleaved quoting:
  https://en.wikipedia.org/wiki/Posting_style#Interleaved_style

* Reply using the --to, --cc, and --in-reply-to
  switches of git-send-email(1):

  git send-email \
    --in-reply-to='746b4b$eos9u3@orsmga008-auth.jf.intel.com' \
    --to=sys_stv@intel.com \
    --cc=dpdk_sw_eng@intel.com \
    --cc=npg.sw.core.tools.prc@intel.com \
    --cc=test-report@dpdk.org \
    --cc=thomas@monjalon.net \
    /path/to/YOUR_REPLY

  https://kernel.org/pub/software/scm/git/docs/git-send-email.html

* If your mail client supports setting the In-Reply-To header
  via mailto: links, try the mailto: link

automatic DPDK test reports

This inbox may be cloned and mirrored by anyone:

	git clone --mirror http://inbox.dpdk.org/test-report/0 test-report/git/0.git

	# If you have public-inbox 1.1+ installed, you may
	# initialize and index your mirror using the following commands:
	public-inbox-init -V2 test-report test-report/ http://inbox.dpdk.org/test-report \
		test-report@dpdk.org
	public-inbox-index test-report

Example config snippet for mirrors.
Newsgroup available over NNTP:
	nntp://inbox.dpdk.org/inbox.dpdk.test-report


AGPL code for this site: git clone https://public-inbox.org/public-inbox.git