automatic DPDK test reports
 help / color / mirror / Atom feed
From: sys_stv@intel.com
To: test-report@dpdk.org, thomas@monjalon.net
Cc: dpdk_sw_eng@intel.com, npg.sw.core.tools.prc@intel.com
Subject: [dpdk-test-report] |FAILURE| dpdk daily Intel builds
Date: 08 Mar 2022 13:07:49 -0800
Message-ID: <746b4b$gg4j0n@orsmga008-auth.jf.intel.com> (raw)

[-- Attachment #1: Type: text/plain, Size: 22511 bytes --]


Test-Label: Intel-compilation
Test-Status: FAILURE
_Compilation issues_


commit 3b358e330153bc792c688d6da60c80c40eaacb22
Author: Ferruh Yigit <ferruh.yigit@intel.com>
Date:   Tue Mar 8 09:47:00 2022 +0000

    ethdev: fix doxygen comments for device info struct

DPDK git Repo: dpdk 


Meson Build Summary: 23 Builds Done, 11 Successful, 12 Failures, 0 Blocked

+--------------+------------+--------------+------------+------------+-----------+----------+------------+
| os           | gcc-static | clang-static | icc-static | gcc-shared | gcc-debug | document | gcc-16byte |
+--------------+------------+--------------+------------+------------+-----------+----------+------------+
| FC35-64      | pass       | pass         |            |            |           |          |            |
| FreeBSD13-64 | fail       | fail         |            | fail       | fail      |          |            |
| RHEL84-64    | pass       | pass         | pass       | pass       | pass      |          |            |
| SUSE15-64    | pass       | pass         |            |            |           |          |            |
| UB2004-32    | fail       |              |            |            |           |          |            |
| UB2004-64    | fail       | fail         | fail       |            |           | fail     | fail       |
| UB2004-64N   | fail       |              |            | fail       |           |          |            |
| UB2110-64    | pass       |              |            |            |           |          |            |
| RHEL85-64    | pass       |              |            |            |           |          |            |
+--------------+------------+--------------+------------+------------+-----------+----------+------------+

Comments: 
Because of DPDK bug (https://bugs.dpdk.org/show_bug.cgi?id=928),
All the dpdk-next-* branch add `Ddisable_drivers=event/cnxk` option when build with ICC complier. 
 
Test environment and configuration as below:


OS: FC35-64
	Kernel Version: 5.14.16-301.fc35.x86_64
	GCC Version: gcc (GCC) 11.2.1 20210728 (Red Hat 11.2.1-1)
	Clang Version: 13.0.0 (Fedora 13.0.0~rc1-1.fc35)
	x86_64-native-linuxapp-gcc
	x86_64-native-linuxapp-clang

OS: FreeBSD13-64
	Kernel Version: 13.0-RELEASE
	GCC Version: gcc (FreeBSD Ports Collection) 10.3.0
	Clang Version: 11.0.1 (git@github.com:llvm/llvm-project.git llvmorg-11.0.1-0-g43ff75f2c3fe)
	x86_64-native-bsdapp-gcc
	x86_64-native-bsdapp-clang
	x86_64-native-bsdapp-gcc+shared
	x86_64-native-bsdapp-gcc+debug

OS: RHEL84-64
	Kernel Version: 4.18.0-348.7.1.el8_5.x86_64
	GCC Version: gcc (GCC) 8.5.0 20210514 (Red Hat 8.5.0-4)
	Clang Version: 12.0.1 (Red Hat 12.0.1-4.module_el8.5.0+1025+93159d6c)
	ICC Version: 19.1.3.304 (gcc version 8.5.0 compatibility)
	x86_64-native-linuxapp-gcc
	x86_64-native-linuxapp-clang
	x86_64-native-linuxapp-gcc+shared
	x86_64-native-linuxapp-gcc+debug
	x86_64-native-linuxapp-icc

OS: SUSE15-64
	Kernel Version: 5.3.18-57-default
	GCC Version: gcc (SUSE Linux) 7.5.0
	Clang Version: 11.0.1
	x86_64-native-linuxapp-clang
	x86_64-native-linuxapp-gcc

OS: UB2004-32
	Kernel Version: 5.8.0-48-generic
	GCC Version: gcc (Ubuntu 10.3.0-1ubuntu1~20.04) 10.3.0
	Clang Version: 10.0.0-4ubuntu1
	i686-native-linuxapp-gcc

OS: UB2004-64
	Kernel Version: 5.8.0-48-generic
	GCC Version: gcc (Ubuntu 10.3.0-1ubuntu1~20.04) 10.3.0
	Clang Version: 10.0.0-4ubuntu1
	x86_64-native-linuxapp-clang
	x86_64-native-linuxapp-gcc
	x86_64-native-linuxapp-icc
	x86_64-native-linuxapp-doc
	x86_64-native-linuxapp-gcc+16byte

OS: UB2004-64N
	Kernel Version: 5.11.16-051116-generic
	GCC Version: gcc (Ubuntu 9.3.0-17ubuntu1~20.04) 9.3.0
	Clang Version: 10.0.0-4ubuntu1
	x86_64-native-linuxapp-gcc
	x86_64-native-linuxapp-gcc+shared

OS: UB2110-64
	Kernel Version: 5.13.0-19-generic
	GCC Version: gcc (Ubuntu 11.2.0-7ubuntu2) 11.2.0
	Clang Version: 13.0.0-2
	x86_64-native-linuxapp-gcc

OS: RHEL85-64
	Kernel Version: 4.18.0-348.7.1.el8_5.x86_64
	GCC Version: gcc (GCC) 8.5.0 20210514 (Red Hat 8.5.0-4)
	Clang Version: 12.0.1 (Red Hat 12.0.1-4.module_el8.5.0+1025+93159d6c)
	ICC Version: 19.1.3.304 (gcc version 8.5.0 compatibility)
	x86_64-native-linuxapp-gcc



*Build Failed #1:
OS: FreeBSD13-64
Target: x86_64-native-bsdapp-gcc
FAILED: lib/kvargs.sym_chk 
/usr/local/bin/meson --internal exe --capture lib/kvargs.sym_chk -- /root/FreeBSD13-64_K13_GCC10.3.0/x86_64-native-bsdapp-gcc/20220309045514/dpdk/buildtools/check-symbols.sh /root/FreeBSD13-64_K13_GCC10.3.0/x86_64-native-bsdapp-gcc/20220309045514/dpdk/lib/kvargs/version.map lib/librte_kvargs.a
--- stderr ---

[53/2057] Compiling C object lib/librte_eal.a.p/eal_unix_rte_thread.c.o
[54/2057] Compiling C object lib/librte_eal.a.p/eal_common_malloc_mp.c.o
[55/2057] Compiling C object lib/librte_eal.a.p/eal_freebsd_eal_cpuflags.c.o
[56/2057] Compiling C object lib/librte_eal.a.p/eal_unix_eal_filesystem.c.o
[57/2057] Compiling C object lib/librte_eal.a.p/eal_freebsd_eal_alarm.c.o
[58/2057] Compiling C object lib/librte_eal.a.p/eal_common_rte_malloc.c.o
[59/2057] Generating telemetry.sym_chk with a custom command (wrapped by meson to capture output)
FAILED: lib/telemetry.sym_chk 
/usr/local/bin/meson --internal exe --capture lib/telemetry.sym_chk -- /root/FreeBSD13-64_K13_GCC10.3.0/x86_64-native-bsdapp-gcc/20220309045514/dpdk/buildtools/check-symbols.sh /root/FreeBSD13-64_K13_GCC10.3.0/x86_64-native-bsdapp-gcc/20220309045514/dpdk/lib/telemetry/version.map lib/librte_telemetry.a
--- stderr ---

[60/2057] Compiling C object lib/librte_eal.a.p/eal_freebsd_eal.c.o
[61/2057] Compiling C object lib/librte_eal.a.p/eal_common_eal_common_options.c.o
ninja: build stopped




*Build Failed #2:
OS: FreeBSD13-64
Target: x86_64-native-bsdapp-clang
FAILED: lib/kvargs.sym_chk 
/usr/local/bin/meson --internal exe --capture lib/kvargs.sym_chk -- /root/FreeBSD13-64_K13_Clang11.0.1/x86_64-native-bsdapp-clang/20220309045514/dpdk/buildtools/check-symbols.sh /root/FreeBSD13-64_K13_Clang11.0.1/x86_64-native-bsdapp-clang/20220309045514/dpdk/lib/kvargs/version.map lib/librte_kvargs.a
--- stderr ---

[41/2018] Compiling C object lib/librte_eal.a.p/eal_common_rte_service.c.o
[42/2018] Compiling C object lib/librte_eal.a.p/eal_common_eal_common_trace_ctf.c.o
[43/2018] Generating telemetry.sym_chk with a custom command (wrapped by meson to capture output)
FAILED: lib/telemetry.sym_chk 
/usr/local/bin/meson --internal exe --capture lib/telemetry.sym_chk -- /root/FreeBSD13-64_K13_Clang11.0.1/x86_64-native-bsdapp-clang/20220309045514/dpdk/buildtools/check-symbols.sh /root/FreeBSD13-64_K13_Clang11.0.1/x86_64-native-bsdapp-clang/20220309045514/dpdk/lib/telemetry/version.map lib/librte_telemetry.a
--- stderr ---

[44/2018] Compiling C object lib/librte_eal.a.p/eal_common_malloc_heap.c.o
[45/2018] Compiling C object lib/librte_eal.a.p/eal_common_eal_common_trace.c.o
[46/2018] Compiling C object lib/librte_eal.a.p/eal_common_eal_common_proc.c.o
[47/2018] Compiling C object lib/librte_eal.a.p/eal_common_eal_common_trace_utils.c.o
[48/2018] Compiling C object lib/librte_eal.a.p/eal_common_eal_common_options.c.o
[49/2018] Compiling C object lib/librte_eal.a.p/eal_common_rte_malloc.c.o
ninja: build stopped




*Build Failed #3:
OS: FreeBSD13-64
Target: x86_64-native-bsdapp-gcc+shared
FAILED: lib/kvargs.sym_chk 
/usr/local/bin/meson --internal exe --capture lib/kvargs.sym_chk -- /root/FreeBSD13-64_K13_GCC10.3.0/x86_64-native-bsdapp-gcc+shared/20220309045514/dpdk/buildtools/check-symbols.sh /root/FreeBSD13-64_K13_GCC10.3.0/x86_64-native-bsdapp-gcc+shared/20220309045514/dpdk/lib/kvargs/version.map lib/librte_kvargs.a
--- stderr ---

[58/1920] Compiling C object lib/librte_eal.a.p/eal_common_rte_malloc.c.o
[59/1920] Compiling C object lib/librte_eal.a.p/eal_freebsd_eal_hugepage_info.c.o
[60/1920] Compiling C object lib/librte_eal.a.p/eal_freebsd_eal_lcore.c.o
[61/1920] Generating telemetry.sym_chk with a custom command (wrapped by meson to capture output)
FAILED: lib/telemetry.sym_chk 
/usr/local/bin/meson --internal exe --capture lib/telemetry.sym_chk -- /root/FreeBSD13-64_K13_GCC10.3.0/x86_64-native-bsdapp-gcc+shared/20220309045514/dpdk/buildtools/check-symbols.sh /root/FreeBSD13-64_K13_GCC10.3.0/x86_64-native-bsdapp-gcc+shared/20220309045514/dpdk/lib/telemetry/version.map lib/librte_telemetry.a
--- stderr ---

[62/1920] Compiling C object lib/librte_eal.a.p/eal_freebsd_eal_alarm.c.o
[63/1920] Compiling C object lib/librte_eal.a.p/eal_freebsd_eal.c.o
[64/1920] Compiling C object lib/librte_eal.a.p/eal_freebsd_eal_debug.c.o
[65/1920] Compiling C object lib/librte_eal.a.p/eal_common_eal_common_options.c.o
[66/1920] Compiling C object lib/librte_eal.a.p/eal_freebsd_eal_interrupts.c.o
ninja: build stopped




*Build Failed #4:
OS: FreeBSD13-64
Target: x86_64-native-bsdapp-gcc+debug
FAILED: lib/kvargs.sym_chk 
/usr/local/bin/meson --internal exe --capture lib/kvargs.sym_chk -- /root/FreeBSD13-64_K13_GCC10.3.0/x86_64-native-bsdapp-gcc+debug/20220309045514/dpdk/buildtools/check-symbols.sh /root/FreeBSD13-64_K13_GCC10.3.0/x86_64-native-bsdapp-gcc+debug/20220309045514/dpdk/lib/kvargs/version.map lib/librte_kvargs.a
--- stderr ---

[41/2018] Compiling C object lib/librte_eal.a.p/eal_common_eal_common_trace_ctf.c.o
[42/2018] Compiling C object lib/librte_eal.a.p/eal_common_malloc_heap.c.o
[43/2018] Compiling C object lib/librte_eal.a.p/eal_common_eal_common_trace.c.o
[44/2018] Compiling C object lib/librte_eal.a.p/eal_common_eal_common_trace_utils.c.o
[45/2018] Compiling C object lib/librte_eal.a.p/eal_common_rte_service.c.o
[46/2018] Generating telemetry.sym_chk with a custom command (wrapped by meson to capture output)
FAILED: lib/telemetry.sym_chk 
/usr/local/bin/meson --internal exe --capture lib/telemetry.sym_chk -- /root/FreeBSD13-64_K13_GCC10.3.0/x86_64-native-bsdapp-gcc+debug/20220309045514/dpdk/buildtools/check-symbols.sh /root/FreeBSD13-64_K13_GCC10.3.0/x86_64-native-bsdapp-gcc+debug/20220309045514/dpdk/lib/telemetry/version.map lib/librte_telemetry.a
--- stderr ---

[47/2018] Compiling C object lib/librte_eal.a.p/eal_common_eal_common_proc.c.o
[48/2018] Compiling C object lib/librte_eal.a.p/eal_common_rte_malloc.c.o
[49/2018] Compiling C object lib/librte_eal.a.p/eal_common_eal_common_options.c.o
ninja: build stopped




*Build Failed #5:
OS: UB2004-32
Target: i686-native-linuxapp-gcc
FAILED: lib/kvargs.sym_chk 
/usr/local/bin/meson --internal exe --capture lib/kvargs.sym_chk -- /root/UB2004-32_K5.8.0_GCC10.2.0/i686-native-linuxapp-gcc/20220309045514/dpdk/buildtools/check-symbols.sh /root/UB2004-32_K5.8.0_GCC10.2.0/i686-native-linuxapp-gcc/20220309045514/dpdk/lib/kvargs/version.map lib/librte_kvargs.a
--- stderr ---

[33/2480] Compiling C object lib/librte_eal.a.p/eal_common_eal_common_trace_points.c.o
[34/2480] Compiling C object lib/librte_eal.a.p/eal_common_eal_common_memory.c.o
[35/2480] Compiling C object lib/librte_eal.a.p/eal_common_rte_reciprocal.c.o
[36/2480] Compiling C object lib/librte_eal.a.p/eal_common_malloc_elem.c.o
[37/2480] Compiling C object lib/librte_eal.a.p/eal_common_rte_random.c.o
[38/2480] Compiling C object lib/librte_eal.a.p/eal_common_malloc_heap.c.o
[39/2480] Generating telemetry.sym_chk with a custom command (wrapped by meson to capture output)
FAILED: lib/telemetry.sym_chk 
/usr/local/bin/meson --internal exe --capture lib/telemetry.sym_chk -- /root/UB2004-32_K5.8.0_GCC10.2.0/i686-native-linuxapp-gcc/20220309045514/dpdk/buildtools/check-symbols.sh /root/UB2004-32_K5.8.0_GCC10.2.0/i686-native-linuxapp-gcc/20220309045514/dpdk/lib/telemetry/version.map lib/librte_telemetry.a
--- stderr ---

[40/2480] Compiling C object lib/librte_eal.a.p/eal_common_rte_malloc.c.o
[41/2480] Compiling C object lib/librte_eal.a.p/eal_common_eal_common_options.c.o
ninja: build stopped




*Build Failed #6:
OS: UB2004-64
Target: x86_64-native-linuxapp-clang
FAILED: lib/kvargs.sym_chk 
/usr/local/bin/meson --internal exe --capture lib/kvargs.sym_chk -- /root/UB2004-64_K5.8.0_Clang10.0.0/x86_64-native-linuxapp-clang/20220309045514/dpdk/buildtools/check-symbols.sh /root/UB2004-64_K5.8.0_Clang10.0.0/x86_64-native-linuxapp-clang/20220309045514/dpdk/lib/kvargs/version.map lib/librte_kvargs.a
--- stderr ---

[30/3602] Compiling C object lib/librte_eal.a.p/eal_common_eal_common_uuid.c.o
[31/3602] Compiling C object lib/librte_eal.a.p/eal_common_eal_common_thread.c.o
[32/3602] Compiling C object lib/librte_eal.a.p/eal_common_eal_common_memory.c.o
[33/3602] Compiling C object lib/librte_eal.a.p/eal_common_eal_common_fbarray.c.o
[34/3602] Compiling C object lib/librte_eal.a.p/eal_common_eal_common_trace_points.c.o
[35/3602] Compiling C object lib/librte_eal.a.p/eal_common_malloc_elem.c.o
[36/3602] Generating telemetry.sym_chk with a custom command (wrapped by meson to capture output)
FAILED: lib/telemetry.sym_chk 
/usr/local/bin/meson --internal exe --capture lib/telemetry.sym_chk -- /root/UB2004-64_K5.8.0_Clang10.0.0/x86_64-native-linuxapp-clang/20220309045514/dpdk/buildtools/check-symbols.sh /root/UB2004-64_K5.8.0_Clang10.0.0/x86_64-native-linuxapp-clang/20220309045514/dpdk/lib/telemetry/version.map lib/librte_telemetry.a
--- stderr ---

[37/3602] Compiling C object lib/librte_eal.a.p/eal_common_malloc_heap.c.o
[38/3602] Compiling C object lib/librte_eal.a.p/eal_common_eal_common_options.c.o
ninja: build stopped




*Build Failed #7:
OS: UB2004-64
Target: x86_64-native-linuxapp-gcc
FAILED: lib/kvargs.sym_chk 
/usr/local/bin/meson --internal exe --capture lib/kvargs.sym_chk -- /root/UB2004-64_K5.8.0_GCC10.3.0/x86_64-native-linuxapp-gcc/20220309045514/dpdk/buildtools/check-symbols.sh /root/UB2004-64_K5.8.0_GCC10.3.0/x86_64-native-linuxapp-gcc/20220309045514/dpdk/lib/kvargs/version.map lib/librte_kvargs.a
--- stderr ---

[34/3613] Compiling C object lib/librte_eal.a.p/eal_common_eal_common_trace_points.c.o
[35/3613] Compiling C object lib/librte_eal.a.p/eal_common_rte_reciprocal.c.o
[36/3613] Compiling C object lib/librte_eal.a.p/eal_common_malloc_elem.c.o
[37/3613] Compiling C object lib/librte_eal.a.p/eal_common_rte_service.c.o
[38/3613] Compiling C object lib/librte_eal.a.p/eal_common_rte_random.c.o
[39/3613] Compiling C object lib/librte_eal.a.p/eal_common_malloc_heap.c.o
[40/3613] Generating telemetry.sym_chk with a custom command (wrapped by meson to capture output)
FAILED: lib/telemetry.sym_chk 
/usr/local/bin/meson --internal exe --capture lib/telemetry.sym_chk -- /root/UB2004-64_K5.8.0_GCC10.3.0/x86_64-native-linuxapp-gcc/20220309045514/dpdk/buildtools/check-symbols.sh /root/UB2004-64_K5.8.0_GCC10.3.0/x86_64-native-linuxapp-gcc/20220309045514/dpdk/lib/telemetry/version.map lib/librte_telemetry.a
--- stderr ---

[41/3613] Compiling C object lib/librte_eal.a.p/eal_common_rte_malloc.c.o
[42/3613] Compiling C object lib/librte_eal.a.p/eal_common_eal_common_options.c.o
ninja: build stopped




*Build Failed #8:
OS: UB2004-64
Target: x86_64-native-linuxapp-icc
FAILED: lib/kvargs.sym_chk 
/usr/local/bin/meson --internal exe --capture lib/kvargs.sym_chk -- /root/UB2004-64_K5.8.0_ICC19.1.3/x86_64-native-linuxapp-icc/20220309045514/dpdk/buildtools/check-symbols.sh /root/UB2004-64_K5.8.0_ICC19.1.3/x86_64-native-linuxapp-icc/20220309045514/dpdk/lib/kvargs/version.map lib/librte_kvargs.a
--- stderr ---

[27/3100] Compiling C object lib/librte_eal.a.p/eal_common_eal_common_string_fns.c.o
[28/3100] Compiling C object lib/librte_eal.a.p/eal_common_eal_common_fbarray.c.o
[29/3100] Compiling C object lib/librte_eal.a.p/eal_common_eal_common_memzone.c.o
[30/3100] Compiling C object lib/librte_eal.a.p/eal_common_eal_common_memory.c.o
[31/3100] Compiling C object lib/librte_eal.a.p/eal_common_eal_common_thread.c.o
[32/3100] Compiling C object lib/librte_eal.a.p/eal_common_eal_common_timer.c.o
[33/3100] Compiling C object lib/librte_eal.a.p/eal_common_eal_common_tailqs.c.o
[34/3100] Generating telemetry.sym_chk with a custom command (wrapped by meson to capture output)
FAILED: lib/telemetry.sym_chk 
/usr/local/bin/meson --internal exe --capture lib/telemetry.sym_chk -- /root/UB2004-64_K5.8.0_ICC19.1.3/x86_64-native-linuxapp-icc/20220309045514/dpdk/buildtools/check-symbols.sh /root/UB2004-64_K5.8.0_ICC19.1.3/x86_64-native-linuxapp-icc/20220309045514/dpdk/lib/telemetry/version.map lib/librte_telemetry.a
--- stderr ---

[35/3100] Compiling C object lib/librte_eal.a.p/eal_common_eal_common_options.c.o
ninja: build stopped




*Build Failed #9:
OS: UB2004-64
Target: x86_64-native-linuxapp-doc
FAILED: lib/kvargs.sym_chk 
/usr/local/bin/meson --internal exe --capture lib/kvargs.sym_chk -- /root/UB2004-64_K5.8.0_GCC10.3.0/x86_64-native-linuxapp-doc/20220309045514/dpdk/buildtools/check-symbols.sh /root/UB2004-64_K5.8.0_GCC10.3.0/x86_64-native-linuxapp-doc/20220309045514/dpdk/lib/kvargs/version.map lib/librte_kvargs.a
--- stderr ---

[34/3382] Compiling C object lib/librte_eal.a.p/eal_common_eal_common_trace_points.c.o
[35/3382] Compiling C object lib/librte_eal.a.p/eal_common_eal_common_memory.c.o
[36/3382] Compiling C object lib/librte_eal.a.p/eal_common_rte_reciprocal.c.o
[37/3382] Compiling C object lib/librte_eal.a.p/eal_common_malloc_elem.c.o
[38/3382] Generating telemetry.sym_chk with a custom command (wrapped by meson to capture output)
FAILED: lib/telemetry.sym_chk 
/usr/local/bin/meson --internal exe --capture lib/telemetry.sym_chk -- /root/UB2004-64_K5.8.0_GCC10.3.0/x86_64-native-linuxapp-doc/20220309045514/dpdk/buildtools/check-symbols.sh /root/UB2004-64_K5.8.0_GCC10.3.0/x86_64-native-linuxapp-doc/20220309045514/dpdk/lib/telemetry/version.map lib/librte_telemetry.a
--- stderr ---

[39/3382] Compiling C object lib/librte_eal.a.p/eal_common_rte_random.c.o
[40/3382] Compiling C object lib/librte_eal.a.p/eal_common_malloc_heap.c.o
[41/3382] Compiling C object lib/librte_eal.a.p/eal_common_rte_malloc.c.o
[42/3382] Compiling C object lib/librte_eal.a.p/eal_common_eal_common_options.c.o
ninja: build stopped




*Build Failed #10:
OS: UB2004-64N
Target: x86_64-native-linuxapp-gcc
FAILED: lib/kvargs.sym_chk 
/usr/local/bin/meson --internal exe --capture lib/kvargs.sym_chk -- /root/UB2004-64N_K5.11.16_GCC9.3.0/x86_64-native-linuxapp-gcc/20220309045514/dpdk/buildtools/check-symbols.sh /root/UB2004-64N_K5.11.16_GCC9.3.0/x86_64-native-linuxapp-gcc/20220309045514/dpdk/lib/kvargs/version.map lib/librte_kvargs.a
--- stderr ---

[32/3613] Compiling C object lib/librte_eal.a.p/eal_common_eal_common_uuid.c.o
[33/3613] Compiling C object lib/librte_eal.a.p/eal_common_eal_common_trace_points.c.o
[34/3613] Compiling C object lib/librte_eal.a.p/eal_common_eal_common_memory.c.o
[35/3613] Compiling C object lib/librte_eal.a.p/eal_common_malloc_elem.c.o
[36/3613] Compiling C object lib/librte_eal.a.p/eal_common_malloc_heap.c.o
[37/3613] Compiling C object lib/librte_eal.a.p/eal_common_rte_random.c.o
[38/3613] Compiling C object lib/librte_eal.a.p/eal_common_rte_malloc.c.o
[39/3613] Generating telemetry.sym_chk with a custom command (wrapped by meson to capture output)
FAILED: lib/telemetry.sym_chk 
/usr/local/bin/meson --internal exe --capture lib/telemetry.sym_chk -- /root/UB2004-64N_K5.11.16_GCC9.3.0/x86_64-native-linuxapp-gcc/20220309045514/dpdk/buildtools/check-symbols.sh /root/UB2004-64N_K5.11.16_GCC9.3.0/x86_64-native-linuxapp-gcc/20220309045514/dpdk/lib/telemetry/version.map lib/librte_telemetry.a
--- stderr ---

[40/3613] Compiling C object lib/librte_eal.a.p/eal_common_eal_common_options.c.o
ninja: build stopped




*Build Failed #11:
OS: UB2004-64N
Target: x86_64-native-linuxapp-gcc+shared
FAILED: lib/kvargs.sym_chk 
/usr/local/bin/meson --internal exe --capture lib/kvargs.sym_chk -- /root/UB2004-64N_K5.11.16_GCC9.3.0/x86_64-native-linuxapp-gcc+shared/20220309045514/dpdk/buildtools/check-symbols.sh /root/UB2004-64N_K5.11.16_GCC9.3.0/x86_64-native-linuxapp-gcc+shared/20220309045514/dpdk/lib/kvargs/version.map lib/librte_kvargs.a
--- stderr ---

[32/3467] Compiling C object lib/librte_eal.a.p/eal_common_eal_common_memory.c.o
[33/3467] Compiling C object lib/librte_eal.a.p/eal_common_eal_common_uuid.c.o
[34/3467] Compiling C object lib/librte_eal.a.p/eal_common_eal_common_trace_points.c.o
[35/3467] Compiling C object lib/librte_eal.a.p/eal_common_malloc_elem.c.o
[36/3467] Compiling C object lib/librte_eal.a.p/eal_common_rte_random.c.o
[37/3467] Compiling C object lib/librte_eal.a.p/eal_common_malloc_heap.c.o
[38/3467] Generating telemetry.sym_chk with a custom command (wrapped by meson to capture output)
FAILED: lib/telemetry.sym_chk 
/usr/local/bin/meson --internal exe --capture lib/telemetry.sym_chk -- /root/UB2004-64N_K5.11.16_GCC9.3.0/x86_64-native-linuxapp-gcc+shared/20220309045514/dpdk/buildtools/check-symbols.sh /root/UB2004-64N_K5.11.16_GCC9.3.0/x86_64-native-linuxapp-gcc+shared/20220309045514/dpdk/lib/telemetry/version.map lib/librte_telemetry.a
--- stderr ---

[39/3467] Compiling C object lib/librte_eal.a.p/eal_common_rte_malloc.c.o
[40/3467] Compiling C object lib/librte_eal.a.p/eal_common_eal_common_options.c.o
ninja: build stopped




*Build Failed #12:
OS: UB2004-64
Target: x86_64-native-linuxapp-gcc+16byte
FAILED: lib/kvargs.sym_chk 
/usr/local/bin/meson --internal exe --capture lib/kvargs.sym_chk -- /root/UB2004-64_K5.8.0_GCC10.3.0/x86_64-native-linuxapp-gcc+16byte/20220309045514/dpdk/buildtools/check-symbols.sh /root/UB2004-64_K5.8.0_GCC10.3.0/x86_64-native-linuxapp-gcc+16byte/20220309045514/dpdk/lib/kvargs/version.map lib/librte_kvargs.a
--- stderr ---

[33/3613] Compiling C object lib/librte_eal.a.p/eal_common_eal_common_trace_points.c.o
[34/3613] Compiling C object lib/librte_eal.a.p/eal_common_rte_reciprocal.c.o
[35/3613] Compiling C object lib/librte_eal.a.p/eal_common_eal_common_memory.c.o
[36/3613] Compiling C object lib/librte_eal.a.p/eal_common_malloc_elem.c.o
[37/3613] Compiling C object lib/librte_eal.a.p/eal_common_rte_random.c.o
[38/3613] Compiling C object lib/librte_eal.a.p/eal_common_malloc_heap.c.o
[39/3613] Generating telemetry.sym_chk with a custom command (wrapped by meson to capture output)
FAILED: lib/telemetry.sym_chk 
/usr/local/bin/meson --internal exe --capture lib/telemetry.sym_chk -- /root/UB2004-64_K5.8.0_GCC10.3.0/x86_64-native-linuxapp-gcc+16byte/20220309045514/dpdk/buildtools/check-symbols.sh /root/UB2004-64_K5.8.0_GCC10.3.0/x86_64-native-linuxapp-gcc+16byte/20220309045514/dpdk/lib/telemetry/version.map lib/librte_telemetry.a
--- stderr ---

[40/3613] Compiling C object lib/librte_eal.a.p/eal_common_rte_malloc.c.o
[41/3613] Compiling C object lib/librte_eal.a.p/eal_common_eal_common_options.c.o
ninja: build stopped


DPDK STV team

             reply	other threads:[~2022-03-08 21:07 UTC|newest]

Thread overview: 41+ messages / expand[flat|nested]  mbox.gz  Atom feed  top
2022-03-08 21:07 sys_stv [this message]
  -- strict thread matches above, loose matches on Subject: below --
2022-06-22 21:09 sys_stv
2022-06-09  9:08 sys_stv
2022-06-06  7:26 sys_stv
2022-06-06  2:06 sys_stv
2022-06-01 21:06 sys_stv
2022-06-01  1:57 sys_stv
2022-05-31 21:06 sys_stv
2022-05-30  8:26 sys_stv
2022-05-26  8:57 sys_stv
2022-05-20  5:13 sys_stv
2022-05-20  4:47 sys_stv
2022-05-18 21:07 sys_stv
2022-05-18 10:08 sys_stv
2022-05-17 21:07 sys_stv
2022-05-17  9:36 sys_stv
2022-05-17  9:15 sys_stv
2022-05-17  8:58 sys_stv
2022-05-16 21:06 sys_stv
2022-05-07  7:26 sys_stv
2022-05-06 21:06 sys_stv
2022-05-06  9:49 sys_stv
2022-05-06  9:32 sys_stv
2022-03-08 17:16 sys_stv
2022-01-21  7:59 sys_stv
2022-01-21  7:55 sys_stv
2021-12-18 21:50 sys_stv
2021-10-22 22:14 sys_stv
2021-10-14  3:03 sys_stv
2021-08-15 22:10 sys_stv
2021-06-29 15:39 sys_stv
2021-05-27 22:08 sys_stv
2021-05-07  1:05 sys_stv
2021-03-22 22:07 sys_stv
2021-01-28 22:07 sys_stv
2021-01-27 22:07 sys_stv
2021-01-26 22:08 sys_stv
2021-01-26  6:13 sys_stv
2020-11-05 22:08 sys_stv
2020-11-03 22:07 sys_stv
2020-10-20  5:41 sys_stv

Reply instructions:

You may reply publicly to this message via plain-text email
using any one of the following methods:

* Save the following mbox file, import it into your mail client,
  and reply-to-all from there: mbox

  Avoid top-posting and favor interleaved quoting:
  https://en.wikipedia.org/wiki/Posting_style#Interleaved_style

* Reply using the --to, --cc, and --in-reply-to
  switches of git-send-email(1):

  git send-email \
    --in-reply-to='746b4b$gg4j0n@orsmga008-auth.jf.intel.com' \
    --to=sys_stv@intel.com \
    --cc=dpdk_sw_eng@intel.com \
    --cc=npg.sw.core.tools.prc@intel.com \
    --cc=test-report@dpdk.org \
    --cc=thomas@monjalon.net \
    /path/to/YOUR_REPLY

  https://kernel.org/pub/software/scm/git/docs/git-send-email.html

* If your mail client supports setting the In-Reply-To header
  via mailto: links, try the mailto: link

automatic DPDK test reports

This inbox may be cloned and mirrored by anyone:

	git clone --mirror http://inbox.dpdk.org/test-report/0 test-report/git/0.git

	# If you have public-inbox 1.1+ installed, you may
	# initialize and index your mirror using the following commands:
	public-inbox-init -V2 test-report test-report/ http://inbox.dpdk.org/test-report \
		test-report@dpdk.org
	public-inbox-index test-report

Example config snippet for mirrors.
Newsgroup available over NNTP:
	nntp://inbox.dpdk.org/inbox.dpdk.test-report


AGPL code for this site: git clone https://public-inbox.org/public-inbox.git