automatic DPDK test reports
 help / color / mirror / Atom feed
* [dts-test-report] |FAILURE| pw(126911) sid(28023) job(DTS_AUTO_2619) [V1] tests/meson_tests: split test_args in conf/meson_tests.cfg, add -a param and save meson test log
@ 2023-05-17 17:15 sys_stv
  0 siblings, 0 replies; 2+ messages in thread
From: sys_stv @ 2023-05-17 17:15 UTC (permalink / raw)
  To: test-report, dts-test-report, yux.jiang

[-- Attachment #1: Type: text/plain, Size: 2135 bytes --]

Test-Label: Intel-dts-suite-test
Test-Status: FAILURE
http://dpdk.org/patch/126911
Subject: [V1] tests/meson_tests: split test_args in conf/meson_tests.cfg, add -a param and save meson test log

_Testing issues_

Diff:
	tests/TestSuite_meson_tests.py
	conf/meson_tests.cfg

DPDK:
	commit a399d7b5a994e335c446d4b15d7622d71dd8848c
	Author: Nipun Gupta <nipun.gupta@amd.com>
	Date:   Wed Jan 4 10:49:36 2023 +0530
	Comment: vfio: do not coalesce DMA mappings

DTS:
	commit eec72dc0ea5ba5e9b02dfed091e76f9dce0d38b9
	Author: Lijuan Tu <lijuan.tu@intel.com>
	Date:   Fri Apr 28 15:14:05 2023 +0800
	Comment: version: 23.07-rc0


Test environment and result as below:
+-------------+----------+--------------------------------+---------------------------------+
| suits       | category | UB2004-64+216_fortville_spirit | UB2004-64+216_columbiaville_25g |
+-------------+----------+--------------------------------+---------------------------------+
| meson_tests | NIC PF   | run                            | not run                         |
+-------------+----------+--------------------------------+---------------------------------+

Log path: /regression_dts/results/test/178d830d86cb49528ddc7bf87f24126f

#1: UB2004-64+216_fortville_spirit
	OS: Ubuntu 20.04.5 LTS
	Kernel: 5.4.0-135-generic
	CPU: Intel(R) Xeon(R) CPU E5-2699 v3 @ 2.30GHz
	GCC: gcc (Ubuntu 9.4.0-1ubuntu1~20.04.1) 9.4.0
	Clang: NA


	Status: FAILURE
	Catogory: NIC PF
	Target: x86_64-native-linuxapp-gcc
	without_patch Total/Pass/Fail/Blocked/NA: 5/2/3/0/0
	with_patch Total/Pass/Fail/Blocked/NA: 5/2/3/0/0
	
	Detail test results:
	+-------------------------+------------+---------------+
	| suit/case               | with_patch | without_patch |
	+-------------------------+------------+---------------+
	| meson_tests/test_perf   | failed     | failed        |
	| meson_tests/test_fasts  | failed     | failed        |
	| meson_tests/test_driver | failed     | failed        |
	| meson_tests/test_debug  | passed     | passed        |
	| meson_tests/test_extra  | passed     | passed        |
	+-------------------------+------------+---------------+

DPDK STV team

^ permalink raw reply	[flat|nested] 2+ messages in thread

* [dts-test-report] |FAILURE| pw(126911) sid(28023) job(DTS_AUTO_2619) [V1] tests/meson_tests: split test_args in conf/meson_tests.cfg, add -a param and save meson test log
@ 2023-05-17  9:22 sys_stv
  0 siblings, 0 replies; 2+ messages in thread
From: sys_stv @ 2023-05-17  9:22 UTC (permalink / raw)
  To: test-report, dts-test-report, yux.jiang

[-- Attachment #1: Type: text/plain, Size: 1035 bytes --]

Test-Label: Intel-dts-format-test
Test-Status: FAILURE
http://dpdk.org/patch/126911
Subject: [V1] tests/meson_tests: split test_args in conf/meson_tests.cfg, add -a param and save meson test log

_Testing issues_

Diff:
	tests/TestSuite_meson_tests.py
	conf/meson_tests.cfg

DPDK:
	commit a399d7b5a994e335c446d4b15d7622d71dd8848c
	Author: Nipun Gupta <nipun.gupta@amd.com>
	Date:   Wed Jan 4 10:49:36 2023 +0530
	Comment: vfio: do not coalesce DMA mappings

DTS:
	commit eec72dc0ea5ba5e9b02dfed091e76f9dce0d38b9
	Author: Lijuan Tu <lijuan.tu@intel.com>
	Date:   Fri Apr 28 15:14:05 2023 +0800
	Comment: version: 23.07-rc0

FORMAT test failed information:
isort -c --profile black --line-length 88 --python-version auto .

Skipped 1 files
black --check --line-length 88 --required-version 22.1.0 --target-version py38 --safe .

would reformat tests/TestSuite_meson_tests.py

Oh no! 💥 💔 💥
1 file would be reformatted, 367 files would be left unchanged.

Please use format.sh to format your patches and re-submit.

DPDK STV team

^ permalink raw reply	[flat|nested] 2+ messages in thread

end of thread, other threads:[~2023-05-17 17:15 UTC | newest]

Thread overview: 2+ messages (download: mbox.gz / follow: Atom feed)
-- links below jump to the message on this page --
2023-05-17 17:15 [dts-test-report] |FAILURE| pw(126911) sid(28023) job(DTS_AUTO_2619) [V1] tests/meson_tests: split test_args in conf/meson_tests.cfg, add -a param and save meson test log sys_stv
  -- strict thread matches above, loose matches on Subject: below --
2023-05-17  9:22 sys_stv

This is a public inbox, see mirroring instructions
for how to clone and mirror all data and code used for this inbox;
as well as URLs for NNTP newsgroup(s).