automatic DPDK test reports
 help / color / mirror / Atom feed
From: sys_stv@intel.com
To: test-report@dpdk.org, thomas@monjalon.net
Cc: dpdk_sw_eng@intel.com, npg.sw.core.tools.prc@intel.com
Subject: [dpdk-test-report] |FAILURE| dpdk daily Intel builds
Date: 05 Jun 2022 19:06:00 -0700
Message-ID: <7f4525$itt92v@fmsmga008-auth.fm.intel.com> (raw)

[-- Attachment #1: Type: text/plain, Size: 97586 bytes --]


Test-Label: Intel-compilation
Test-Status: FAILURE
_Compilation issues_


commit fb96caa56aabaa425ae66cd638ce9b9065828044
Author: Raja Zidane <rzidane@nvidia.com>
Date:   Thu Jun 2 16:03:08 2022 +0300

    net/mlx5: support ESP item on Windows

DPDK git Repo: dpdk 


Meson Build Summary: 23 Builds Done, 4 Successful, 19 Failures, 0 Blocked

+--------------+------------+--------------+------------+------------+-----------+----------+------------+
| os           | gcc-static | clang-static | icc-static | gcc-shared | gcc-debug | document | gcc-16byte |
+--------------+------------+--------------+------------+------------+-----------+----------+------------+
| FC36-64      |            | fail         |            |            |           |          |            |
| FreeBSD13-64 | pass       | pass         |            | pass       | pass      |          |            |
| RHEL86-64    | fail       | fail         |            | fail       | fail      |          |            |
| SUSE15-64    | fail       | fail         |            |            |           |          |            |
| UB2004-32    | fail       |              |            |            |           |          |            |
| UB2004-64    | fail       | fail         |            |            |           | fail     |            |
| UB2204-32    | fail       |              |            |            |           |          |            |
| UB2204-64N   | fail       |              |            | fail       |           |          |            |
| UB2204-64    | fail       | fail         |            |            |           | fail     | fail       |
| CentOS79-64  | fail       |              |            |            |           |          |            |
+--------------+------------+--------------+------------+------------+-----------+----------+------------+

Comments: 
Because of DPDK bug (https://bugs.dpdk.org/show_bug.cgi?id=928),
All the dpdk-next-* branch add `Ddisable_drivers=event/cnxk` option when build with ICC complier. 
 
Test environment and configuration as below:


OS: FC36-64
	Kernel Version: 5.17.7-300.fc36.x86_64
	GCC Version: gcc (GCC) 12.1.1 20220507 (Red Hat 12.1.1-1)
	Clang Version: 14.0.0 (Fedora 14.0.0-1.fc36)
	x86_64-native-linuxapp-clang

OS: FreeBSD13-64
	Kernel Version: 13.0-RELEASE
	GCC Version: gcc (FreeBSD Ports Collection) 10.3.0
	Clang Version: 11.0.1 (git@github.com:llvm/llvm-project.git llvmorg-11.0.1-0-g43ff75f2c3fe)
	x86_64-native-bsdapp-gcc
	x86_64-native-bsdapp-clang
	x86_64-native-bsdapp-gcc+shared
	x86_64-native-bsdapp-gcc+debug

OS: RHEL86-64
	Kernel Version: 4.18.0-372.9.1.el8.x86_64
	GCC Version: gcc (GCC) 8.5.0 20210514 (Red Hat 8.5.0-13)
	Clang Version: 14.0.0 (Red Hat 14.0.0-1.module_el8.7.0+1142+5343df54)
	x86_64-native-linuxapp-gcc
	x86_64-native-linuxapp-clang
	x86_64-native-linuxapp-gcc+shared
	x86_64-native-linuxapp-gcc+debug

OS: SUSE15-64
	Kernel Version: 5.3.18-57-default
	GCC Version: gcc (SUSE Linux) 7.5.0
	Clang Version: 11.0.1
	x86_64-native-linuxapp-clang
	x86_64-native-linuxapp-gcc

OS: UB2004-32
	Kernel Version: 5.8.0-48-generic
	GCC Version: gcc (Ubuntu 10.3.0-1ubuntu1~20.04) 10.3.0
	Clang Version: 10.0.0-4ubuntu1
	i686-native-linuxapp-gcc

OS: UB2004-64
	Kernel Version: 5.8.0-48-generic
	GCC Version: gcc (Ubuntu 10.3.0-1ubuntu1~20.04) 10.3.0
	Clang Version: 10.0.0-4ubuntu1
	x86_64-native-linuxapp-clang
	x86_64-native-linuxapp-gcc
	x86_64-native-linuxapp-doc

OS: UB2204-32
	Kernel Version: 5.15.0-25-generic
	GCC Version: gcc (Ubuntu 11.2.0-19ubuntu1) 11.2.0
	Clang Version: NA
	i686-native-linuxapp-gcc

OS: UB2204-64N
	Kernel Version: 5.17.5-051705-generic
	GCC Version: gcc (Ubuntu 11.2.0-19ubuntu1) 11.2.0
	Clang Version: 14.0.0-1ubuntu1
	x86_64-native-linuxapp-gcc
	x86_64-native-linuxapp-gcc+shared

OS: UB2204-64
	Kernel Version: 5.15.0-25-generic
	GCC Version: gcc (Ubuntu 11.2.0-19ubuntu1) 11.2.0
	Clang Version: 14.0.0-1ubuntu1
	x86_64-native-linuxapp-gcc+16byte
	x86_64-native-linuxapp-gcc
	x86_64-native-linuxapp-clang
	x86_64-native-linuxapp-doc

OS: CentOS79-64
	Kernel Version: 3.10.0-1160.el7.x86_64
	GCC Version: gcc (GCC) 4.8.5 20150623 (Red Hat 4.8.5-44)
	Clang Version: 3.4.2 (tags/RELEASE_34/dot2-final)
	x86_64-native-linuxapp-gcc



*Build Failed #1:
OS: FC36-64
Target: x86_64-native-linuxapp-clang
FAILED: kernel/linux/kni/rte_kni.ko 
/usr/bin/make -j4 -C /lib/modules/5.17.7-300.fc36.x86_64/build M=/root/FC36-64_K5.14.17_Clang14.0.0/x86_64-native-linuxapp-clang/20220606095551/dpdk/x86_64-native-linuxapp-clang/kernel/linux/kni src=/root/FC36-64_K5.14.17_Clang14.0.0/x86_64-native-linuxapp-clang/20220606095551/dpdk/kernel/linux/kni 'MODULE_CFLAGS= -DHAVE_ARG_TX_QUEUE -include /root/FC36-64_K5.14.17_Clang14.0.0/x86_64-native-linuxapp-clang/20220606095551/dpdk/config/rte_config.h -I/root/FC36-64_K5.14.17_Clang14.0.0/x86_64-native-linuxapp-clang/20220606095551/dpdk/lib/eal/include -I/root/FC36-64_K5.14.17_Clang14.0.0/x86_64-native-linuxapp-clang/20220606095551/dpdk/lib/kni -I/root/FC36-64_K5.14.17_Clang14.0.0/x86_64-native-linuxapp-clang/20220606095551/dpdk/x86_64-native-linuxapp-clang -I/root/FC36-64_K5.14.17_Clang14.0.0/x86_64-native-linuxapp-clang/20220606095551/dpdk/kernel/linux/kni' modules
make: Entering directory '/usr/src/kernels/5.17.7-300.fc36.x86_64'
  CC [M]  /root/FC36-64_K5.14.17_Clang14.0.0/x86_64-native-linuxapp-clang/20220606095551/dpdk/x86_64-native-linuxapp-clang/kernel/linux/kni/kni_misc.o
  CC [M]  /root/FC36-64_K5.14.17_Clang14.0.0/x86_64-native-linuxapp-clang/20220606095551/dpdk/x86_64-native-linuxapp-clang/kernel/linux/kni/kni_net.o
/root/FC36-64_K5.14.17_Clang14.0.0/x86_64-native-linuxapp-clang/20220606095551/dpdk/kernel/linux/kni/kni_misc.c: In function ‘kni_ioctl_create’:
/root/FC36-64_K5.14.17_Clang14.0.0/x86_64-native-linuxapp-clang/20220606095551/dpdk/kernel/linux/kni/kni_misc.c:406:31: warning: passing argument 1 of ‘memcpy’ discards ‘const’ qualifier from pointer target type [-Wdiscarded-qualifiers]
  406 |                 memcpy(net_dev->dev_addr, dev_info.mac_addr, ETH_ALEN);
      |                        ~~~~~~~^~~~~~~~~~
In file included from ./include/linux/string.h:253,
                 from ./include/linux/bitmap.h:11,
                 from ./include/linux/cpumask.h:12,
                 from ./arch/x86/include/asm/cpumask.h:5,
                 from ./arch/x86/include/asm/msr.h:11,
                 from ./arch/x86/include/asm/processor.h:22,
                 from ./arch/x86/include/asm/timex.h:5,
                 from ./include/linux/timex.h:65,
                 from ./include/linux/time32.h:13,
                 from ./include/linux/time.h:60,
                 from ./include/linux/stat.h:19,
                 from ./include/linux/module.h:13,
                 from /root/FC36-64_K5.14.17_Clang14.0.0/x86_64-native-linuxapp-clang/20220606095551/dpdk/kernel/linux/kni/kni_misc.c:7:
./include/linux/fortify-string.h:212:37: note: expected ‘void *’ but argument is of type ‘const unsigned char *’
  212 | __FORTIFY_INLINE void *memcpy(void *p, const void *q, __kernel_size_t size)
      |                               ~~~~~~^
/root/FC36-64_K5.14.17_Clang14.0.0/x86_64-native-linuxapp-clang/20220606095551/dpdk/kernel/linux/kni/kni_misc.c:409:40: warning: passing argument 1 of ‘eth_random_addr’ discards ‘const’ qualifier from pointer target type [-Wdiscarded-qualifiers]
  409 |                 eth_random_addr(net_dev->dev_addr);
      |                                 ~~~~~~~^~~~~~~~~~
In file included from /root/FC36-64_K5.14.17_Clang14.0.0/x86_64-native-linuxapp-clang/20220606095551/dpdk/kernel/linux/kni/kni_misc.c:10:
./include/linux/etherdevice.h:230:40: note: expected ‘u8 *’ {aka ‘unsigned char *’} but argument is of type ‘const unsigned char *’
  230 | static inline void eth_random_addr(u8 *addr)
      |                                    ~~~~^~~~
/root/FC36-64_K5.14.17_Clang14.0.0/x86_64-native-linuxapp-clang/20220606095551/dpdk/kernel/linux/kni/kni_net.c: In function ‘kni_net_rx_normal’:
/root/FC36-64_K5.14.17_Clang14.0.0/x86_64-native-linuxapp-clang/20220606095551/dpdk/kernel/linux/kni/kni_net.c:448:2: error: #else after #else
  448 | #else
      |  ^~~~
/root/FC36-64_K5.14.17_Clang14.0.0/x86_64-native-linuxapp-clang/20220606095551/dpdk/kernel/linux/kni/kni_net.c:444: error: the conditional began here
  444 | #ifdef HAVE_NETIF_RX_NI
      | 
/root/FC36-64_K5.14.17_Clang14.0.0/x86_64-native-linuxapp-clang/20220606095551/dpdk/kernel/linux/kni/kni_net.c:444: error: unterminated #else
/root/FC36-64_K5.14.17_Clang14.0.0/x86_64-native-linuxapp-clang/20220606095551/dpdk/kernel/linux/kni/kni_net.c:445:17: error: expected declaration or statement at end of input
  445 |                 netif_rx_ni(skb);
      |                 ^~~~~~~~~~~
/root/FC36-64_K5.14.17_Clang14.0.0/x86_64-native-linuxapp-clang/20220606095551/dpdk/kernel/linux/kni/kni_net.c:445:17: error: expected declaration or statement at end of input
/root/FC36-64_K5.14.17_Clang14.0.0/x86_64-native-linuxapp-clang/20220606095551/dpdk/kernel/linux/kni/kni_net.c:382:18: warning: unused variable ‘ret’ [-Wunused-variable]
  382 |         uint32_t ret;
      |                  ^~~
/root/FC36-64_K5.14.17_Clang14.0.0/x86_64-native-linuxapp-clang/20220606095551/dpdk/kernel/linux/kni/kni_net.c: At top level:
/root/FC36-64_K5.14.17_Clang14.0.0/x86_64-native-linuxapp-clang/20220606095551/dpdk/kernel/linux/kni/kni_net.c:297:1: warning: ‘kni_net_tx’ defined but not used [-Wunused-function]
  297 | kni_net_tx(struct sk_buff *skb, struct net_device *dev)
      | ^~~~~~~~~~
/root/FC36-64_K5.14.17_Clang14.0.0/x86_64-native-linuxapp-clang/20220606095551/dpdk/kernel/linux/kni/kni_net.c:284:1: warning: ‘kni_net_config’ defined but not used [-Wunused-function]
  284 | kni_net_config(struct net_device *dev, struct ifmap *map)
      | ^~~~~~~~~~~~~~
/root/FC36-64_K5.14.17_Clang14.0.0/x86_64-native-linuxapp-clang/20220606095551/dpdk/kernel/linux/kni/kni_net.c:202:1: warning: ‘kni_net_release’ defined but not used [-Wunused-function]
  202 | kni_net_release(struct net_device *dev)
      | ^~~~~~~~~~~~~~~
/root/FC36-64_K5.14.17_Clang14.0.0/x86_64-native-linuxapp-clang/20220606095551/dpdk/kernel/linux/kni/kni_net.c:180:1: warning: ‘kni_net_open’ defined but not used [-Wunused-function]
  180 | kni_net_open(struct net_device *dev)
      | ^~~~~~~~~~~~
/root/FC36-64_K5.14.17_Clang14.0.0/x86_64-native-linuxapp-clang/20220606095551/dpdk/kernel/linux/kni/kni_net.c:38:21: warning: ‘kni_net_rx_func’ defined but not used [-Wunused-variable]
   38 | static kni_net_rx_t kni_net_rx_func = kni_net_rx_normal;
      |                     ^~~~~~~~~~~~~~~
make[1]: *** [scripts/Makefile.build:288: /root/FC36-64_K5.14.17_Clang14.0.0/x86_64-native-linuxapp-clang/20220606095551/dpdk/x86_64-native-linuxapp-clang/kernel/linux/kni/kni_net.o] Error 1
make[1]: *** Waiting for unfinished jobs....
make: *** [Makefile:1841: /root/FC36-64_K5.14.17_Clang14.0.0/x86_64-native-linuxapp-clang/20220606095551/dpdk/x86_64-native-linuxapp-clang/kernel/linux/kni] Error 2
make: Leaving directory '/usr/src/kernels/5.17.7-300.fc36.x86_64'
[3552/3553] Linking target examples/dpdk-vmdq_dcb
[3553/3553] Linking target examples/dpdk-vhost
ninja: build stopped




*Build Failed #2:
OS: RHEL86-64
Target: x86_64-native-linuxapp-gcc
FAILED: kernel/linux/kni/rte_kni.ko 
/usr/bin/make -j4 -C /lib/modules/4.18.0-372.9.1.el8.x86_64/build M=/root/RHEL86-64_K4.18.0_GCC8.5.0/x86_64-native-linuxapp-gcc/20220606095551/dpdk/x86_64-native-linuxapp-gcc/kernel/linux/kni src=/root/RHEL86-64_K4.18.0_GCC8.5.0/x86_64-native-linuxapp-gcc/20220606095551/dpdk/kernel/linux/kni 'MODULE_CFLAGS= -DHAVE_ARG_TX_QUEUE -include /root/RHEL86-64_K4.18.0_GCC8.5.0/x86_64-native-linuxapp-gcc/20220606095551/dpdk/config/rte_config.h -I/root/RHEL86-64_K4.18.0_GCC8.5.0/x86_64-native-linuxapp-gcc/20220606095551/dpdk/lib/eal/include -I/root/RHEL86-64_K4.18.0_GCC8.5.0/x86_64-native-linuxapp-gcc/20220606095551/dpdk/lib/kni -I/root/RHEL86-64_K4.18.0_GCC8.5.0/x86_64-native-linuxapp-gcc/20220606095551/dpdk/x86_64-native-linuxapp-gcc -I/root/RHEL86-64_K4.18.0_GCC8.5.0/x86_64-native-linuxapp-gcc/20220606095551/dpdk/kernel/linux/kni' modules
make: Entering directory '/usr/src/kernels/4.18.0-372.9.1.el8.x86_64'
  CC [M]  /root/RHEL86-64_K4.18.0_GCC8.5.0/x86_64-native-linuxapp-gcc/20220606095551/dpdk/x86_64-native-linuxapp-gcc/kernel/linux/kni/kni_net.o
  CC [M]  /root/RHEL86-64_K4.18.0_GCC8.5.0/x86_64-native-linuxapp-gcc/20220606095551/dpdk/x86_64-native-linuxapp-gcc/kernel/linux/kni/kni_misc.o
/root/RHEL86-64_K4.18.0_GCC8.5.0/x86_64-native-linuxapp-gcc/20220606095551/dpdk/kernel/linux/kni/kni_net.c: In function ‘kni_net_rx_normal’:
/root/RHEL86-64_K4.18.0_GCC8.5.0/x86_64-native-linuxapp-gcc/20220606095551/dpdk/kernel/linux/kni/kni_net.c:448:2: error: #else after #else
 #else
  ^~~~
/root/RHEL86-64_K4.18.0_GCC8.5.0/x86_64-native-linuxapp-gcc/20220606095551/dpdk/kernel/linux/kni/kni_net.c:444: error: the conditional began here
 #ifdef HAVE_NETIF_RX_NI
 
/root/RHEL86-64_K4.18.0_GCC8.5.0/x86_64-native-linuxapp-gcc/20220606095551/dpdk/kernel/linux/kni/kni_net.c:444: error: unterminated #else
/root/RHEL86-64_K4.18.0_GCC8.5.0/x86_64-native-linuxapp-gcc/20220606095551/dpdk/kernel/linux/kni/kni_net.c:445:3: error: expected declaration or statement at end of input
   netif_rx_ni(skb);
   ^~~~~~~~~~~
/root/RHEL86-64_K4.18.0_GCC8.5.0/x86_64-native-linuxapp-gcc/20220606095551/dpdk/kernel/linux/kni/kni_net.c:445:3: error: expected declaration or statement at end of input
/root/RHEL86-64_K4.18.0_GCC8.5.0/x86_64-native-linuxapp-gcc/20220606095551/dpdk/kernel/linux/kni/kni_net.c:382:11: warning: unused variable ‘ret’ [-Wunused-variable]
  uint32_t ret;
           ^~~
At top level:
/root/RHEL86-64_K4.18.0_GCC8.5.0/x86_64-native-linuxapp-gcc/20220606095551/dpdk/kernel/linux/kni/kni_net.c:297:1: warning: ‘kni_net_tx’ defined but not used [-Wunused-function]
 kni_net_tx(struct sk_buff *skb, struct net_device *dev)
 ^~~~~~~~~~
/root/RHEL86-64_K4.18.0_GCC8.5.0/x86_64-native-linuxapp-gcc/20220606095551/dpdk/kernel/linux/kni/kni_net.c:284:1: warning: ‘kni_net_config’ defined but not used [-Wunused-function]
 kni_net_config(struct net_device *dev, struct ifmap *map)
 ^~~~~~~~~~~~~~
/root/RHEL86-64_K4.18.0_GCC8.5.0/x86_64-native-linuxapp-gcc/20220606095551/dpdk/kernel/linux/kni/kni_net.c:202:1: warning: ‘kni_net_release’ defined but not used [-Wunused-function]
 kni_net_release(struct net_device *dev)
 ^~~~~~~~~~~~~~~
/root/RHEL86-64_K4.18.0_GCC8.5.0/x86_64-native-linuxapp-gcc/20220606095551/dpdk/kernel/linux/kni/kni_net.c:180:1: warning: ‘kni_net_open’ defined but not used [-Wunused-function]
 kni_net_open(struct net_device *dev)
 ^~~~~~~~~~~~
/root/RHEL86-64_K4.18.0_GCC8.5.0/x86_64-native-linuxapp-gcc/20220606095551/dpdk/kernel/linux/kni/kni_net.c:38:21: warning: ‘kni_net_rx_func’ defined but not used [-Wunused-variable]
 static kni_net_rx_t kni_net_rx_func = kni_net_rx_normal;
                     ^~~~~~~~~~~~~~~
make[1]: *** [scripts/Makefile.build:316: /root/RHEL86-64_K4.18.0_GCC8.5.0/x86_64-native-linuxapp-gcc/20220606095551/dpdk/x86_64-native-linuxapp-gcc/kernel/linux/kni/kni_net.o] Error 1
make[1]: *** Waiting for unfinished jobs....
make: *** [Makefile:1577: _module_/root/RHEL86-64_K4.18.0_GCC8.5.0/x86_64-native-linuxapp-gcc/20220606095551/dpdk/x86_64-native-linuxapp-gcc/kernel/linux/kni] Error 2
make: Leaving directory '/usr/src/kernels/4.18.0-372.9.1.el8.x86_64'
ninja: build stopped




*Build Failed #3:
OS: RHEL86-64
Target: x86_64-native-linuxapp-clang
FAILED: kernel/linux/kni/rte_kni.ko 
/usr/bin/make -j4 -C /lib/modules/4.18.0-372.9.1.el8.x86_64/build M=/root/RHEL86-64_K4.18.0_Clang14.0.0/x86_64-native-linuxapp-clang/20220606095551/dpdk/x86_64-native-linuxapp-clang/kernel/linux/kni src=/root/RHEL86-64_K4.18.0_Clang14.0.0/x86_64-native-linuxapp-clang/20220606095551/dpdk/kernel/linux/kni 'MODULE_CFLAGS= -DHAVE_ARG_TX_QUEUE -include /root/RHEL86-64_K4.18.0_Clang14.0.0/x86_64-native-linuxapp-clang/20220606095551/dpdk/config/rte_config.h -I/root/RHEL86-64_K4.18.0_Clang14.0.0/x86_64-native-linuxapp-clang/20220606095551/dpdk/lib/eal/include -I/root/RHEL86-64_K4.18.0_Clang14.0.0/x86_64-native-linuxapp-clang/20220606095551/dpdk/lib/kni -I/root/RHEL86-64_K4.18.0_Clang14.0.0/x86_64-native-linuxapp-clang/20220606095551/dpdk/x86_64-native-linuxapp-clang -I/root/RHEL86-64_K4.18.0_Clang14.0.0/x86_64-native-linuxapp-clang/20220606095551/dpdk/kernel/linux/kni' modules
make: Entering directory '/usr/src/kernels/4.18.0-372.9.1.el8.x86_64'
  CC [M]  /root/RHEL86-64_K4.18.0_Clang14.0.0/x86_64-native-linuxapp-clang/20220606095551/dpdk/x86_64-native-linuxapp-clang/kernel/linux/kni/kni_net.o
  CC [M]  /root/RHEL86-64_K4.18.0_Clang14.0.0/x86_64-native-linuxapp-clang/20220606095551/dpdk/x86_64-native-linuxapp-clang/kernel/linux/kni/kni_misc.o
/root/RHEL86-64_K4.18.0_Clang14.0.0/x86_64-native-linuxapp-clang/20220606095551/dpdk/kernel/linux/kni/kni_net.c: In function ‘kni_net_rx_normal’:
/root/RHEL86-64_K4.18.0_Clang14.0.0/x86_64-native-linuxapp-clang/20220606095551/dpdk/kernel/linux/kni/kni_net.c:448:2: error: #else after #else
 #else
  ^~~~
/root/RHEL86-64_K4.18.0_Clang14.0.0/x86_64-native-linuxapp-clang/20220606095551/dpdk/kernel/linux/kni/kni_net.c:444: error: the conditional began here
 #ifdef HAVE_NETIF_RX_NI
 
/root/RHEL86-64_K4.18.0_Clang14.0.0/x86_64-native-linuxapp-clang/20220606095551/dpdk/kernel/linux/kni/kni_net.c:444: error: unterminated #else
/root/RHEL86-64_K4.18.0_Clang14.0.0/x86_64-native-linuxapp-clang/20220606095551/dpdk/kernel/linux/kni/kni_net.c:445:3: error: expected declaration or statement at end of input
   netif_rx_ni(skb);
   ^~~~~~~~~~~
/root/RHEL86-64_K4.18.0_Clang14.0.0/x86_64-native-linuxapp-clang/20220606095551/dpdk/kernel/linux/kni/kni_net.c:445:3: error: expected declaration or statement at end of input
/root/RHEL86-64_K4.18.0_Clang14.0.0/x86_64-native-linuxapp-clang/20220606095551/dpdk/kernel/linux/kni/kni_net.c:382:11: warning: unused variable ‘ret’ [-Wunused-variable]
  uint32_t ret;
           ^~~
At top level:
/root/RHEL86-64_K4.18.0_Clang14.0.0/x86_64-native-linuxapp-clang/20220606095551/dpdk/kernel/linux/kni/kni_net.c:297:1: warning: ‘kni_net_tx’ defined but not used [-Wunused-function]
 kni_net_tx(struct sk_buff *skb, struct net_device *dev)
 ^~~~~~~~~~
/root/RHEL86-64_K4.18.0_Clang14.0.0/x86_64-native-linuxapp-clang/20220606095551/dpdk/kernel/linux/kni/kni_net.c:284:1: warning: ‘kni_net_config’ defined but not used [-Wunused-function]
 kni_net_config(struct net_device *dev, struct ifmap *map)
 ^~~~~~~~~~~~~~
/root/RHEL86-64_K4.18.0_Clang14.0.0/x86_64-native-linuxapp-clang/20220606095551/dpdk/kernel/linux/kni/kni_net.c:202:1: warning: ‘kni_net_release’ defined but not used [-Wunused-function]
 kni_net_release(struct net_device *dev)
 ^~~~~~~~~~~~~~~
/root/RHEL86-64_K4.18.0_Clang14.0.0/x86_64-native-linuxapp-clang/20220606095551/dpdk/kernel/linux/kni/kni_net.c:180:1: warning: ‘kni_net_open’ defined but not used [-Wunused-function]
 kni_net_open(struct net_device *dev)
 ^~~~~~~~~~~~
/root/RHEL86-64_K4.18.0_Clang14.0.0/x86_64-native-linuxapp-clang/20220606095551/dpdk/kernel/linux/kni/kni_net.c:38:21: warning: ‘kni_net_rx_func’ defined but not used [-Wunused-variable]
 static kni_net_rx_t kni_net_rx_func = kni_net_rx_normal;
                     ^~~~~~~~~~~~~~~
make[1]: *** [scripts/Makefile.build:316: /root/RHEL86-64_K4.18.0_Clang14.0.0/x86_64-native-linuxapp-clang/20220606095551/dpdk/x86_64-native-linuxapp-clang/kernel/linux/kni/kni_net.o] Error 1
make[1]: *** Waiting for unfinished jobs....
make: *** [Makefile:1577: _module_/root/RHEL86-64_K4.18.0_Clang14.0.0/x86_64-native-linuxapp-clang/20220606095551/dpdk/x86_64-native-linuxapp-clang/kernel/linux/kni] Error 2
make: Leaving directory '/usr/src/kernels/4.18.0-372.9.1.el8.x86_64'
ninja: build stopped




*Build Failed #4:
OS: RHEL86-64
Target: x86_64-native-linuxapp-gcc+shared
FAILED: kernel/linux/kni/rte_kni.ko 
/usr/bin/make -j4 -C /lib/modules/4.18.0-372.9.1.el8.x86_64/build M=/root/RHEL86-64_K4.18.0_GCC8.5.0/x86_64-native-linuxapp-gcc+shared/20220606095551/dpdk/x86_64-native-linuxapp-gcc+shared/kernel/linux/kni src=/root/RHEL86-64_K4.18.0_GCC8.5.0/x86_64-native-linuxapp-gcc+shared/20220606095551/dpdk/kernel/linux/kni 'MODULE_CFLAGS= -DHAVE_ARG_TX_QUEUE -include /root/RHEL86-64_K4.18.0_GCC8.5.0/x86_64-native-linuxapp-gcc+shared/20220606095551/dpdk/config/rte_config.h -I/root/RHEL86-64_K4.18.0_GCC8.5.0/x86_64-native-linuxapp-gcc+shared/20220606095551/dpdk/lib/eal/include -I/root/RHEL86-64_K4.18.0_GCC8.5.0/x86_64-native-linuxapp-gcc+shared/20220606095551/dpdk/lib/kni -I/root/RHEL86-64_K4.18.0_GCC8.5.0/x86_64-native-linuxapp-gcc+shared/20220606095551/dpdk/x86_64-native-linuxapp-gcc+shared -I/root/RHEL86-64_K4.18.0_GCC8.5.0/x86_64-native-linuxapp-gcc+shared/20220606095551/dpdk/kernel/linux/kni' modules
make: Entering directory '/usr/src/kernels/4.18.0-372.9.1.el8.x86_64'
  CC [M]  /root/RHEL86-64_K4.18.0_GCC8.5.0/x86_64-native-linuxapp-gcc+shared/20220606095551/dpdk/x86_64-native-linuxapp-gcc+shared/kernel/linux/kni/kni_net.o
  CC [M]  /root/RHEL86-64_K4.18.0_GCC8.5.0/x86_64-native-linuxapp-gcc+shared/20220606095551/dpdk/x86_64-native-linuxapp-gcc+shared/kernel/linux/kni/kni_misc.o
/root/RHEL86-64_K4.18.0_GCC8.5.0/x86_64-native-linuxapp-gcc+shared/20220606095551/dpdk/kernel/linux/kni/kni_net.c: In function ‘kni_net_rx_normal’:
/root/RHEL86-64_K4.18.0_GCC8.5.0/x86_64-native-linuxapp-gcc+shared/20220606095551/dpdk/kernel/linux/kni/kni_net.c:448:2: error: #else after #else
 #else
  ^~~~
/root/RHEL86-64_K4.18.0_GCC8.5.0/x86_64-native-linuxapp-gcc+shared/20220606095551/dpdk/kernel/linux/kni/kni_net.c:444: error: the conditional began here
 #ifdef HAVE_NETIF_RX_NI
 
/root/RHEL86-64_K4.18.0_GCC8.5.0/x86_64-native-linuxapp-gcc+shared/20220606095551/dpdk/kernel/linux/kni/kni_net.c:444: error: unterminated #else
/root/RHEL86-64_K4.18.0_GCC8.5.0/x86_64-native-linuxapp-gcc+shared/20220606095551/dpdk/kernel/linux/kni/kni_net.c:445:3: error: expected declaration or statement at end of input
   netif_rx_ni(skb);
   ^~~~~~~~~~~
/root/RHEL86-64_K4.18.0_GCC8.5.0/x86_64-native-linuxapp-gcc+shared/20220606095551/dpdk/kernel/linux/kni/kni_net.c:445:3: error: expected declaration or statement at end of input
/root/RHEL86-64_K4.18.0_GCC8.5.0/x86_64-native-linuxapp-gcc+shared/20220606095551/dpdk/kernel/linux/kni/kni_net.c:382:11: warning: unused variable ‘ret’ [-Wunused-variable]
  uint32_t ret;
           ^~~
At top level:
/root/RHEL86-64_K4.18.0_GCC8.5.0/x86_64-native-linuxapp-gcc+shared/20220606095551/dpdk/kernel/linux/kni/kni_net.c:297:1: warning: ‘kni_net_tx’ defined but not used [-Wunused-function]
 kni_net_tx(struct sk_buff *skb, struct net_device *dev)
 ^~~~~~~~~~
/root/RHEL86-64_K4.18.0_GCC8.5.0/x86_64-native-linuxapp-gcc+shared/20220606095551/dpdk/kernel/linux/kni/kni_net.c:284:1: warning: ‘kni_net_config’ defined but not used [-Wunused-function]
 kni_net_config(struct net_device *dev, struct ifmap *map)
 ^~~~~~~~~~~~~~
/root/RHEL86-64_K4.18.0_GCC8.5.0/x86_64-native-linuxapp-gcc+shared/20220606095551/dpdk/kernel/linux/kni/kni_net.c:202:1: warning: ‘kni_net_release’ defined but not used [-Wunused-function]
 kni_net_release(struct net_device *dev)
 ^~~~~~~~~~~~~~~
/root/RHEL86-64_K4.18.0_GCC8.5.0/x86_64-native-linuxapp-gcc+shared/20220606095551/dpdk/kernel/linux/kni/kni_net.c:180:1: warning: ‘kni_net_open’ defined but not used [-Wunused-function]
 kni_net_open(struct net_device *dev)
 ^~~~~~~~~~~~
/root/RHEL86-64_K4.18.0_GCC8.5.0/x86_64-native-linuxapp-gcc+shared/20220606095551/dpdk/kernel/linux/kni/kni_net.c:38:21: warning: ‘kni_net_rx_func’ defined but not used [-Wunused-variable]
 static kni_net_rx_t kni_net_rx_func = kni_net_rx_normal;
                     ^~~~~~~~~~~~~~~
make[1]: *** [scripts/Makefile.build:316: /root/RHEL86-64_K4.18.0_GCC8.5.0/x86_64-native-linuxapp-gcc+shared/20220606095551/dpdk/x86_64-native-linuxapp-gcc+shared/kernel/linux/kni/kni_net.o] Error 1
make[1]: *** Waiting for unfinished jobs....
make: *** [Makefile:1577: _module_/root/RHEL86-64_K4.18.0_GCC8.5.0/x86_64-native-linuxapp-gcc+shared/20220606095551/dpdk/x86_64-native-linuxapp-gcc+shared/kernel/linux/kni] Error 2
make: Leaving directory '/usr/src/kernels/4.18.0-372.9.1.el8.x86_64'
[3392/3393] Compiling C object app/test/dpdk-test.p/test_ring.c.o
ninja: build stopped




*Build Failed #5:
OS: RHEL86-64
Target: x86_64-native-linuxapp-gcc+debug
FAILED: kernel/linux/kni/rte_kni.ko 
/usr/bin/make -j4 -C /lib/modules/4.18.0-372.9.1.el8.x86_64/build M=/root/RHEL86-64_K4.18.0_GCC8.5.0/x86_64-native-linuxapp-gcc+debug/20220606095551/dpdk/x86_64-native-linuxapp-gcc+debug/kernel/linux/kni src=/root/RHEL86-64_K4.18.0_GCC8.5.0/x86_64-native-linuxapp-gcc+debug/20220606095551/dpdk/kernel/linux/kni 'MODULE_CFLAGS= -DHAVE_ARG_TX_QUEUE -include /root/RHEL86-64_K4.18.0_GCC8.5.0/x86_64-native-linuxapp-gcc+debug/20220606095551/dpdk/config/rte_config.h -I/root/RHEL86-64_K4.18.0_GCC8.5.0/x86_64-native-linuxapp-gcc+debug/20220606095551/dpdk/lib/eal/include -I/root/RHEL86-64_K4.18.0_GCC8.5.0/x86_64-native-linuxapp-gcc+debug/20220606095551/dpdk/lib/kni -I/root/RHEL86-64_K4.18.0_GCC8.5.0/x86_64-native-linuxapp-gcc+debug/20220606095551/dpdk/x86_64-native-linuxapp-gcc+debug -I/root/RHEL86-64_K4.18.0_GCC8.5.0/x86_64-native-linuxapp-gcc+debug/20220606095551/dpdk/kernel/linux/kni' modules
make: Entering directory '/usr/src/kernels/4.18.0-372.9.1.el8.x86_64'
  CC [M]  /root/RHEL86-64_K4.18.0_GCC8.5.0/x86_64-native-linuxapp-gcc+debug/20220606095551/dpdk/x86_64-native-linuxapp-gcc+debug/kernel/linux/kni/kni_net.o
  CC [M]  /root/RHEL86-64_K4.18.0_GCC8.5.0/x86_64-native-linuxapp-gcc+debug/20220606095551/dpdk/x86_64-native-linuxapp-gcc+debug/kernel/linux/kni/kni_misc.o
/root/RHEL86-64_K4.18.0_GCC8.5.0/x86_64-native-linuxapp-gcc+debug/20220606095551/dpdk/kernel/linux/kni/kni_net.c: In function ‘kni_net_rx_normal’:
/root/RHEL86-64_K4.18.0_GCC8.5.0/x86_64-native-linuxapp-gcc+debug/20220606095551/dpdk/kernel/linux/kni/kni_net.c:448:2: error: #else after #else
 #else
  ^~~~
/root/RHEL86-64_K4.18.0_GCC8.5.0/x86_64-native-linuxapp-gcc+debug/20220606095551/dpdk/kernel/linux/kni/kni_net.c:444: error: the conditional began here
 #ifdef HAVE_NETIF_RX_NI
 
/root/RHEL86-64_K4.18.0_GCC8.5.0/x86_64-native-linuxapp-gcc+debug/20220606095551/dpdk/kernel/linux/kni/kni_net.c:444: error: unterminated #else
/root/RHEL86-64_K4.18.0_GCC8.5.0/x86_64-native-linuxapp-gcc+debug/20220606095551/dpdk/kernel/linux/kni/kni_net.c:445:3: error: expected declaration or statement at end of input
   netif_rx_ni(skb);
   ^~~~~~~~~~~
/root/RHEL86-64_K4.18.0_GCC8.5.0/x86_64-native-linuxapp-gcc+debug/20220606095551/dpdk/kernel/linux/kni/kni_net.c:445:3: error: expected declaration or statement at end of input
/root/RHEL86-64_K4.18.0_GCC8.5.0/x86_64-native-linuxapp-gcc+debug/20220606095551/dpdk/kernel/linux/kni/kni_net.c:382:11: warning: unused variable ‘ret’ [-Wunused-variable]
  uint32_t ret;
           ^~~
At top level:
/root/RHEL86-64_K4.18.0_GCC8.5.0/x86_64-native-linuxapp-gcc+debug/20220606095551/dpdk/kernel/linux/kni/kni_net.c:297:1: warning: ‘kni_net_tx’ defined but not used [-Wunused-function]
 kni_net_tx(struct sk_buff *skb, struct net_device *dev)
 ^~~~~~~~~~
/root/RHEL86-64_K4.18.0_GCC8.5.0/x86_64-native-linuxapp-gcc+debug/20220606095551/dpdk/kernel/linux/kni/kni_net.c:284:1: warning: ‘kni_net_config’ defined but not used [-Wunused-function]
 kni_net_config(struct net_device *dev, struct ifmap *map)
 ^~~~~~~~~~~~~~
/root/RHEL86-64_K4.18.0_GCC8.5.0/x86_64-native-linuxapp-gcc+debug/20220606095551/dpdk/kernel/linux/kni/kni_net.c:202:1: warning: ‘kni_net_release’ defined but not used [-Wunused-function]
 kni_net_release(struct net_device *dev)
 ^~~~~~~~~~~~~~~
/root/RHEL86-64_K4.18.0_GCC8.5.0/x86_64-native-linuxapp-gcc+debug/20220606095551/dpdk/kernel/linux/kni/kni_net.c:180:1: warning: ‘kni_net_open’ defined but not used [-Wunused-function]
 kni_net_open(struct net_device *dev)
 ^~~~~~~~~~~~
/root/RHEL86-64_K4.18.0_GCC8.5.0/x86_64-native-linuxapp-gcc+debug/20220606095551/dpdk/kernel/linux/kni/kni_net.c:38:21: warning: ‘kni_net_rx_func’ defined but not used [-Wunused-variable]
 static kni_net_rx_t kni_net_rx_func = kni_net_rx_normal;
                     ^~~~~~~~~~~~~~~
make[1]: *** [scripts/Makefile.build:316: /root/RHEL86-64_K4.18.0_GCC8.5.0/x86_64-native-linuxapp-gcc+debug/20220606095551/dpdk/x86_64-native-linuxapp-gcc+debug/kernel/linux/kni/kni_net.o] Error 1
make[1]: *** Waiting for unfinished jobs....
make: *** [Makefile:1577: _module_/root/RHEL86-64_K4.18.0_GCC8.5.0/x86_64-native-linuxapp-gcc+debug/20220606095551/dpdk/x86_64-native-linuxapp-gcc+debug/kernel/linux/kni] Error 2
make: Leaving directory '/usr/src/kernels/4.18.0-372.9.1.el8.x86_64'
[3532/3538] Linking target examples/dpdk-timer
[3533/3538] Linking target examples/dpdk-vdpa
[3534/3538] Linking target examples/dpdk-vhost
[3535/3538] Linking target examples/dpdk-vhost_crypto
[3536/3538] Linking target examples/dpdk-vhost_blk
[3537/3538] Linking target examples/dpdk-vmdq
[3538/3538] Linking target examples/dpdk-vmdq_dcb
ninja: build stopped




*Build Failed #6:
OS: SUSE15-64
Target: x86_64-native-linuxapp-clang
FAILED: kernel/linux/kni/rte_kni.ko 
/usr/bin/make -j4 -C /lib/modules/5.3.18-57-default/build M=/root/SUSE15-64_K5.3.18_Clang11.0.1/x86_64-native-linuxapp-clang/20220606095551/dpdk/x86_64-native-linuxapp-clang/kernel/linux/kni src=/root/SUSE15-64_K5.3.18_Clang11.0.1/x86_64-native-linuxapp-clang/20220606095551/dpdk/kernel/linux/kni 'MODULE_CFLAGS= -DHAVE_ARG_TX_QUEUE -include /root/SUSE15-64_K5.3.18_Clang11.0.1/x86_64-native-linuxapp-clang/20220606095551/dpdk/config/rte_config.h -I/root/SUSE15-64_K5.3.18_Clang11.0.1/x86_64-native-linuxapp-clang/20220606095551/dpdk/lib/eal/include -I/root/SUSE15-64_K5.3.18_Clang11.0.1/x86_64-native-linuxapp-clang/20220606095551/dpdk/lib/kni -I/root/SUSE15-64_K5.3.18_Clang11.0.1/x86_64-native-linuxapp-clang/20220606095551/dpdk/x86_64-native-linuxapp-clang -I/root/SUSE15-64_K5.3.18_Clang11.0.1/x86_64-native-linuxapp-clang/20220606095551/dpdk/kernel/linux/kni' modules
make: Entering directory '/usr/src/linux-5.3.18-57-obj/x86_64/default'
  CC [M]  /root/SUSE15-64_K5.3.18_Clang11.0.1/x86_64-native-linuxapp-clang/20220606095551/dpdk/x86_64-native-linuxapp-clang/kernel/linux/kni/kni_net.o
  CC [M]  /root/SUSE15-64_K5.3.18_Clang11.0.1/x86_64-native-linuxapp-clang/20220606095551/dpdk/x86_64-native-linuxapp-clang/kernel/linux/kni/kni_misc.o
/root/SUSE15-64_K5.3.18_Clang11.0.1/x86_64-native-linuxapp-clang/20220606095551/dpdk/kernel/linux/kni/kni_net.c: In function ‘kni_net_rx_normal’:
/root/SUSE15-64_K5.3.18_Clang11.0.1/x86_64-native-linuxapp-clang/20220606095551/dpdk/kernel/linux/kni/kni_net.c:448:2: error: #else after #else
 #else
  ^~~~
/root/SUSE15-64_K5.3.18_Clang11.0.1/x86_64-native-linuxapp-clang/20220606095551/dpdk/kernel/linux/kni/kni_net.c:444:0: error: the conditional began here
 #ifdef HAVE_NETIF_RX_NI
 
/root/SUSE15-64_K5.3.18_Clang11.0.1/x86_64-native-linuxapp-clang/20220606095551/dpdk/kernel/linux/kni/kni_net.c:444:0: error: unterminated #else
/root/SUSE15-64_K5.3.18_Clang11.0.1/x86_64-native-linuxapp-clang/20220606095551/dpdk/kernel/linux/kni/kni_net.c:445:3: error: expected declaration or statement at end of input
   netif_rx_ni(skb);
   ^~~~~~~~~~~
/root/SUSE15-64_K5.3.18_Clang11.0.1/x86_64-native-linuxapp-clang/20220606095551/dpdk/kernel/linux/kni/kni_net.c:445:3: error: expected declaration or statement at end of input
/root/SUSE15-64_K5.3.18_Clang11.0.1/x86_64-native-linuxapp-clang/20220606095551/dpdk/kernel/linux/kni/kni_net.c:382:11: warning: unused variable ‘ret’ [-Wunused-variable]
  uint32_t ret;
           ^~~
At top level:
/root/SUSE15-64_K5.3.18_Clang11.0.1/x86_64-native-linuxapp-clang/20220606095551/dpdk/kernel/linux/kni/kni_net.c:297:1: warning: ‘kni_net_tx’ defined but not used [-Wunused-function]
 kni_net_tx(struct sk_buff *skb, struct net_device *dev)
 ^~~~~~~~~~
/root/SUSE15-64_K5.3.18_Clang11.0.1/x86_64-native-linuxapp-clang/20220606095551/dpdk/kernel/linux/kni/kni_net.c:284:1: warning: ‘kni_net_config’ defined but not used [-Wunused-function]
 kni_net_config(struct net_device *dev, struct ifmap *map)
 ^~~~~~~~~~~~~~
/root/SUSE15-64_K5.3.18_Clang11.0.1/x86_64-native-linuxapp-clang/20220606095551/dpdk/kernel/linux/kni/kni_net.c:202:1: warning: ‘kni_net_release’ defined but not used [-Wunused-function]
 kni_net_release(struct net_device *dev)
 ^~~~~~~~~~~~~~~
/root/SUSE15-64_K5.3.18_Clang11.0.1/x86_64-native-linuxapp-clang/20220606095551/dpdk/kernel/linux/kni/kni_net.c:180:1: warning: ‘kni_net_open’ defined but not used [-Wunused-function]
 kni_net_open(struct net_device *dev)
 ^~~~~~~~~~~~
/root/SUSE15-64_K5.3.18_Clang11.0.1/x86_64-native-linuxapp-clang/20220606095551/dpdk/kernel/linux/kni/kni_net.c:38:21: warning: ‘kni_net_rx_func’ defined but not used [-Wunused-variable]
 static kni_net_rx_t kni_net_rx_func = kni_net_rx_normal;
                     ^~~~~~~~~~~~~~~
make[2]: *** [/usr/src/linux-5.3.18-57/scripts/Makefile.build:288: /root/SUSE15-64_K5.3.18_Clang11.0.1/x86_64-native-linuxapp-clang/20220606095551/dpdk/x86_64-native-linuxapp-clang/kernel/linux/kni/kni_net.o] Error 1
make[2]: *** Waiting for unfinished jobs....
make[1]: *** [/usr/src/linux-5.3.18-57/Makefile:1670: _module_/root/SUSE15-64_K5.3.18_Clang11.0.1/x86_64-native-linuxapp-clang/20220606095551/dpdk/x86_64-native-linuxapp-clang/kernel/linux/kni] Error 2
make: *** [../../../linux-5.3.18-57/Makefile:179: sub-make] Error 2
make: Leaving directory '/usr/src/linux-5.3.18-57-obj/x86_64/default'
[3576/3576] Linking target examples/dpdk-vhost_crypto
ninja: build stopped




*Build Failed #7:
OS: SUSE15-64
Target: x86_64-native-linuxapp-gcc
FAILED: kernel/linux/kni/rte_kni.ko 
/usr/bin/make -j4 -C /lib/modules/5.3.18-57-default/build M=/root/SUSE15-64_K5.3.18_GCC7.5.0/x86_64-native-linuxapp-gcc/20220606095551/dpdk/x86_64-native-linuxapp-gcc/kernel/linux/kni src=/root/SUSE15-64_K5.3.18_GCC7.5.0/x86_64-native-linuxapp-gcc/20220606095551/dpdk/kernel/linux/kni 'MODULE_CFLAGS= -DHAVE_ARG_TX_QUEUE -include /root/SUSE15-64_K5.3.18_GCC7.5.0/x86_64-native-linuxapp-gcc/20220606095551/dpdk/config/rte_config.h -I/root/SUSE15-64_K5.3.18_GCC7.5.0/x86_64-native-linuxapp-gcc/20220606095551/dpdk/lib/eal/include -I/root/SUSE15-64_K5.3.18_GCC7.5.0/x86_64-native-linuxapp-gcc/20220606095551/dpdk/lib/kni -I/root/SUSE15-64_K5.3.18_GCC7.5.0/x86_64-native-linuxapp-gcc/20220606095551/dpdk/x86_64-native-linuxapp-gcc -I/root/SUSE15-64_K5.3.18_GCC7.5.0/x86_64-native-linuxapp-gcc/20220606095551/dpdk/kernel/linux/kni' modules
make: Entering directory '/usr/src/linux-5.3.18-57-obj/x86_64/default'
  CC [M]  /root/SUSE15-64_K5.3.18_GCC7.5.0/x86_64-native-linuxapp-gcc/20220606095551/dpdk/x86_64-native-linuxapp-gcc/kernel/linux/kni/kni_net.o
  CC [M]  /root/SUSE15-64_K5.3.18_GCC7.5.0/x86_64-native-linuxapp-gcc/20220606095551/dpdk/x86_64-native-linuxapp-gcc/kernel/linux/kni/kni_misc.o
/root/SUSE15-64_K5.3.18_GCC7.5.0/x86_64-native-linuxapp-gcc/20220606095551/dpdk/kernel/linux/kni/kni_net.c: In function ‘kni_net_rx_normal’:
/root/SUSE15-64_K5.3.18_GCC7.5.0/x86_64-native-linuxapp-gcc/20220606095551/dpdk/kernel/linux/kni/kni_net.c:448:2: error: #else after #else
 #else
  ^~~~
/root/SUSE15-64_K5.3.18_GCC7.5.0/x86_64-native-linuxapp-gcc/20220606095551/dpdk/kernel/linux/kni/kni_net.c:444:0: error: the conditional began here
 #ifdef HAVE_NETIF_RX_NI
 
/root/SUSE15-64_K5.3.18_GCC7.5.0/x86_64-native-linuxapp-gcc/20220606095551/dpdk/kernel/linux/kni/kni_net.c:444:0: error: unterminated #else
/root/SUSE15-64_K5.3.18_GCC7.5.0/x86_64-native-linuxapp-gcc/20220606095551/dpdk/kernel/linux/kni/kni_net.c:445:3: error: expected declaration or statement at end of input
   netif_rx_ni(skb);
   ^~~~~~~~~~~
/root/SUSE15-64_K5.3.18_GCC7.5.0/x86_64-native-linuxapp-gcc/20220606095551/dpdk/kernel/linux/kni/kni_net.c:445:3: error: expected declaration or statement at end of input
/root/SUSE15-64_K5.3.18_GCC7.5.0/x86_64-native-linuxapp-gcc/20220606095551/dpdk/kernel/linux/kni/kni_net.c:382:11: warning: unused variable ‘ret’ [-Wunused-variable]
  uint32_t ret;
           ^~~
At top level:
/root/SUSE15-64_K5.3.18_GCC7.5.0/x86_64-native-linuxapp-gcc/20220606095551/dpdk/kernel/linux/kni/kni_net.c:297:1: warning: ‘kni_net_tx’ defined but not used [-Wunused-function]
 kni_net_tx(struct sk_buff *skb, struct net_device *dev)
 ^~~~~~~~~~
/root/SUSE15-64_K5.3.18_GCC7.5.0/x86_64-native-linuxapp-gcc/20220606095551/dpdk/kernel/linux/kni/kni_net.c:284:1: warning: ‘kni_net_config’ defined but not used [-Wunused-function]
 kni_net_config(struct net_device *dev, struct ifmap *map)
 ^~~~~~~~~~~~~~
/root/SUSE15-64_K5.3.18_GCC7.5.0/x86_64-native-linuxapp-gcc/20220606095551/dpdk/kernel/linux/kni/kni_net.c:202:1: warning: ‘kni_net_release’ defined but not used [-Wunused-function]
 kni_net_release(struct net_device *dev)
 ^~~~~~~~~~~~~~~
/root/SUSE15-64_K5.3.18_GCC7.5.0/x86_64-native-linuxapp-gcc/20220606095551/dpdk/kernel/linux/kni/kni_net.c:180:1: warning: ‘kni_net_open’ defined but not used [-Wunused-function]
 kni_net_open(struct net_device *dev)
 ^~~~~~~~~~~~
/root/SUSE15-64_K5.3.18_GCC7.5.0/x86_64-native-linuxapp-gcc/20220606095551/dpdk/kernel/linux/kni/kni_net.c:38:21: warning: ‘kni_net_rx_func’ defined but not used [-Wunused-variable]
 static kni_net_rx_t kni_net_rx_func = kni_net_rx_normal;
                     ^~~~~~~~~~~~~~~
make[2]: *** [/usr/src/linux-5.3.18-57/scripts/Makefile.build:288: /root/SUSE15-64_K5.3.18_GCC7.5.0/x86_64-native-linuxapp-gcc/20220606095551/dpdk/x86_64-native-linuxapp-gcc/kernel/linux/kni/kni_net.o] Error 1
make[2]: *** Waiting for unfinished jobs....
make[1]: *** [/usr/src/linux-5.3.18-57/Makefile:1670: _module_/root/SUSE15-64_K5.3.18_GCC7.5.0/x86_64-native-linuxapp-gcc/20220606095551/dpdk/x86_64-native-linuxapp-gcc/kernel/linux/kni] Error 2
make: *** [../../../linux-5.3.18-57/Makefile:179: sub-make] Error 2
make: Leaving directory '/usr/src/linux-5.3.18-57-obj/x86_64/default'
ninja: build stopped




*Build Failed #8:
OS: UB2004-32
Target: i686-native-linuxapp-gcc
FAILED: kernel/linux/kni/rte_kni.ko 
/usr/bin/make -j4 -C /lib/modules/5.8.0-48-generic/build M=/root/UB2004-32_K5.8.0_GCC10.2.0/i686-native-linuxapp-gcc/20220606095551/dpdk/i686-native-linuxapp-gcc/kernel/linux/kni src=/root/UB2004-32_K5.8.0_GCC10.2.0/i686-native-linuxapp-gcc/20220606095551/dpdk/kernel/linux/kni 'MODULE_CFLAGS=  -include /root/UB2004-32_K5.8.0_GCC10.2.0/i686-native-linuxapp-gcc/20220606095551/dpdk/config/rte_config.h -I/root/UB2004-32_K5.8.0_GCC10.2.0/i686-native-linuxapp-gcc/20220606095551/dpdk/lib/eal/include -I/root/UB2004-32_K5.8.0_GCC10.2.0/i686-native-linuxapp-gcc/20220606095551/dpdk/lib/kni -I/root/UB2004-32_K5.8.0_GCC10.2.0/i686-native-linuxapp-gcc/20220606095551/dpdk/i686-native-linuxapp-gcc -I/root/UB2004-32_K5.8.0_GCC10.2.0/i686-native-linuxapp-gcc/20220606095551/dpdk/kernel/linux/kni' modules
make: Entering directory '/usr/src/linux-headers-5.8.0-48-generic'
  CC [M]  /root/UB2004-32_K5.8.0_GCC10.2.0/i686-native-linuxapp-gcc/20220606095551/dpdk/i686-native-linuxapp-gcc/kernel/linux/kni/kni_net.o
  CC [M]  /root/UB2004-32_K5.8.0_GCC10.2.0/i686-native-linuxapp-gcc/20220606095551/dpdk/i686-native-linuxapp-gcc/kernel/linux/kni/kni_misc.o
/root/UB2004-32_K5.8.0_GCC10.2.0/i686-native-linuxapp-gcc/20220606095551/dpdk/kernel/linux/kni/kni_net.c: In function ‘kni_net_rx_normal’:
/root/UB2004-32_K5.8.0_GCC10.2.0/i686-native-linuxapp-gcc/20220606095551/dpdk/kernel/linux/kni/kni_net.c:448:2: error: #else after #else
  448 | #else
      |  ^~~~
/root/UB2004-32_K5.8.0_GCC10.2.0/i686-native-linuxapp-gcc/20220606095551/dpdk/kernel/linux/kni/kni_net.c:444: error: the conditional began here
  444 | #ifdef HAVE_NETIF_RX_NI
      | 
/root/UB2004-32_K5.8.0_GCC10.2.0/i686-native-linuxapp-gcc/20220606095551/dpdk/kernel/linux/kni/kni_net.c:444: error: unterminated #else
/root/UB2004-32_K5.8.0_GCC10.2.0/i686-native-linuxapp-gcc/20220606095551/dpdk/kernel/linux/kni/kni_net.c:445:3: error: expected declaration or statement at end of input
  445 |   netif_rx_ni(skb);
      |   ^~~~~~~~~~~
/root/UB2004-32_K5.8.0_GCC10.2.0/i686-native-linuxapp-gcc/20220606095551/dpdk/kernel/linux/kni/kni_net.c:445:3: error: expected declaration or statement at end of input
/root/UB2004-32_K5.8.0_GCC10.2.0/i686-native-linuxapp-gcc/20220606095551/dpdk/kernel/linux/kni/kni_net.c:382:11: warning: unused variable ‘ret’ [-Wunused-variable]
  382 |  uint32_t ret;
      |           ^~~
At top level:
/root/UB2004-32_K5.8.0_GCC10.2.0/i686-native-linuxapp-gcc/20220606095551/dpdk/kernel/linux/kni/kni_net.c:297:1: warning: ‘kni_net_tx’ defined but not used [-Wunused-function]
  297 | kni_net_tx(struct sk_buff *skb, struct net_device *dev)
      | ^~~~~~~~~~
/root/UB2004-32_K5.8.0_GCC10.2.0/i686-native-linuxapp-gcc/20220606095551/dpdk/kernel/linux/kni/kni_net.c:284:1: warning: ‘kni_net_config’ defined but not used [-Wunused-function]
  284 | kni_net_config(struct net_device *dev, struct ifmap *map)
      | ^~~~~~~~~~~~~~
/root/UB2004-32_K5.8.0_GCC10.2.0/i686-native-linuxapp-gcc/20220606095551/dpdk/kernel/linux/kni/kni_net.c:202:1: warning: ‘kni_net_release’ defined but not used [-Wunused-function]
  202 | kni_net_release(struct net_device *dev)
      | ^~~~~~~~~~~~~~~
/root/UB2004-32_K5.8.0_GCC10.2.0/i686-native-linuxapp-gcc/20220606095551/dpdk/kernel/linux/kni/kni_net.c:180:1: warning: ‘kni_net_open’ defined but not used [-Wunused-function]
  180 | kni_net_open(struct net_device *dev)
      | ^~~~~~~~~~~~
/root/UB2004-32_K5.8.0_GCC10.2.0/i686-native-linuxapp-gcc/20220606095551/dpdk/kernel/linux/kni/kni_net.c:38:21: warning: ‘kni_net_rx_func’ defined but not used [-Wunused-variable]
   38 | static kni_net_rx_t kni_net_rx_func = kni_net_rx_normal;
      |                     ^~~~~~~~~~~~~~~
make[1]: *** [scripts/Makefile.build:286: /root/UB2004-32_K5.8.0_GCC10.2.0/i686-native-linuxapp-gcc/20220606095551/dpdk/i686-native-linuxapp-gcc/kernel/linux/kni/kni_net.o] Error 1
make[1]: *** Waiting for unfinished jobs....
make: *** [Makefile:1783: /root/UB2004-32_K5.8.0_GCC10.2.0/i686-native-linuxapp-gcc/20220606095551/dpdk/i686-native-linuxapp-gcc/kernel/linux/kni] Error 2
make: Leaving directory '/usr/src/linux-headers-5.8.0-48-generic'
[2141/2440] Compiling C object app/test/dpdk-test.p/test_dmadev_api.c.o
[2142/2440] Compiling C object app/test/dpdk-test.p/test_cryptodev_security_pdcp.c.o
[2143/2440] Compiling C object app/test/dpdk-test.p/test_efd.c.o
[2144/2440] Compiling C object app/test/dpdk-test.p/test_distributor.c.o
[2145/2440] Compiling C object app/test/dpdk-test.p/test_dmadev.c.o
[2146/2440] Compiling C object app/test/dpdk-test.p/test_efd_perf.c.o
[2147/2440] Compiling C object app/test/dpdk-test.p/test_cryptodev_blockcipher.c.o
[2148/2440] Compiling C object app/test/dpdk-test.p/test_eal_flags.c.o
[2149/2440] Compiling C object app/test/dpdk-test.p/test_cryptodev.c.o
ninja: build stopped




*Build Failed #9:
OS: UB2004-64
Target: x86_64-native-linuxapp-clang
FAILED: kernel/linux/kni/rte_kni.ko 
/usr/bin/make -j4 -C /lib/modules/5.8.0-48-generic/build M=/root/UB2004-64_K5.8.0_Clang10.0.0/x86_64-native-linuxapp-clang/20220606095551/dpdk/x86_64-native-linuxapp-clang/kernel/linux/kni src=/root/UB2004-64_K5.8.0_Clang10.0.0/x86_64-native-linuxapp-clang/20220606095551/dpdk/kernel/linux/kni 'MODULE_CFLAGS=  -include /root/UB2004-64_K5.8.0_Clang10.0.0/x86_64-native-linuxapp-clang/20220606095551/dpdk/config/rte_config.h -I/root/UB2004-64_K5.8.0_Clang10.0.0/x86_64-native-linuxapp-clang/20220606095551/dpdk/lib/eal/include -I/root/UB2004-64_K5.8.0_Clang10.0.0/x86_64-native-linuxapp-clang/20220606095551/dpdk/lib/kni -I/root/UB2004-64_K5.8.0_Clang10.0.0/x86_64-native-linuxapp-clang/20220606095551/dpdk/x86_64-native-linuxapp-clang -I/root/UB2004-64_K5.8.0_Clang10.0.0/x86_64-native-linuxapp-clang/20220606095551/dpdk/kernel/linux/kni' modules
make: Entering directory '/usr/src/linux-headers-5.8.0-48-generic'
  CC [M]  /root/UB2004-64_K5.8.0_Clang10.0.0/x86_64-native-linuxapp-clang/20220606095551/dpdk/x86_64-native-linuxapp-clang/kernel/linux/kni/kni_net.o
  CC [M]  /root/UB2004-64_K5.8.0_Clang10.0.0/x86_64-native-linuxapp-clang/20220606095551/dpdk/x86_64-native-linuxapp-clang/kernel/linux/kni/kni_misc.o
/root/UB2004-64_K5.8.0_Clang10.0.0/x86_64-native-linuxapp-clang/20220606095551/dpdk/kernel/linux/kni/kni_net.c: In function ‘kni_net_rx_normal’:
/root/UB2004-64_K5.8.0_Clang10.0.0/x86_64-native-linuxapp-clang/20220606095551/dpdk/kernel/linux/kni/kni_net.c:448:2: error: #else after #else
  448 | #else
      |  ^~~~
/root/UB2004-64_K5.8.0_Clang10.0.0/x86_64-native-linuxapp-clang/20220606095551/dpdk/kernel/linux/kni/kni_net.c:444: error: the conditional began here
  444 | #ifdef HAVE_NETIF_RX_NI
      | 
/root/UB2004-64_K5.8.0_Clang10.0.0/x86_64-native-linuxapp-clang/20220606095551/dpdk/kernel/linux/kni/kni_net.c:444: error: unterminated #else
/root/UB2004-64_K5.8.0_Clang10.0.0/x86_64-native-linuxapp-clang/20220606095551/dpdk/kernel/linux/kni/kni_net.c:445:3: error: expected declaration or statement at end of input
  445 |   netif_rx_ni(skb);
      |   ^~~~~~~~~~~
/root/UB2004-64_K5.8.0_Clang10.0.0/x86_64-native-linuxapp-clang/20220606095551/dpdk/kernel/linux/kni/kni_net.c:445:3: error: expected declaration or statement at end of input
/root/UB2004-64_K5.8.0_Clang10.0.0/x86_64-native-linuxapp-clang/20220606095551/dpdk/kernel/linux/kni/kni_net.c:382:11: warning: unused variable ‘ret’ [-Wunused-variable]
  382 |  uint32_t ret;
      |           ^~~
At top level:
/root/UB2004-64_K5.8.0_Clang10.0.0/x86_64-native-linuxapp-clang/20220606095551/dpdk/kernel/linux/kni/kni_net.c:297:1: warning: ‘kni_net_tx’ defined but not used [-Wunused-function]
  297 | kni_net_tx(struct sk_buff *skb, struct net_device *dev)
      | ^~~~~~~~~~
/root/UB2004-64_K5.8.0_Clang10.0.0/x86_64-native-linuxapp-clang/20220606095551/dpdk/kernel/linux/kni/kni_net.c:284:1: warning: ‘kni_net_config’ defined but not used [-Wunused-function]
  284 | kni_net_config(struct net_device *dev, struct ifmap *map)
      | ^~~~~~~~~~~~~~
/root/UB2004-64_K5.8.0_Clang10.0.0/x86_64-native-linuxapp-clang/20220606095551/dpdk/kernel/linux/kni/kni_net.c:202:1: warning: ‘kni_net_release’ defined but not used [-Wunused-function]
  202 | kni_net_release(struct net_device *dev)
      | ^~~~~~~~~~~~~~~
/root/UB2004-64_K5.8.0_Clang10.0.0/x86_64-native-linuxapp-clang/20220606095551/dpdk/kernel/linux/kni/kni_net.c:180:1: warning: ‘kni_net_open’ defined but not used [-Wunused-function]
  180 | kni_net_open(struct net_device *dev)
      | ^~~~~~~~~~~~
/root/UB2004-64_K5.8.0_Clang10.0.0/x86_64-native-linuxapp-clang/20220606095551/dpdk/kernel/linux/kni/kni_net.c:38:21: warning: ‘kni_net_rx_func’ defined but not used [-Wunused-variable]
   38 | static kni_net_rx_t kni_net_rx_func = kni_net_rx_normal;
      |                     ^~~~~~~~~~~~~~~
make[1]: *** [scripts/Makefile.build:286: /root/UB2004-64_K5.8.0_Clang10.0.0/x86_64-native-linuxapp-clang/20220606095551/dpdk/x86_64-native-linuxapp-clang/kernel/linux/kni/kni_net.o] Error 1
make[1]: *** Waiting for unfinished jobs....
make: *** [Makefile:1783: /root/UB2004-64_K5.8.0_Clang10.0.0/x86_64-native-linuxapp-clang/20220606095551/dpdk/x86_64-native-linuxapp-clang/kernel/linux/kni] Error 2
make: Leaving directory '/usr/src/linux-headers-5.8.0-48-generic'
ninja: build stopped




*Build Failed #10:
OS: UB2004-64
Target: x86_64-native-linuxapp-gcc
FAILED: kernel/linux/kni/rte_kni.ko 
/usr/bin/make -j4 -C /lib/modules/5.8.0-48-generic/build M=/root/UB2004-64_K5.8.0_GCC10.3.0/x86_64-native-linuxapp-gcc/20220606095551/dpdk/x86_64-native-linuxapp-gcc/kernel/linux/kni src=/root/UB2004-64_K5.8.0_GCC10.3.0/x86_64-native-linuxapp-gcc/20220606095551/dpdk/kernel/linux/kni 'MODULE_CFLAGS=  -include /root/UB2004-64_K5.8.0_GCC10.3.0/x86_64-native-linuxapp-gcc/20220606095551/dpdk/config/rte_config.h -I/root/UB2004-64_K5.8.0_GCC10.3.0/x86_64-native-linuxapp-gcc/20220606095551/dpdk/lib/eal/include -I/root/UB2004-64_K5.8.0_GCC10.3.0/x86_64-native-linuxapp-gcc/20220606095551/dpdk/lib/kni -I/root/UB2004-64_K5.8.0_GCC10.3.0/x86_64-native-linuxapp-gcc/20220606095551/dpdk/x86_64-native-linuxapp-gcc -I/root/UB2004-64_K5.8.0_GCC10.3.0/x86_64-native-linuxapp-gcc/20220606095551/dpdk/kernel/linux/kni' modules
make: Entering directory '/usr/src/linux-headers-5.8.0-48-generic'
  CC [M]  /root/UB2004-64_K5.8.0_GCC10.3.0/x86_64-native-linuxapp-gcc/20220606095551/dpdk/x86_64-native-linuxapp-gcc/kernel/linux/kni/kni_net.o
  CC [M]  /root/UB2004-64_K5.8.0_GCC10.3.0/x86_64-native-linuxapp-gcc/20220606095551/dpdk/x86_64-native-linuxapp-gcc/kernel/linux/kni/kni_misc.o
/root/UB2004-64_K5.8.0_GCC10.3.0/x86_64-native-linuxapp-gcc/20220606095551/dpdk/kernel/linux/kni/kni_net.c: In function ‘kni_net_rx_normal’:
/root/UB2004-64_K5.8.0_GCC10.3.0/x86_64-native-linuxapp-gcc/20220606095551/dpdk/kernel/linux/kni/kni_net.c:448:2: error: #else after #else
  448 | #else
      |  ^~~~
/root/UB2004-64_K5.8.0_GCC10.3.0/x86_64-native-linuxapp-gcc/20220606095551/dpdk/kernel/linux/kni/kni_net.c:444: error: the conditional began here
  444 | #ifdef HAVE_NETIF_RX_NI
      | 
/root/UB2004-64_K5.8.0_GCC10.3.0/x86_64-native-linuxapp-gcc/20220606095551/dpdk/kernel/linux/kni/kni_net.c:444: error: unterminated #else
/root/UB2004-64_K5.8.0_GCC10.3.0/x86_64-native-linuxapp-gcc/20220606095551/dpdk/kernel/linux/kni/kni_net.c:445:3: error: expected declaration or statement at end of input
  445 |   netif_rx_ni(skb);
      |   ^~~~~~~~~~~
/root/UB2004-64_K5.8.0_GCC10.3.0/x86_64-native-linuxapp-gcc/20220606095551/dpdk/kernel/linux/kni/kni_net.c:445:3: error: expected declaration or statement at end of input
/root/UB2004-64_K5.8.0_GCC10.3.0/x86_64-native-linuxapp-gcc/20220606095551/dpdk/kernel/linux/kni/kni_net.c:382:11: warning: unused variable ‘ret’ [-Wunused-variable]
  382 |  uint32_t ret;
      |           ^~~
At top level:
/root/UB2004-64_K5.8.0_GCC10.3.0/x86_64-native-linuxapp-gcc/20220606095551/dpdk/kernel/linux/kni/kni_net.c:297:1: warning: ‘kni_net_tx’ defined but not used [-Wunused-function]
  297 | kni_net_tx(struct sk_buff *skb, struct net_device *dev)
      | ^~~~~~~~~~
/root/UB2004-64_K5.8.0_GCC10.3.0/x86_64-native-linuxapp-gcc/20220606095551/dpdk/kernel/linux/kni/kni_net.c:284:1: warning: ‘kni_net_config’ defined but not used [-Wunused-function]
  284 | kni_net_config(struct net_device *dev, struct ifmap *map)
      | ^~~~~~~~~~~~~~
/root/UB2004-64_K5.8.0_GCC10.3.0/x86_64-native-linuxapp-gcc/20220606095551/dpdk/kernel/linux/kni/kni_net.c:202:1: warning: ‘kni_net_release’ defined but not used [-Wunused-function]
  202 | kni_net_release(struct net_device *dev)
      | ^~~~~~~~~~~~~~~
/root/UB2004-64_K5.8.0_GCC10.3.0/x86_64-native-linuxapp-gcc/20220606095551/dpdk/kernel/linux/kni/kni_net.c:180:1: warning: ‘kni_net_open’ defined but not used [-Wunused-function]
  180 | kni_net_open(struct net_device *dev)
      | ^~~~~~~~~~~~
/root/UB2004-64_K5.8.0_GCC10.3.0/x86_64-native-linuxapp-gcc/20220606095551/dpdk/kernel/linux/kni/kni_net.c:38:21: warning: ‘kni_net_rx_func’ defined but not used [-Wunused-variable]
   38 | static kni_net_rx_t kni_net_rx_func = kni_net_rx_normal;
      |                     ^~~~~~~~~~~~~~~
make[1]: *** [scripts/Makefile.build:286: /root/UB2004-64_K5.8.0_GCC10.3.0/x86_64-native-linuxapp-gcc/20220606095551/dpdk/x86_64-native-linuxapp-gcc/kernel/linux/kni/kni_net.o] Error 1
make[1]: *** Waiting for unfinished jobs....
make: *** [Makefile:1783: /root/UB2004-64_K5.8.0_GCC10.3.0/x86_64-native-linuxapp-gcc/20220606095551/dpdk/x86_64-native-linuxapp-gcc/kernel/linux/kni] Error 2
make: Leaving directory '/usr/src/linux-headers-5.8.0-48-generic'
ninja: build stopped




*Build Failed #11:
OS: UB2204-32
Target: i686-native-linuxapp-gcc
FAILED: kernel/linux/kni/rte_kni.ko 
/usr/bin/make -j4 -C /lib/modules/5.15.0-25-generic/build M=/root/UB2204-32_K5.15.0_GCC10.2.0/i686-native-linuxapp-gcc/20220606095551/dpdk/i686-native-linuxapp-gcc/kernel/linux/kni src=/root/UB2204-32_K5.15.0_GCC10.2.0/i686-native-linuxapp-gcc/20220606095551/dpdk/kernel/linux/kni 'MODULE_CFLAGS=  -include /root/UB2204-32_K5.15.0_GCC10.2.0/i686-native-linuxapp-gcc/20220606095551/dpdk/config/rte_config.h -I/root/UB2204-32_K5.15.0_GCC10.2.0/i686-native-linuxapp-gcc/20220606095551/dpdk/lib/eal/include -I/root/UB2204-32_K5.15.0_GCC10.2.0/i686-native-linuxapp-gcc/20220606095551/dpdk/lib/kni -I/root/UB2204-32_K5.15.0_GCC10.2.0/i686-native-linuxapp-gcc/20220606095551/dpdk/i686-native-linuxapp-gcc -I/root/UB2204-32_K5.15.0_GCC10.2.0/i686-native-linuxapp-gcc/20220606095551/dpdk/kernel/linux/kni' modules
make: Entering directory '/usr/src/linux-headers-5.15.0-25-generic'
  CC [M]  /root/UB2204-32_K5.15.0_GCC10.2.0/i686-native-linuxapp-gcc/20220606095551/dpdk/i686-native-linuxapp-gcc/kernel/linux/kni/kni_misc.o
  CC [M]  /root/UB2204-32_K5.15.0_GCC10.2.0/i686-native-linuxapp-gcc/20220606095551/dpdk/i686-native-linuxapp-gcc/kernel/linux/kni/kni_net.o
/root/UB2204-32_K5.15.0_GCC10.2.0/i686-native-linuxapp-gcc/20220606095551/dpdk/kernel/linux/kni/kni_net.c: In function ‘kni_net_rx_normal’:
/root/UB2204-32_K5.15.0_GCC10.2.0/i686-native-linuxapp-gcc/20220606095551/dpdk/kernel/linux/kni/kni_net.c:448:2: error: #else after #else
  448 | #else
      |  ^~~~
/root/UB2204-32_K5.15.0_GCC10.2.0/i686-native-linuxapp-gcc/20220606095551/dpdk/kernel/linux/kni/kni_net.c:444: error: the conditional began here
  444 | #ifdef HAVE_NETIF_RX_NI
      | 
/root/UB2204-32_K5.15.0_GCC10.2.0/i686-native-linuxapp-gcc/20220606095551/dpdk/kernel/linux/kni/kni_net.c:444: error: unterminated #else
/root/UB2204-32_K5.15.0_GCC10.2.0/i686-native-linuxapp-gcc/20220606095551/dpdk/kernel/linux/kni/kni_net.c:445:17: error: expected declaration or statement at end of input
  445 |                 netif_rx_ni(skb);
      |                 ^~~~~~~~~~~
/root/UB2204-32_K5.15.0_GCC10.2.0/i686-native-linuxapp-gcc/20220606095551/dpdk/kernel/linux/kni/kni_net.c:445:17: error: expected declaration or statement at end of input
/root/UB2204-32_K5.15.0_GCC10.2.0/i686-native-linuxapp-gcc/20220606095551/dpdk/kernel/linux/kni/kni_net.c:382:18: warning: unused variable ‘ret’ [-Wunused-variable]
  382 |         uint32_t ret;
      |                  ^~~
At top level:
/root/UB2204-32_K5.15.0_GCC10.2.0/i686-native-linuxapp-gcc/20220606095551/dpdk/kernel/linux/kni/kni_net.c:297:1: warning: ‘kni_net_tx’ defined but not used [-Wunused-function]
  297 | kni_net_tx(struct sk_buff *skb, struct net_device *dev)
      | ^~~~~~~~~~
/root/UB2204-32_K5.15.0_GCC10.2.0/i686-native-linuxapp-gcc/20220606095551/dpdk/kernel/linux/kni/kni_net.c:284:1: warning: ‘kni_net_config’ defined but not used [-Wunused-function]
  284 | kni_net_config(struct net_device *dev, struct ifmap *map)
      | ^~~~~~~~~~~~~~
/root/UB2204-32_K5.15.0_GCC10.2.0/i686-native-linuxapp-gcc/20220606095551/dpdk/kernel/linux/kni/kni_net.c:202:1: warning: ‘kni_net_release’ defined but not used [-Wunused-function]
  202 | kni_net_release(struct net_device *dev)
      | ^~~~~~~~~~~~~~~
/root/UB2204-32_K5.15.0_GCC10.2.0/i686-native-linuxapp-gcc/20220606095551/dpdk/kernel/linux/kni/kni_net.c:180:1: warning: ‘kni_net_open’ defined but not used [-Wunused-function]
  180 | kni_net_open(struct net_device *dev)
      | ^~~~~~~~~~~~
/root/UB2204-32_K5.15.0_GCC10.2.0/i686-native-linuxapp-gcc/20220606095551/dpdk/kernel/linux/kni/kni_net.c:38:21: warning: ‘kni_net_rx_func’ defined but not used [-Wunused-variable]
   38 | static kni_net_rx_t kni_net_rx_func = kni_net_rx_normal;
      |                     ^~~~~~~~~~~~~~~
make[1]: *** [scripts/Makefile.build:285: /root/UB2204-32_K5.15.0_GCC10.2.0/i686-native-linuxapp-gcc/20220606095551/dpdk/i686-native-linuxapp-gcc/kernel/linux/kni/kni_net.o] Error 1
make[1]: *** Waiting for unfinished jobs....
make: *** [Makefile:1875: /root/UB2204-32_K5.15.0_GCC10.2.0/i686-native-linuxapp-gcc/20220606095551/dpdk/i686-native-linuxapp-gcc/kernel/linux/kni] Error 2
make: Leaving directory '/usr/src/linux-headers-5.15.0-25-generic'
[2388/2391] Linking target examples/dpdk-vmdq_dcb
[2389/2391] Linking target examples/dpdk-vmdq
[2390/2391] Linking target examples/dpdk-vhost_crypto
[2391/2391] Linking target examples/dpdk-vhost
ninja: build stopped




*Build Failed #12:
OS: UB2004-64
Target: x86_64-native-linuxapp-doc
FAILED: kernel/linux/kni/rte_kni.ko 
/usr/bin/make -j4 -C /lib/modules/5.8.0-48-generic/build M=/root/UB2004-64_K5.8.0_GCC10.3.0/x86_64-native-linuxapp-doc/20220606095551/dpdk/x86_64-native-linuxapp-doc/kernel/linux/kni src=/root/UB2004-64_K5.8.0_GCC10.3.0/x86_64-native-linuxapp-doc/20220606095551/dpdk/kernel/linux/kni 'MODULE_CFLAGS=  -include /root/UB2004-64_K5.8.0_GCC10.3.0/x86_64-native-linuxapp-doc/20220606095551/dpdk/config/rte_config.h -I/root/UB2004-64_K5.8.0_GCC10.3.0/x86_64-native-linuxapp-doc/20220606095551/dpdk/lib/eal/include -I/root/UB2004-64_K5.8.0_GCC10.3.0/x86_64-native-linuxapp-doc/20220606095551/dpdk/lib/kni -I/root/UB2004-64_K5.8.0_GCC10.3.0/x86_64-native-linuxapp-doc/20220606095551/dpdk/x86_64-native-linuxapp-doc -I/root/UB2004-64_K5.8.0_GCC10.3.0/x86_64-native-linuxapp-doc/20220606095551/dpdk/kernel/linux/kni' modules
make: Entering directory '/usr/src/linux-headers-5.8.0-48-generic'
  CC [M]  /root/UB2004-64_K5.8.0_GCC10.3.0/x86_64-native-linuxapp-doc/20220606095551/dpdk/x86_64-native-linuxapp-doc/kernel/linux/kni/kni_net.o
  CC [M]  /root/UB2004-64_K5.8.0_GCC10.3.0/x86_64-native-linuxapp-doc/20220606095551/dpdk/x86_64-native-linuxapp-doc/kernel/linux/kni/kni_misc.o
/root/UB2004-64_K5.8.0_GCC10.3.0/x86_64-native-linuxapp-doc/20220606095551/dpdk/kernel/linux/kni/kni_net.c: In function ‘kni_net_rx_normal’:
/root/UB2004-64_K5.8.0_GCC10.3.0/x86_64-native-linuxapp-doc/20220606095551/dpdk/kernel/linux/kni/kni_net.c:448:2: error: #else after #else
  448 | #else
      |  ^~~~
/root/UB2004-64_K5.8.0_GCC10.3.0/x86_64-native-linuxapp-doc/20220606095551/dpdk/kernel/linux/kni/kni_net.c:444: error: the conditional began here
  444 | #ifdef HAVE_NETIF_RX_NI
      | 
/root/UB2004-64_K5.8.0_GCC10.3.0/x86_64-native-linuxapp-doc/20220606095551/dpdk/kernel/linux/kni/kni_net.c:444: error: unterminated #else
/root/UB2004-64_K5.8.0_GCC10.3.0/x86_64-native-linuxapp-doc/20220606095551/dpdk/kernel/linux/kni/kni_net.c:445:3: error: expected declaration or statement at end of input
  445 |   netif_rx_ni(skb);
      |   ^~~~~~~~~~~
/root/UB2004-64_K5.8.0_GCC10.3.0/x86_64-native-linuxapp-doc/20220606095551/dpdk/kernel/linux/kni/kni_net.c:445:3: error: expected declaration or statement at end of input
/root/UB2004-64_K5.8.0_GCC10.3.0/x86_64-native-linuxapp-doc/20220606095551/dpdk/kernel/linux/kni/kni_net.c:382:11: warning: unused variable ‘ret’ [-Wunused-variable]
  382 |  uint32_t ret;
      |           ^~~
At top level:
/root/UB2004-64_K5.8.0_GCC10.3.0/x86_64-native-linuxapp-doc/20220606095551/dpdk/kernel/linux/kni/kni_net.c:297:1: warning: ‘kni_net_tx’ defined but not used [-Wunused-function]
  297 | kni_net_tx(struct sk_buff *skb, struct net_device *dev)
      | ^~~~~~~~~~
/root/UB2004-64_K5.8.0_GCC10.3.0/x86_64-native-linuxapp-doc/20220606095551/dpdk/kernel/linux/kni/kni_net.c:284:1: warning: ‘kni_net_config’ defined but not used [-Wunused-function]
  284 | kni_net_config(struct net_device *dev, struct ifmap *map)
      | ^~~~~~~~~~~~~~
/root/UB2004-64_K5.8.0_GCC10.3.0/x86_64-native-linuxapp-doc/20220606095551/dpdk/kernel/linux/kni/kni_net.c:202:1: warning: ‘kni_net_release’ defined but not used [-Wunused-function]
  202 | kni_net_release(struct net_device *dev)
      | ^~~~~~~~~~~~~~~
/root/UB2004-64_K5.8.0_GCC10.3.0/x86_64-native-linuxapp-doc/20220606095551/dpdk/kernel/linux/kni/kni_net.c:180:1: warning: ‘kni_net_open’ defined but not used [-Wunused-function]
  180 | kni_net_open(struct net_device *dev)
      | ^~~~~~~~~~~~
/root/UB2004-64_K5.8.0_GCC10.3.0/x86_64-native-linuxapp-doc/20220606095551/dpdk/kernel/linux/kni/kni_net.c:38:21: warning: ‘kni_net_rx_func’ defined but not used [-Wunused-variable]
   38 | static kni_net_rx_t kni_net_rx_func = kni_net_rx_normal;
      |                     ^~~~~~~~~~~~~~~
make[1]: *** [scripts/Makefile.build:286: /root/UB2004-64_K5.8.0_GCC10.3.0/x86_64-native-linuxapp-doc/20220606095551/dpdk/x86_64-native-linuxapp-doc/kernel/linux/kni/kni_net.o] Error 1
make[1]: *** Waiting for unfinished jobs....
make: *** [Makefile:1783: /root/UB2004-64_K5.8.0_GCC10.3.0/x86_64-native-linuxapp-doc/20220606095551/dpdk/x86_64-native-linuxapp-doc/kernel/linux/kni] Error 2
make: Leaving directory '/usr/src/linux-headers-5.8.0-48-generic'
[3389/3391] Linking target app/test/dpdk-test
[3390/3391] Generating doxygen with a custom command
[3391/3391] Generating html_guides with a custom command
ninja: build stopped




*Build Failed #13:
OS: UB2204-64N
Target: x86_64-native-linuxapp-gcc
FAILED: kernel/linux/kni/rte_kni.ko 
/usr/bin/make -j4 -C /lib/modules/5.17.5-051705-generic/build M=/root/UB2204-64N_K5.17.5_GCC11.2.0/x86_64-native-linuxapp-gcc/20220606095551/dpdk/x86_64-native-linuxapp-gcc/kernel/linux/kni src=/root/UB2204-64N_K5.17.5_GCC11.2.0/x86_64-native-linuxapp-gcc/20220606095551/dpdk/kernel/linux/kni 'MODULE_CFLAGS=  -include /root/UB2204-64N_K5.17.5_GCC11.2.0/x86_64-native-linuxapp-gcc/20220606095551/dpdk/config/rte_config.h -I/root/UB2204-64N_K5.17.5_GCC11.2.0/x86_64-native-linuxapp-gcc/20220606095551/dpdk/lib/eal/include -I/root/UB2204-64N_K5.17.5_GCC11.2.0/x86_64-native-linuxapp-gcc/20220606095551/dpdk/lib/kni -I/root/UB2204-64N_K5.17.5_GCC11.2.0/x86_64-native-linuxapp-gcc/20220606095551/dpdk/x86_64-native-linuxapp-gcc -I/root/UB2204-64N_K5.17.5_GCC11.2.0/x86_64-native-linuxapp-gcc/20220606095551/dpdk/kernel/linux/kni' modules
make: Entering directory '/usr/src/linux-headers-5.17.5-051705-generic'
  CC [M]  /root/UB2204-64N_K5.17.5_GCC11.2.0/x86_64-native-linuxapp-gcc/20220606095551/dpdk/x86_64-native-linuxapp-gcc/kernel/linux/kni/kni_misc.o
  CC [M]  /root/UB2204-64N_K5.17.5_GCC11.2.0/x86_64-native-linuxapp-gcc/20220606095551/dpdk/x86_64-native-linuxapp-gcc/kernel/linux/kni/kni_net.o
/root/UB2204-64N_K5.17.5_GCC11.2.0/x86_64-native-linuxapp-gcc/20220606095551/dpdk/kernel/linux/kni/kni_misc.c: In function ‘kni_ioctl_create’:
/root/UB2204-64N_K5.17.5_GCC11.2.0/x86_64-native-linuxapp-gcc/20220606095551/dpdk/kernel/linux/kni/kni_misc.c:406:31: warning: passing argument 1 of ‘memcpy’ discards ‘const’ qualifier from pointer target type [-Wdiscarded-qualifiers]
  406 |                 memcpy(net_dev->dev_addr, dev_info.mac_addr, ETH_ALEN);
      |                        ~~~~~~~^~~~~~~~~~
In file included from ./include/linux/string.h:253,
                 from ./include/linux/bitmap.h:11,
                 from ./include/linux/cpumask.h:12,
                 from ./arch/x86/include/asm/cpumask.h:5,
                 from ./arch/x86/include/asm/msr.h:11,
                 from ./arch/x86/include/asm/processor.h:22,
                 from ./arch/x86/include/asm/timex.h:5,
                 from ./include/linux/timex.h:65,
                 from ./include/linux/time32.h:13,
                 from ./include/linux/time.h:60,
                 from ./include/linux/stat.h:19,
                 from ./include/linux/module.h:13,
                 from /root/UB2204-64N_K5.17.5_GCC11.2.0/x86_64-native-linuxapp-gcc/20220606095551/dpdk/kernel/linux/kni/kni_misc.c:7:
./include/linux/fortify-string.h:212:37: note: expected ‘void *’ but argument is of type ‘const unsigned char *’
  212 | __FORTIFY_INLINE void *memcpy(void *p, const void *q, __kernel_size_t size)
      |                               ~~~~~~^
/root/UB2204-64N_K5.17.5_GCC11.2.0/x86_64-native-linuxapp-gcc/20220606095551/dpdk/kernel/linux/kni/kni_misc.c:409:40: warning: passing argument 1 of ‘eth_random_addr’ discards ‘const’ qualifier from pointer target type [-Wdiscarded-qualifiers]
  409 |                 eth_random_addr(net_dev->dev_addr);
      |                                 ~~~~~~~^~~~~~~~~~
In file included from /root/UB2204-64N_K5.17.5_GCC11.2.0/x86_64-native-linuxapp-gcc/20220606095551/dpdk/kernel/linux/kni/kni_misc.c:10:
./include/linux/etherdevice.h:230:40: note: expected ‘u8 *’ {aka ‘unsigned char *’} but argument is of type ‘const unsigned char *’
  230 | static inline void eth_random_addr(u8 *addr)
      |                                    ~~~~^~~~
/root/UB2204-64N_K5.17.5_GCC11.2.0/x86_64-native-linuxapp-gcc/20220606095551/dpdk/kernel/linux/kni/kni_net.c: In function ‘kni_net_rx_normal’:
/root/UB2204-64N_K5.17.5_GCC11.2.0/x86_64-native-linuxapp-gcc/20220606095551/dpdk/kernel/linux/kni/kni_net.c:448:2: error: #else after #else
  448 | #else
      |  ^~~~
/root/UB2204-64N_K5.17.5_GCC11.2.0/x86_64-native-linuxapp-gcc/20220606095551/dpdk/kernel/linux/kni/kni_net.c:444: error: the conditional began here
  444 | #ifdef HAVE_NETIF_RX_NI
      | 
/root/UB2204-64N_K5.17.5_GCC11.2.0/x86_64-native-linuxapp-gcc/20220606095551/dpdk/kernel/linux/kni/kni_net.c:444: error: unterminated #else
/root/UB2204-64N_K5.17.5_GCC11.2.0/x86_64-native-linuxapp-gcc/20220606095551/dpdk/kernel/linux/kni/kni_net.c:445:17: error: expected declaration or statement at end of input
  445 |                 netif_rx_ni(skb);
      |                 ^~~~~~~~~~~
/root/UB2204-64N_K5.17.5_GCC11.2.0/x86_64-native-linuxapp-gcc/20220606095551/dpdk/kernel/linux/kni/kni_net.c:445:17: error: expected declaration or statement at end of input
/root/UB2204-64N_K5.17.5_GCC11.2.0/x86_64-native-linuxapp-gcc/20220606095551/dpdk/kernel/linux/kni/kni_net.c:382:18: warning: unused variable ‘ret’ [-Wunused-variable]
  382 |         uint32_t ret;
      |                  ^~~
At top level:
/root/UB2204-64N_K5.17.5_GCC11.2.0/x86_64-native-linuxapp-gcc/20220606095551/dpdk/kernel/linux/kni/kni_net.c:297:1: warning: ‘kni_net_tx’ defined but not used [-Wunused-function]
  297 | kni_net_tx(struct sk_buff *skb, struct net_device *dev)
      | ^~~~~~~~~~
/root/UB2204-64N_K5.17.5_GCC11.2.0/x86_64-native-linuxapp-gcc/20220606095551/dpdk/kernel/linux/kni/kni_net.c:284:1: warning: ‘kni_net_config’ defined but not used [-Wunused-function]
  284 | kni_net_config(struct net_device *dev, struct ifmap *map)
      | ^~~~~~~~~~~~~~
/root/UB2204-64N_K5.17.5_GCC11.2.0/x86_64-native-linuxapp-gcc/20220606095551/dpdk/kernel/linux/kni/kni_net.c:202:1: warning: ‘kni_net_release’ defined but not used [-Wunused-function]
  202 | kni_net_release(struct net_device *dev)
      | ^~~~~~~~~~~~~~~
/root/UB2204-64N_K5.17.5_GCC11.2.0/x86_64-native-linuxapp-gcc/20220606095551/dpdk/kernel/linux/kni/kni_net.c:180:1: warning: ‘kni_net_open’ defined but not used [-Wunused-function]
  180 | kni_net_open(struct net_device *dev)
      | ^~~~~~~~~~~~
/root/UB2204-64N_K5.17.5_GCC11.2.0/x86_64-native-linuxapp-gcc/20220606095551/dpdk/kernel/linux/kni/kni_net.c:38:21: warning: ‘kni_net_rx_func’ defined but not used [-Wunused-variable]
   38 | static kni_net_rx_t kni_net_rx_func = kni_net_rx_normal;
      |                     ^~~~~~~~~~~~~~~
make[1]: *** [scripts/Makefile.build:288: /root/UB2204-64N_K5.17.5_GCC11.2.0/x86_64-native-linuxapp-gcc/20220606095551/dpdk/x86_64-native-linuxapp-gcc/kernel/linux/kni/kni_net.o] Error 1
make[1]: *** Waiting for unfinished jobs....
make: *** [Makefile:1837: /root/UB2204-64N_K5.17.5_GCC11.2.0/x86_64-native-linuxapp-gcc/20220606095551/dpdk/x86_64-native-linuxapp-gcc/kernel/linux/kni] Error 2
make: Leaving directory '/usr/src/linux-headers-5.17.5-051705-generic'
ninja: build stopped




*Build Failed #14:
OS: UB2204-64N
Target: x86_64-native-linuxapp-gcc+shared
FAILED: kernel/linux/kni/rte_kni.ko 
/usr/bin/make -j4 -C /lib/modules/5.17.5-051705-generic/build M=/root/UB2204-64N_K5.17.5_GCC11.2.0/x86_64-native-linuxapp-gcc+shared/20220606095551/dpdk/x86_64-native-linuxapp-gcc+shared/kernel/linux/kni src=/root/UB2204-64N_K5.17.5_GCC11.2.0/x86_64-native-linuxapp-gcc+shared/20220606095551/dpdk/kernel/linux/kni 'MODULE_CFLAGS=  -include /root/UB2204-64N_K5.17.5_GCC11.2.0/x86_64-native-linuxapp-gcc+shared/20220606095551/dpdk/config/rte_config.h -I/root/UB2204-64N_K5.17.5_GCC11.2.0/x86_64-native-linuxapp-gcc+shared/20220606095551/dpdk/lib/eal/include -I/root/UB2204-64N_K5.17.5_GCC11.2.0/x86_64-native-linuxapp-gcc+shared/20220606095551/dpdk/lib/kni -I/root/UB2204-64N_K5.17.5_GCC11.2.0/x86_64-native-linuxapp-gcc+shared/20220606095551/dpdk/x86_64-native-linuxapp-gcc+shared -I/root/UB2204-64N_K5.17.5_GCC11.2.0/x86_64-native-linuxapp-gcc+shared/20220606095551/dpdk/kernel/linux/kni' modules
make: Entering directory '/usr/src/linux-headers-5.17.5-051705-generic'
  CC [M]  /root/UB2204-64N_K5.17.5_GCC11.2.0/x86_64-native-linuxapp-gcc+shared/20220606095551/dpdk/x86_64-native-linuxapp-gcc+shared/kernel/linux/kni/kni_misc.o
  CC [M]  /root/UB2204-64N_K5.17.5_GCC11.2.0/x86_64-native-linuxapp-gcc+shared/20220606095551/dpdk/x86_64-native-linuxapp-gcc+shared/kernel/linux/kni/kni_net.o
/root/UB2204-64N_K5.17.5_GCC11.2.0/x86_64-native-linuxapp-gcc+shared/20220606095551/dpdk/kernel/linux/kni/kni_misc.c: In function ‘kni_ioctl_create’:
/root/UB2204-64N_K5.17.5_GCC11.2.0/x86_64-native-linuxapp-gcc+shared/20220606095551/dpdk/kernel/linux/kni/kni_misc.c:406:31: warning: passing argument 1 of ‘memcpy’ discards ‘const’ qualifier from pointer target type [-Wdiscarded-qualifiers]
  406 |                 memcpy(net_dev->dev_addr, dev_info.mac_addr, ETH_ALEN);
      |                        ~~~~~~~^~~~~~~~~~
In file included from ./include/linux/string.h:253,
                 from ./include/linux/bitmap.h:11,
                 from ./include/linux/cpumask.h:12,
                 from ./arch/x86/include/asm/cpumask.h:5,
                 from ./arch/x86/include/asm/msr.h:11,
                 from ./arch/x86/include/asm/processor.h:22,
                 from ./arch/x86/include/asm/timex.h:5,
                 from ./include/linux/timex.h:65,
                 from ./include/linux/time32.h:13,
                 from ./include/linux/time.h:60,
                 from ./include/linux/stat.h:19,
                 from ./include/linux/module.h:13,
                 from /root/UB2204-64N_K5.17.5_GCC11.2.0/x86_64-native-linuxapp-gcc+shared/20220606095551/dpdk/kernel/linux/kni/kni_misc.c:7:
./include/linux/fortify-string.h:212:37: note: expected ‘void *’ but argument is of type ‘const unsigned char *’
  212 | __FORTIFY_INLINE void *memcpy(void *p, const void *q, __kernel_size_t size)
      |                               ~~~~~~^
/root/UB2204-64N_K5.17.5_GCC11.2.0/x86_64-native-linuxapp-gcc+shared/20220606095551/dpdk/kernel/linux/kni/kni_misc.c:409:40: warning: passing argument 1 of ‘eth_random_addr’ discards ‘const’ qualifier from pointer target type [-Wdiscarded-qualifiers]
  409 |                 eth_random_addr(net_dev->dev_addr);
      |                                 ~~~~~~~^~~~~~~~~~
In file included from /root/UB2204-64N_K5.17.5_GCC11.2.0/x86_64-native-linuxapp-gcc+shared/20220606095551/dpdk/kernel/linux/kni/kni_misc.c:10:
./include/linux/etherdevice.h:230:40: note: expected ‘u8 *’ {aka ‘unsigned char *’} but argument is of type ‘const unsigned char *’
  230 | static inline void eth_random_addr(u8 *addr)
      |                                    ~~~~^~~~
/root/UB2204-64N_K5.17.5_GCC11.2.0/x86_64-native-linuxapp-gcc+shared/20220606095551/dpdk/kernel/linux/kni/kni_net.c: In function ‘kni_net_rx_normal’:
/root/UB2204-64N_K5.17.5_GCC11.2.0/x86_64-native-linuxapp-gcc+shared/20220606095551/dpdk/kernel/linux/kni/kni_net.c:448:2: error: #else after #else
  448 | #else
      |  ^~~~
/root/UB2204-64N_K5.17.5_GCC11.2.0/x86_64-native-linuxapp-gcc+shared/20220606095551/dpdk/kernel/linux/kni/kni_net.c:444: error: the conditional began here
  444 | #ifdef HAVE_NETIF_RX_NI
      | 
/root/UB2204-64N_K5.17.5_GCC11.2.0/x86_64-native-linuxapp-gcc+shared/20220606095551/dpdk/kernel/linux/kni/kni_net.c:444: error: unterminated #else
/root/UB2204-64N_K5.17.5_GCC11.2.0/x86_64-native-linuxapp-gcc+shared/20220606095551/dpdk/kernel/linux/kni/kni_net.c:445:17: error: expected declaration or statement at end of input
  445 |                 netif_rx_ni(skb);
      |                 ^~~~~~~~~~~
/root/UB2204-64N_K5.17.5_GCC11.2.0/x86_64-native-linuxapp-gcc+shared/20220606095551/dpdk/kernel/linux/kni/kni_net.c:445:17: error: expected declaration or statement at end of input
/root/UB2204-64N_K5.17.5_GCC11.2.0/x86_64-native-linuxapp-gcc+shared/20220606095551/dpdk/kernel/linux/kni/kni_net.c:382:18: warning: unused variable ‘ret’ [-Wunused-variable]
  382 |         uint32_t ret;
      |                  ^~~
At top level:
/root/UB2204-64N_K5.17.5_GCC11.2.0/x86_64-native-linuxapp-gcc+shared/20220606095551/dpdk/kernel/linux/kni/kni_net.c:297:1: warning: ‘kni_net_tx’ defined but not used [-Wunused-function]
  297 | kni_net_tx(struct sk_buff *skb, struct net_device *dev)
      | ^~~~~~~~~~
/root/UB2204-64N_K5.17.5_GCC11.2.0/x86_64-native-linuxapp-gcc+shared/20220606095551/dpdk/kernel/linux/kni/kni_net.c:284:1: warning: ‘kni_net_config’ defined but not used [-Wunused-function]
  284 | kni_net_config(struct net_device *dev, struct ifmap *map)
      | ^~~~~~~~~~~~~~
/root/UB2204-64N_K5.17.5_GCC11.2.0/x86_64-native-linuxapp-gcc+shared/20220606095551/dpdk/kernel/linux/kni/kni_net.c:202:1: warning: ‘kni_net_release’ defined but not used [-Wunused-function]
  202 | kni_net_release(struct net_device *dev)
      | ^~~~~~~~~~~~~~~
/root/UB2204-64N_K5.17.5_GCC11.2.0/x86_64-native-linuxapp-gcc+shared/20220606095551/dpdk/kernel/linux/kni/kni_net.c:180:1: warning: ‘kni_net_open’ defined but not used [-Wunused-function]
  180 | kni_net_open(struct net_device *dev)
      | ^~~~~~~~~~~~
/root/UB2204-64N_K5.17.5_GCC11.2.0/x86_64-native-linuxapp-gcc+shared/20220606095551/dpdk/kernel/linux/kni/kni_net.c:38:21: warning: ‘kni_net_rx_func’ defined but not used [-Wunused-variable]
   38 | static kni_net_rx_t kni_net_rx_func = kni_net_rx_normal;
      |                     ^~~~~~~~~~~~~~~
make[1]: *** [scripts/Makefile.build:288: /root/UB2204-64N_K5.17.5_GCC11.2.0/x86_64-native-linuxapp-gcc+shared/20220606095551/dpdk/x86_64-native-linuxapp-gcc+shared/kernel/linux/kni/kni_net.o] Error 1
make[1]: *** Waiting for unfinished jobs....
make: *** [Makefile:1837: /root/UB2204-64N_K5.17.5_GCC11.2.0/x86_64-native-linuxapp-gcc+shared/20220606095551/dpdk/x86_64-native-linuxapp-gcc+shared/kernel/linux/kni] Error 2
make: Leaving directory '/usr/src/linux-headers-5.17.5-051705-generic'
[3458/3459] Compiling C object app/test/dpdk-test.p/test_ring.c.o
ninja: build stopped




*Build Failed #15:
OS: UB2204-64
Target: x86_64-native-linuxapp-gcc+16byte
FAILED: kernel/linux/kni/rte_kni.ko 
/usr/bin/make -j4 -C /lib/modules/5.15.0-25-generic/build M=/root/UB2204-64_K5.15.0_GCC11.2.0/x86_64-native-linuxapp-gcc+16byte/20220606095551/dpdk/x86_64-native-linuxapp-gcc+16byte/kernel/linux/kni src=/root/UB2204-64_K5.15.0_GCC11.2.0/x86_64-native-linuxapp-gcc+16byte/20220606095551/dpdk/kernel/linux/kni 'MODULE_CFLAGS=  -include /root/UB2204-64_K5.15.0_GCC11.2.0/x86_64-native-linuxapp-gcc+16byte/20220606095551/dpdk/config/rte_config.h -I/root/UB2204-64_K5.15.0_GCC11.2.0/x86_64-native-linuxapp-gcc+16byte/20220606095551/dpdk/lib/eal/include -I/root/UB2204-64_K5.15.0_GCC11.2.0/x86_64-native-linuxapp-gcc+16byte/20220606095551/dpdk/lib/kni -I/root/UB2204-64_K5.15.0_GCC11.2.0/x86_64-native-linuxapp-gcc+16byte/20220606095551/dpdk/x86_64-native-linuxapp-gcc+16byte -I/root/UB2204-64_K5.15.0_GCC11.2.0/x86_64-native-linuxapp-gcc+16byte/20220606095551/dpdk/kernel/linux/kni' modules
make: Entering directory '/usr/src/linux-headers-5.15.0-25-generic'
  CC [M]  /root/UB2204-64_K5.15.0_GCC11.2.0/x86_64-native-linuxapp-gcc+16byte/20220606095551/dpdk/x86_64-native-linuxapp-gcc+16byte/kernel/linux/kni/kni_misc.o
  CC [M]  /root/UB2204-64_K5.15.0_GCC11.2.0/x86_64-native-linuxapp-gcc+16byte/20220606095551/dpdk/x86_64-native-linuxapp-gcc+16byte/kernel/linux/kni/kni_net.o
/root/UB2204-64_K5.15.0_GCC11.2.0/x86_64-native-linuxapp-gcc+16byte/20220606095551/dpdk/kernel/linux/kni/kni_net.c: In function ‘kni_net_rx_normal’:
/root/UB2204-64_K5.15.0_GCC11.2.0/x86_64-native-linuxapp-gcc+16byte/20220606095551/dpdk/kernel/linux/kni/kni_net.c:448:2: error: #else after #else
  448 | #else
      |  ^~~~
/root/UB2204-64_K5.15.0_GCC11.2.0/x86_64-native-linuxapp-gcc+16byte/20220606095551/dpdk/kernel/linux/kni/kni_net.c:444: error: the conditional began here
  444 | #ifdef HAVE_NETIF_RX_NI
      | 
/root/UB2204-64_K5.15.0_GCC11.2.0/x86_64-native-linuxapp-gcc+16byte/20220606095551/dpdk/kernel/linux/kni/kni_net.c:444: error: unterminated #else
/root/UB2204-64_K5.15.0_GCC11.2.0/x86_64-native-linuxapp-gcc+16byte/20220606095551/dpdk/kernel/linux/kni/kni_net.c:445:17: error: expected declaration or statement at end of input
  445 |                 netif_rx_ni(skb);
      |                 ^~~~~~~~~~~
/root/UB2204-64_K5.15.0_GCC11.2.0/x86_64-native-linuxapp-gcc+16byte/20220606095551/dpdk/kernel/linux/kni/kni_net.c:445:17: error: expected declaration or statement at end of input
/root/UB2204-64_K5.15.0_GCC11.2.0/x86_64-native-linuxapp-gcc+16byte/20220606095551/dpdk/kernel/linux/kni/kni_net.c:382:18: warning: unused variable ‘ret’ [-Wunused-variable]
  382 |         uint32_t ret;
      |                  ^~~
At top level:
/root/UB2204-64_K5.15.0_GCC11.2.0/x86_64-native-linuxapp-gcc+16byte/20220606095551/dpdk/kernel/linux/kni/kni_net.c:297:1: warning: ‘kni_net_tx’ defined but not used [-Wunused-function]
  297 | kni_net_tx(struct sk_buff *skb, struct net_device *dev)
      | ^~~~~~~~~~
/root/UB2204-64_K5.15.0_GCC11.2.0/x86_64-native-linuxapp-gcc+16byte/20220606095551/dpdk/kernel/linux/kni/kni_net.c:284:1: warning: ‘kni_net_config’ defined but not used [-Wunused-function]
  284 | kni_net_config(struct net_device *dev, struct ifmap *map)
      | ^~~~~~~~~~~~~~
/root/UB2204-64_K5.15.0_GCC11.2.0/x86_64-native-linuxapp-gcc+16byte/20220606095551/dpdk/kernel/linux/kni/kni_net.c:202:1: warning: ‘kni_net_release’ defined but not used [-Wunused-function]
  202 | kni_net_release(struct net_device *dev)
      | ^~~~~~~~~~~~~~~
/root/UB2204-64_K5.15.0_GCC11.2.0/x86_64-native-linuxapp-gcc+16byte/20220606095551/dpdk/kernel/linux/kni/kni_net.c:180:1: warning: ‘kni_net_open’ defined but not used [-Wunused-function]
  180 | kni_net_open(struct net_device *dev)
      | ^~~~~~~~~~~~
/root/UB2204-64_K5.15.0_GCC11.2.0/x86_64-native-linuxapp-gcc+16byte/20220606095551/dpdk/kernel/linux/kni/kni_net.c:38:21: warning: ‘kni_net_rx_func’ defined but not used [-Wunused-variable]
   38 | static kni_net_rx_t kni_net_rx_func = kni_net_rx_normal;
      |                     ^~~~~~~~~~~~~~~
make[1]: *** [scripts/Makefile.build:285: /root/UB2204-64_K5.15.0_GCC11.2.0/x86_64-native-linuxapp-gcc+16byte/20220606095551/dpdk/x86_64-native-linuxapp-gcc+16byte/kernel/linux/kni/kni_net.o] Error 1
make[1]: *** Waiting for unfinished jobs....
make: *** [Makefile:1875: /root/UB2204-64_K5.15.0_GCC11.2.0/x86_64-native-linuxapp-gcc+16byte/20220606095551/dpdk/x86_64-native-linuxapp-gcc+16byte/kernel/linux/kni] Error 2
make: Leaving directory '/usr/src/linux-headers-5.15.0-25-generic'
ninja: build stopped




*Build Failed #16:
OS: UB2204-64
Target: x86_64-native-linuxapp-gcc
FAILED: kernel/linux/kni/rte_kni.ko 
/usr/bin/make -j4 -C /lib/modules/5.15.0-25-generic/build M=/root/UB2204-64_K5.15.0_GCC11.2.0/x86_64-native-linuxapp-gcc/20220606095551/dpdk/x86_64-native-linuxapp-gcc/kernel/linux/kni src=/root/UB2204-64_K5.15.0_GCC11.2.0/x86_64-native-linuxapp-gcc/20220606095551/dpdk/kernel/linux/kni 'MODULE_CFLAGS=  -include /root/UB2204-64_K5.15.0_GCC11.2.0/x86_64-native-linuxapp-gcc/20220606095551/dpdk/config/rte_config.h -I/root/UB2204-64_K5.15.0_GCC11.2.0/x86_64-native-linuxapp-gcc/20220606095551/dpdk/lib/eal/include -I/root/UB2204-64_K5.15.0_GCC11.2.0/x86_64-native-linuxapp-gcc/20220606095551/dpdk/lib/kni -I/root/UB2204-64_K5.15.0_GCC11.2.0/x86_64-native-linuxapp-gcc/20220606095551/dpdk/x86_64-native-linuxapp-gcc -I/root/UB2204-64_K5.15.0_GCC11.2.0/x86_64-native-linuxapp-gcc/20220606095551/dpdk/kernel/linux/kni' modules
make: Entering directory '/usr/src/linux-headers-5.15.0-25-generic'
  CC [M]  /root/UB2204-64_K5.15.0_GCC11.2.0/x86_64-native-linuxapp-gcc/20220606095551/dpdk/x86_64-native-linuxapp-gcc/kernel/linux/kni/kni_misc.o
  CC [M]  /root/UB2204-64_K5.15.0_GCC11.2.0/x86_64-native-linuxapp-gcc/20220606095551/dpdk/x86_64-native-linuxapp-gcc/kernel/linux/kni/kni_net.o
/root/UB2204-64_K5.15.0_GCC11.2.0/x86_64-native-linuxapp-gcc/20220606095551/dpdk/kernel/linux/kni/kni_net.c: In function ‘kni_net_rx_normal’:
/root/UB2204-64_K5.15.0_GCC11.2.0/x86_64-native-linuxapp-gcc/20220606095551/dpdk/kernel/linux/kni/kni_net.c:448:2: error: #else after #else
  448 | #else
      |  ^~~~
/root/UB2204-64_K5.15.0_GCC11.2.0/x86_64-native-linuxapp-gcc/20220606095551/dpdk/kernel/linux/kni/kni_net.c:444: error: the conditional began here
  444 | #ifdef HAVE_NETIF_RX_NI
      | 
/root/UB2204-64_K5.15.0_GCC11.2.0/x86_64-native-linuxapp-gcc/20220606095551/dpdk/kernel/linux/kni/kni_net.c:444: error: unterminated #else
/root/UB2204-64_K5.15.0_GCC11.2.0/x86_64-native-linuxapp-gcc/20220606095551/dpdk/kernel/linux/kni/kni_net.c:445:17: error: expected declaration or statement at end of input
  445 |                 netif_rx_ni(skb);
      |                 ^~~~~~~~~~~
/root/UB2204-64_K5.15.0_GCC11.2.0/x86_64-native-linuxapp-gcc/20220606095551/dpdk/kernel/linux/kni/kni_net.c:445:17: error: expected declaration or statement at end of input
/root/UB2204-64_K5.15.0_GCC11.2.0/x86_64-native-linuxapp-gcc/20220606095551/dpdk/kernel/linux/kni/kni_net.c:382:18: warning: unused variable ‘ret’ [-Wunused-variable]
  382 |         uint32_t ret;
      |                  ^~~
At top level:
/root/UB2204-64_K5.15.0_GCC11.2.0/x86_64-native-linuxapp-gcc/20220606095551/dpdk/kernel/linux/kni/kni_net.c:297:1: warning: ‘kni_net_tx’ defined but not used [-Wunused-function]
  297 | kni_net_tx(struct sk_buff *skb, struct net_device *dev)
      | ^~~~~~~~~~
/root/UB2204-64_K5.15.0_GCC11.2.0/x86_64-native-linuxapp-gcc/20220606095551/dpdk/kernel/linux/kni/kni_net.c:284:1: warning: ‘kni_net_config’ defined but not used [-Wunused-function]
  284 | kni_net_config(struct net_device *dev, struct ifmap *map)
      | ^~~~~~~~~~~~~~
/root/UB2204-64_K5.15.0_GCC11.2.0/x86_64-native-linuxapp-gcc/20220606095551/dpdk/kernel/linux/kni/kni_net.c:202:1: warning: ‘kni_net_release’ defined but not used [-Wunused-function]
  202 | kni_net_release(struct net_device *dev)
      | ^~~~~~~~~~~~~~~
/root/UB2204-64_K5.15.0_GCC11.2.0/x86_64-native-linuxapp-gcc/20220606095551/dpdk/kernel/linux/kni/kni_net.c:180:1: warning: ‘kni_net_open’ defined but not used [-Wunused-function]
  180 | kni_net_open(struct net_device *dev)
      | ^~~~~~~~~~~~
/root/UB2204-64_K5.15.0_GCC11.2.0/x86_64-native-linuxapp-gcc/20220606095551/dpdk/kernel/linux/kni/kni_net.c:38:21: warning: ‘kni_net_rx_func’ defined but not used [-Wunused-variable]
   38 | static kni_net_rx_t kni_net_rx_func = kni_net_rx_normal;
      |                     ^~~~~~~~~~~~~~~
make[1]: *** [scripts/Makefile.build:285: /root/UB2204-64_K5.15.0_GCC11.2.0/x86_64-native-linuxapp-gcc/20220606095551/dpdk/x86_64-native-linuxapp-gcc/kernel/linux/kni/kni_net.o] Error 1
make[1]: *** Waiting for unfinished jobs....
make: *** [Makefile:1875: /root/UB2204-64_K5.15.0_GCC11.2.0/x86_64-native-linuxapp-gcc/20220606095551/dpdk/x86_64-native-linuxapp-gcc/kernel/linux/kni] Error 2
make: Leaving directory '/usr/src/linux-headers-5.15.0-25-generic'
ninja: build stopped




*Build Failed #17:
OS: UB2204-64
Target: x86_64-native-linuxapp-clang
FAILED: kernel/linux/kni/rte_kni.ko 
/usr/bin/make -j4 -C /lib/modules/5.15.0-25-generic/build M=/root/UB2204-64_K5.15.0_Clang14.0.0/x86_64-native-linuxapp-clang/20220606095551/dpdk/x86_64-native-linuxapp-clang/kernel/linux/kni src=/root/UB2204-64_K5.15.0_Clang14.0.0/x86_64-native-linuxapp-clang/20220606095551/dpdk/kernel/linux/kni 'MODULE_CFLAGS=  -include /root/UB2204-64_K5.15.0_Clang14.0.0/x86_64-native-linuxapp-clang/20220606095551/dpdk/config/rte_config.h -I/root/UB2204-64_K5.15.0_Clang14.0.0/x86_64-native-linuxapp-clang/20220606095551/dpdk/lib/eal/include -I/root/UB2204-64_K5.15.0_Clang14.0.0/x86_64-native-linuxapp-clang/20220606095551/dpdk/lib/kni -I/root/UB2204-64_K5.15.0_Clang14.0.0/x86_64-native-linuxapp-clang/20220606095551/dpdk/x86_64-native-linuxapp-clang -I/root/UB2204-64_K5.15.0_Clang14.0.0/x86_64-native-linuxapp-clang/20220606095551/dpdk/kernel/linux/kni' modules
make: Entering directory '/usr/src/linux-headers-5.15.0-25-generic'
  CC [M]  /root/UB2204-64_K5.15.0_Clang14.0.0/x86_64-native-linuxapp-clang/20220606095551/dpdk/x86_64-native-linuxapp-clang/kernel/linux/kni/kni_misc.o
  CC [M]  /root/UB2204-64_K5.15.0_Clang14.0.0/x86_64-native-linuxapp-clang/20220606095551/dpdk/x86_64-native-linuxapp-clang/kernel/linux/kni/kni_net.o
/root/UB2204-64_K5.15.0_Clang14.0.0/x86_64-native-linuxapp-clang/20220606095551/dpdk/kernel/linux/kni/kni_net.c: In function ‘kni_net_rx_normal’:
/root/UB2204-64_K5.15.0_Clang14.0.0/x86_64-native-linuxapp-clang/20220606095551/dpdk/kernel/linux/kni/kni_net.c:448:2: error: #else after #else
  448 | #else
      |  ^~~~
/root/UB2204-64_K5.15.0_Clang14.0.0/x86_64-native-linuxapp-clang/20220606095551/dpdk/kernel/linux/kni/kni_net.c:444: error: the conditional began here
  444 | #ifdef HAVE_NETIF_RX_NI
      | 
/root/UB2204-64_K5.15.0_Clang14.0.0/x86_64-native-linuxapp-clang/20220606095551/dpdk/kernel/linux/kni/kni_net.c:444: error: unterminated #else
/root/UB2204-64_K5.15.0_Clang14.0.0/x86_64-native-linuxapp-clang/20220606095551/dpdk/kernel/linux/kni/kni_net.c:445:17: error: expected declaration or statement at end of input
  445 |                 netif_rx_ni(skb);
      |                 ^~~~~~~~~~~
/root/UB2204-64_K5.15.0_Clang14.0.0/x86_64-native-linuxapp-clang/20220606095551/dpdk/kernel/linux/kni/kni_net.c:445:17: error: expected declaration or statement at end of input
/root/UB2204-64_K5.15.0_Clang14.0.0/x86_64-native-linuxapp-clang/20220606095551/dpdk/kernel/linux/kni/kni_net.c:382:18: warning: unused variable ‘ret’ [-Wunused-variable]
  382 |         uint32_t ret;
      |                  ^~~
At top level:
/root/UB2204-64_K5.15.0_Clang14.0.0/x86_64-native-linuxapp-clang/20220606095551/dpdk/kernel/linux/kni/kni_net.c:297:1: warning: ‘kni_net_tx’ defined but not used [-Wunused-function]
  297 | kni_net_tx(struct sk_buff *skb, struct net_device *dev)
      | ^~~~~~~~~~
/root/UB2204-64_K5.15.0_Clang14.0.0/x86_64-native-linuxapp-clang/20220606095551/dpdk/kernel/linux/kni/kni_net.c:284:1: warning: ‘kni_net_config’ defined but not used [-Wunused-function]
  284 | kni_net_config(struct net_device *dev, struct ifmap *map)
      | ^~~~~~~~~~~~~~
/root/UB2204-64_K5.15.0_Clang14.0.0/x86_64-native-linuxapp-clang/20220606095551/dpdk/kernel/linux/kni/kni_net.c:202:1: warning: ‘kni_net_release’ defined but not used [-Wunused-function]
  202 | kni_net_release(struct net_device *dev)
      | ^~~~~~~~~~~~~~~
/root/UB2204-64_K5.15.0_Clang14.0.0/x86_64-native-linuxapp-clang/20220606095551/dpdk/kernel/linux/kni/kni_net.c:180:1: warning: ‘kni_net_open’ defined but not used [-Wunused-function]
  180 | kni_net_open(struct net_device *dev)
      | ^~~~~~~~~~~~
/root/UB2204-64_K5.15.0_Clang14.0.0/x86_64-native-linuxapp-clang/20220606095551/dpdk/kernel/linux/kni/kni_net.c:38:21: warning: ‘kni_net_rx_func’ defined but not used [-Wunused-variable]
   38 | static kni_net_rx_t kni_net_rx_func = kni_net_rx_normal;
      |                     ^~~~~~~~~~~~~~~
make[1]: *** [scripts/Makefile.build:285: /root/UB2204-64_K5.15.0_Clang14.0.0/x86_64-native-linuxapp-clang/20220606095551/dpdk/x86_64-native-linuxapp-clang/kernel/linux/kni/kni_net.o] Error 1
make[1]: *** Waiting for unfinished jobs....
make: *** [Makefile:1875: /root/UB2204-64_K5.15.0_Clang14.0.0/x86_64-native-linuxapp-clang/20220606095551/dpdk/x86_64-native-linuxapp-clang/kernel/linux/kni] Error 2
make: Leaving directory '/usr/src/linux-headers-5.15.0-25-generic'
[3587/3588] Linking target examples/dpdk-vhost_blk
[3588/3588] Linking target examples/dpdk-vmdq_dcb
ninja: build stopped




*Build Failed #18:
OS: UB2204-64
Target: x86_64-native-linuxapp-doc
FAILED: kernel/linux/kni/rte_kni.ko 
/usr/bin/make -j4 -C /lib/modules/5.15.0-25-generic/build M=/root/UB2204-64_K5.15.0_GCC11.2.0/x86_64-native-linuxapp-doc/20220606095551/dpdk/x86_64-native-linuxapp-doc/kernel/linux/kni src=/root/UB2204-64_K5.15.0_GCC11.2.0/x86_64-native-linuxapp-doc/20220606095551/dpdk/kernel/linux/kni 'MODULE_CFLAGS=  -include /root/UB2204-64_K5.15.0_GCC11.2.0/x86_64-native-linuxapp-doc/20220606095551/dpdk/config/rte_config.h -I/root/UB2204-64_K5.15.0_GCC11.2.0/x86_64-native-linuxapp-doc/20220606095551/dpdk/lib/eal/include -I/root/UB2204-64_K5.15.0_GCC11.2.0/x86_64-native-linuxapp-doc/20220606095551/dpdk/lib/kni -I/root/UB2204-64_K5.15.0_GCC11.2.0/x86_64-native-linuxapp-doc/20220606095551/dpdk/x86_64-native-linuxapp-doc -I/root/UB2204-64_K5.15.0_GCC11.2.0/x86_64-native-linuxapp-doc/20220606095551/dpdk/kernel/linux/kni' modules
make: Entering directory '/usr/src/linux-headers-5.15.0-25-generic'
  CC [M]  /root/UB2204-64_K5.15.0_GCC11.2.0/x86_64-native-linuxapp-doc/20220606095551/dpdk/x86_64-native-linuxapp-doc/kernel/linux/kni/kni_misc.o
  CC [M]  /root/UB2204-64_K5.15.0_GCC11.2.0/x86_64-native-linuxapp-doc/20220606095551/dpdk/x86_64-native-linuxapp-doc/kernel/linux/kni/kni_net.o
/root/UB2204-64_K5.15.0_GCC11.2.0/x86_64-native-linuxapp-doc/20220606095551/dpdk/kernel/linux/kni/kni_net.c: In function ‘kni_net_rx_normal’:
/root/UB2204-64_K5.15.0_GCC11.2.0/x86_64-native-linuxapp-doc/20220606095551/dpdk/kernel/linux/kni/kni_net.c:448:2: error: #else after #else
  448 | #else
      |  ^~~~
/root/UB2204-64_K5.15.0_GCC11.2.0/x86_64-native-linuxapp-doc/20220606095551/dpdk/kernel/linux/kni/kni_net.c:444: error: the conditional began here
  444 | #ifdef HAVE_NETIF_RX_NI
      | 
/root/UB2204-64_K5.15.0_GCC11.2.0/x86_64-native-linuxapp-doc/20220606095551/dpdk/kernel/linux/kni/kni_net.c:444: error: unterminated #else
/root/UB2204-64_K5.15.0_GCC11.2.0/x86_64-native-linuxapp-doc/20220606095551/dpdk/kernel/linux/kni/kni_net.c:445:17: error: expected declaration or statement at end of input
  445 |                 netif_rx_ni(skb);
      |                 ^~~~~~~~~~~
/root/UB2204-64_K5.15.0_GCC11.2.0/x86_64-native-linuxapp-doc/20220606095551/dpdk/kernel/linux/kni/kni_net.c:445:17: error: expected declaration or statement at end of input
/root/UB2204-64_K5.15.0_GCC11.2.0/x86_64-native-linuxapp-doc/20220606095551/dpdk/kernel/linux/kni/kni_net.c:382:18: warning: unused variable ‘ret’ [-Wunused-variable]
  382 |         uint32_t ret;
      |                  ^~~
At top level:
/root/UB2204-64_K5.15.0_GCC11.2.0/x86_64-native-linuxapp-doc/20220606095551/dpdk/kernel/linux/kni/kni_net.c:297:1: warning: ‘kni_net_tx’ defined but not used [-Wunused-function]
  297 | kni_net_tx(struct sk_buff *skb, struct net_device *dev)
      | ^~~~~~~~~~
/root/UB2204-64_K5.15.0_GCC11.2.0/x86_64-native-linuxapp-doc/20220606095551/dpdk/kernel/linux/kni/kni_net.c:284:1: warning: ‘kni_net_config’ defined but not used [-Wunused-function]
  284 | kni_net_config(struct net_device *dev, struct ifmap *map)
      | ^~~~~~~~~~~~~~
/root/UB2204-64_K5.15.0_GCC11.2.0/x86_64-native-linuxapp-doc/20220606095551/dpdk/kernel/linux/kni/kni_net.c:202:1: warning: ‘kni_net_release’ defined but not used [-Wunused-function]
  202 | kni_net_release(struct net_device *dev)
      | ^~~~~~~~~~~~~~~
/root/UB2204-64_K5.15.0_GCC11.2.0/x86_64-native-linuxapp-doc/20220606095551/dpdk/kernel/linux/kni/kni_net.c:180:1: warning: ‘kni_net_open’ defined but not used [-Wunused-function]
  180 | kni_net_open(struct net_device *dev)
      | ^~~~~~~~~~~~
/root/UB2204-64_K5.15.0_GCC11.2.0/x86_64-native-linuxapp-doc/20220606095551/dpdk/kernel/linux/kni/kni_net.c:38:21: warning: ‘kni_net_rx_func’ defined but not used [-Wunused-variable]
   38 | static kni_net_rx_t kni_net_rx_func = kni_net_rx_normal;
      |                     ^~~~~~~~~~~~~~~
make[1]: *** [scripts/Makefile.build:285: /root/UB2204-64_K5.15.0_GCC11.2.0/x86_64-native-linuxapp-doc/20220606095551/dpdk/x86_64-native-linuxapp-doc/kernel/linux/kni/kni_net.o] Error 1
make[1]: *** Waiting for unfinished jobs....
make: *** [Makefile:1875: /root/UB2204-64_K5.15.0_GCC11.2.0/x86_64-native-linuxapp-doc/20220606095551/dpdk/x86_64-native-linuxapp-doc/kernel/linux/kni] Error 2
make: Leaving directory '/usr/src/linux-headers-5.15.0-25-generic'
[3430/3434] Compiling C object app/test/dpdk-test.p/test_trace_perf.c.o
[3431/3434] Compiling C object app/test/dpdk-test.p/test_ring.c.o
[3432/3434] Generating doc/api/doxygen with a custom command
[3433/3434] Generating doc/guides/html_guides with a custom command
ninja: build stopped




*Build Failed #19:
OS: CentOS79-64
Target: x86_64-native-linuxapp-gcc
FAILED: kernel/linux/kni/rte_kni.ko 
/usr/bin/make -j4 -C /lib/modules/3.10.0-1160.el7.x86_64/build M=/root/CentOS79-64_K3.10.0_GCC4.8.5/x86_64-native-linuxapp-gcc/20220606095551/dpdk/x86_64-native-linuxapp-gcc/kernel/linux/kni src=/root/CentOS79-64_K3.10.0_GCC4.8.5/x86_64-native-linuxapp-gcc/20220606095551/dpdk/kernel/linux/kni 'MODULE_CFLAGS=  -include /root/CentOS79-64_K3.10.0_GCC4.8.5/x86_64-native-linuxapp-gcc/20220606095551/dpdk/config/rte_config.h -I/root/CentOS79-64_K3.10.0_GCC4.8.5/x86_64-native-linuxapp-gcc/20220606095551/dpdk/lib/eal/include -I/root/CentOS79-64_K3.10.0_GCC4.8.5/x86_64-native-linuxapp-gcc/20220606095551/dpdk/lib/kni -I/root/CentOS79-64_K3.10.0_GCC4.8.5/x86_64-native-linuxapp-gcc/20220606095551/dpdk/x86_64-native-linuxapp-gcc -I/root/CentOS79-64_K3.10.0_GCC4.8.5/x86_64-native-linuxapp-gcc/20220606095551/dpdk/kernel/linux/kni' modules
make: Entering directory `/usr/src/kernels/3.10.0-1160.el7.x86_64'
  CC [M]  /root/CentOS79-64_K3.10.0_GCC4.8.5/x86_64-native-linuxapp-gcc/20220606095551/dpdk/x86_64-native-linuxapp-gcc/kernel/linux/kni/kni_misc.o
  CC [M]  /root/CentOS79-64_K3.10.0_GCC4.8.5/x86_64-native-linuxapp-gcc/20220606095551/dpdk/x86_64-native-linuxapp-gcc/kernel/linux/kni/kni_net.o
/root/CentOS79-64_K3.10.0_GCC4.8.5/x86_64-native-linuxapp-gcc/20220606095551/dpdk/kernel/linux/kni/kni_net.c: In function 'kni_net_rx_normal':
/root/CentOS79-64_K3.10.0_GCC4.8.5/x86_64-native-linuxapp-gcc/20220606095551/dpdk/kernel/linux/kni/kni_net.c:448:2: error: #else after #else
 #else
  ^
/root/CentOS79-64_K3.10.0_GCC4.8.5/x86_64-native-linuxapp-gcc/20220606095551/dpdk/kernel/linux/kni/kni_net.c:444:0: error: the conditional began here
 #ifdef HAVE_NETIF_RX_NI
 ^
/root/CentOS79-64_K3.10.0_GCC4.8.5/x86_64-native-linuxapp-gcc/20220606095551/dpdk/kernel/linux/kni/kni_net.c:444:0: error: unterminated #else
/root/CentOS79-64_K3.10.0_GCC4.8.5/x86_64-native-linuxapp-gcc/20220606095551/dpdk/kernel/linux/kni/kni_net.c:445:3: error: expected declaration or statement at end of input
   netif_rx_ni(skb);
   ^
/root/CentOS79-64_K3.10.0_GCC4.8.5/x86_64-native-linuxapp-gcc/20220606095551/dpdk/kernel/linux/kni/kni_net.c:445:3: error: expected declaration or statement at end of input
/root/CentOS79-64_K3.10.0_GCC4.8.5/x86_64-native-linuxapp-gcc/20220606095551/dpdk/kernel/linux/kni/kni_net.c:382:11: warning: unused variable 'ret' [-Wunused-variable]
  uint32_t ret;
           ^
/root/CentOS79-64_K3.10.0_GCC4.8.5/x86_64-native-linuxapp-gcc/20220606095551/dpdk/kernel/linux/kni/kni_net.c: At top level:
/root/CentOS79-64_K3.10.0_GCC4.8.5/x86_64-native-linuxapp-gcc/20220606095551/dpdk/kernel/linux/kni/kni_net.c:38:21: warning: 'kni_net_rx_func' defined but not used [-Wunused-variable]
 static kni_net_rx_t kni_net_rx_func = kni_net_rx_normal;
                     ^
/root/CentOS79-64_K3.10.0_GCC4.8.5/x86_64-native-linuxapp-gcc/20220606095551/dpdk/kernel/linux/kni/kni_net.c:180:1: warning: 'kni_net_open' defined but not used [-Wunused-function]
 kni_net_open(struct net_device *dev)
 ^
/root/CentOS79-64_K3.10.0_GCC4.8.5/x86_64-native-linuxapp-gcc/20220606095551/dpdk/kernel/linux/kni/kni_net.c:202:1: warning: 'kni_net_release' defined but not used [-Wunused-function]
 kni_net_release(struct net_device *dev)
 ^
/root/CentOS79-64_K3.10.0_GCC4.8.5/x86_64-native-linuxapp-gcc/20220606095551/dpdk/kernel/linux/kni/kni_net.c:284:1: warning: 'kni_net_config' defined but not used [-Wunused-function]
 kni_net_config(struct net_device *dev, struct ifmap *map)
 ^
/root/CentOS79-64_K3.10.0_GCC4.8.5/x86_64-native-linuxapp-gcc/20220606095551/dpdk/kernel/linux/kni/kni_net.c:297:1: warning: 'kni_net_tx' defined but not used [-Wunused-function]
 kni_net_tx(struct sk_buff *skb, struct net_device *dev)
 ^
make[1]: *** [/root/CentOS79-64_K3.10.0_GCC4.8.5/x86_64-native-linuxapp-gcc/20220606095551/dpdk/x86_64-native-linuxapp-gcc/kernel/linux/kni/kni_net.o] Error 1
make[1]: *** Waiting for unfinished jobs....
make: *** [_module_/root/CentOS79-64_K3.10.0_GCC4.8.5/x86_64-native-linuxapp-gcc/20220606095551/dpdk/x86_64-native-linuxapp-gcc/kernel/linux/kni] Error 2
make: Leaving directory `/usr/src/kernels/3.10.0-1160.el7.x86_64'
[3521/3521] Linking target examples/dpdk-vhost
ninja: build stopped


DPDK STV team

             reply	other threads:[~2022-06-06  2:06 UTC|newest]

Thread overview: 41+ messages / expand[flat|nested]  mbox.gz  Atom feed  top
2022-06-06  2:06 sys_stv [this message]
  -- strict thread matches above, loose matches on Subject: below --
2022-06-22 21:09 sys_stv
2022-06-09  9:08 sys_stv
2022-06-06  7:26 sys_stv
2022-06-01 21:06 sys_stv
2022-06-01  1:57 sys_stv
2022-05-31 21:06 sys_stv
2022-05-30  8:26 sys_stv
2022-05-26  8:57 sys_stv
2022-05-20  5:13 sys_stv
2022-05-20  4:47 sys_stv
2022-05-18 21:07 sys_stv
2022-05-18 10:08 sys_stv
2022-05-17 21:07 sys_stv
2022-05-17  9:36 sys_stv
2022-05-17  9:15 sys_stv
2022-05-17  8:58 sys_stv
2022-05-16 21:06 sys_stv
2022-05-07  7:26 sys_stv
2022-05-06 21:06 sys_stv
2022-05-06  9:49 sys_stv
2022-05-06  9:32 sys_stv
2022-03-08 21:07 sys_stv
2022-03-08 17:16 sys_stv
2022-01-21  7:59 sys_stv
2022-01-21  7:55 sys_stv
2021-12-18 21:50 sys_stv
2021-10-22 22:14 sys_stv
2021-10-14  3:03 sys_stv
2021-08-15 22:10 sys_stv
2021-06-29 15:39 sys_stv
2021-05-27 22:08 sys_stv
2021-05-07  1:05 sys_stv
2021-03-22 22:07 sys_stv
2021-01-28 22:07 sys_stv
2021-01-27 22:07 sys_stv
2021-01-26 22:08 sys_stv
2021-01-26  6:13 sys_stv
2020-11-05 22:08 sys_stv
2020-11-03 22:07 sys_stv
2020-10-20  5:41 sys_stv

Reply instructions:

You may reply publicly to this message via plain-text email
using any one of the following methods:

* Save the following mbox file, import it into your mail client,
  and reply-to-all from there: mbox

  Avoid top-posting and favor interleaved quoting:
  https://en.wikipedia.org/wiki/Posting_style#Interleaved_style

* Reply using the --to, --cc, and --in-reply-to
  switches of git-send-email(1):

  git send-email \
    --in-reply-to='7f4525$itt92v@fmsmga008-auth.fm.intel.com' \
    --to=sys_stv@intel.com \
    --cc=dpdk_sw_eng@intel.com \
    --cc=npg.sw.core.tools.prc@intel.com \
    --cc=test-report@dpdk.org \
    --cc=thomas@monjalon.net \
    /path/to/YOUR_REPLY

  https://kernel.org/pub/software/scm/git/docs/git-send-email.html

* If your mail client supports setting the In-Reply-To header
  via mailto: links, try the mailto: link

automatic DPDK test reports

This inbox may be cloned and mirrored by anyone:

	git clone --mirror http://inbox.dpdk.org/test-report/0 test-report/git/0.git

	# If you have public-inbox 1.1+ installed, you may
	# initialize and index your mirror using the following commands:
	public-inbox-init -V2 test-report test-report/ http://inbox.dpdk.org/test-report \
		test-report@dpdk.org
	public-inbox-index test-report

Example config snippet for mirrors.
Newsgroup available over NNTP:
	nntp://inbox.dpdk.org/inbox.dpdk.test-report


AGPL code for this site: git clone https://public-inbox.org/public-inbox.git