automatic DPDK test reports
 help / color / mirror / Atom feed
From: sys_stv@intel.com
To: test-report@dpdk.org, thomas@monjalon.net
Cc: dpdk_sw_eng@intel.com, npg.sw.core.tools.prc@intel.com
Subject: [dpdk-test-report] |FAILURE| dpdk daily Intel builds
Date: 22 Jun 2022 14:09:20 -0700
Message-ID: <7f4525$j6hc2f@fmsmga008-auth.fm.intel.com> (raw)

[-- Attachment #1: Type: text/plain, Size: 17790 bytes --]


Test-Label: Intel-compilation
Test-Status: FAILURE
_Compilation issues_


commit f3a670783f23a61b4cfea1df17d1ba58b86bb76c
Author: Volodymyr Fialko <vfialko@marvell.com>
Date:   Fri Jun 17 14:38:18 2022 +0200

    app/eventdev: increase number of descriptors

DPDK git Repo: dpdk 


Meson Build Summary: 23 Builds Done, 22 Successful, 1 Failures, 0 Blocked

+--------------+------------+--------------+------------+------------+-----------+----------+------------+
| os           | gcc-static | clang-static | icc-static | gcc-shared | gcc-debug | document | gcc-16byte |
+--------------+------------+--------------+------------+------------+-----------+----------+------------+
| FC36-64      |            | pass         |            |            |           |          |            |
| FreeBSD13-64 | pass       | pass         |            | pass       | pass      |          |            |
| RHEL86-64    | pass       | pass         |            | pass       | pass      |          |            |
| SUSE15-64    | pass       | pass         |            |            |           |          |            |
| UB2004-32    | pass       |              |            |            |           |          |            |
| UB2004-64    | pass       | pass         |            |            |           | fail     |            |
| UB2204-32    | pass       |              |            |            |           |          |            |
| UB2204-64N   | pass       |              |            | pass       |           |          |            |
| UB2204-64    | pass       | pass         |            |            |           | pass     | pass       |
| CentOS79-64  | pass       |              |            |            |           |          |            |
+--------------+------------+--------------+------------+------------+-----------+----------+------------+

Comments: 
Because of DPDK bug (https://bugs.dpdk.org/show_bug.cgi?id=928),
All the dpdk-next-* branch add `Ddisable_drivers=event/cnxk` option when build with ICC complier. 
 
Test environment and configuration as below:


OS: FC36-64
	Kernel Version: 5.17.7-300.fc36.x86_64
	GCC Version: gcc (GCC) 12.1.1 20220507 (Red Hat 12.1.1-1)
	Clang Version: 14.0.0 (Fedora 14.0.0-1.fc36)
	x86_64-native-linuxapp-clang

OS: FreeBSD13-64
	Kernel Version: 13.1-RELEASE
	GCC Version: gcc (FreeBSD Ports Collection) 10.3.0
	Clang Version: 13.0.0 (git@github.com:llvm/llvm-project.git llvmorg-13.0.0-0-gd7b669b3a303)
	x86_64-native-bsdapp-gcc
	x86_64-native-bsdapp-clang
	x86_64-native-bsdapp-gcc+shared
	x86_64-native-bsdapp-gcc+debug

OS: RHEL86-64
	Kernel Version: 4.18.0-372.9.1.el8.x86_64
	GCC Version: gcc (GCC) 8.5.0 20210514 (Red Hat 8.5.0-13)
	Clang Version: 14.0.0 (Red Hat 14.0.0-1.module_el8.7.0+1142+5343df54)
	x86_64-native-linuxapp-gcc
	x86_64-native-linuxapp-clang
	x86_64-native-linuxapp-gcc+shared
	x86_64-native-linuxapp-gcc+debug

OS: SUSE15-64
	Kernel Version: 5.3.18-57-default
	GCC Version: gcc (SUSE Linux) 7.5.0
	Clang Version: 11.0.1
	x86_64-native-linuxapp-clang
	x86_64-native-linuxapp-gcc

OS: UB2004-32
	Kernel Version: 5.8.0-48-generic
	GCC Version: gcc (Ubuntu 10.3.0-1ubuntu1~20.04) 10.3.0
	Clang Version: 10.0.0-4ubuntu1
	i686-native-linuxapp-gcc

OS: UB2004-64
	Kernel Version: 5.8.0-48-generic
	GCC Version: gcc (Ubuntu 10.3.0-1ubuntu1~20.04) 10.3.0
	Clang Version: 10.0.0-4ubuntu1
	x86_64-native-linuxapp-clang
	x86_64-native-linuxapp-gcc
	x86_64-native-linuxapp-doc

OS: UB2204-32
	Kernel Version: 5.15.0-25-generic
	GCC Version: gcc (Ubuntu 11.2.0-19ubuntu1) 11.2.0
	Clang Version: NA
	i686-native-linuxapp-gcc

OS: UB2204-64N
	Kernel Version: 5.17.5-051705-generic
	GCC Version: gcc (Ubuntu 11.2.0-19ubuntu1) 11.2.0
	Clang Version: 14.0.0-1ubuntu1
	x86_64-native-linuxapp-gcc
	x86_64-native-linuxapp-gcc+shared

OS: UB2204-64
	Kernel Version: 5.15.0-25-generic
	GCC Version: gcc (Ubuntu 11.2.0-19ubuntu1) 11.2.0
	Clang Version: 14.0.0-1ubuntu1
	x86_64-native-linuxapp-gcc+16byte
	x86_64-native-linuxapp-gcc
	x86_64-native-linuxapp-clang
	x86_64-native-linuxapp-doc

OS: CentOS79-64
	Kernel Version: 3.10.0-1160.el7.x86_64
	GCC Version: gcc (GCC) 4.8.5 20150623 (Red Hat 4.8.5-44)
	Clang Version: 3.4.2 (tags/RELEASE_34/dot2-final)
	x86_64-native-linuxapp-gcc



*Build Failed #1:
OS: UB2004-64
Target: x86_64-native-linuxapp-doc
FAILED: app/test/dpdk-test.p/test_compressdev.c.o 
gcc -Iapp/test/dpdk-test.p -Iapp/test -I../app/test -I. -I.. -Iconfig -I../config -Ilib/eal/include -I../lib/eal/include -Ilib/eal/linux/include -I../lib/eal/linux/include -Ilib/eal/x86/include -I../lib/eal/x86/include -Ilib/kvargs -I../lib/kvargs -Ilib/metrics -I../lib/metrics -Ilib/telemetry -I../lib/telemetry -Ilib/eal/common -I../lib/eal/common -Ilib/eal -I../lib/eal -Ilib/ring -I../lib/ring -Ilib/rcu -I../lib/rcu -Ilib/mempool -I../lib/mempool -Ilib/mbuf -I../lib/mbuf -Ilib/net -I../lib/net -Ilib/meter -I../lib/meter -Ilib/ethdev -I../lib/ethdev -Ilib/pci -I../lib/pci -Ilib/cmdline -I../lib/cmdline -Ilib/hash -I../lib/hash -Ilib/timer -I../lib/timer -Ilib/acl -I../lib/acl -Ilib/bbdev -I../lib/bbdev -Ilib/bitratestats -I../lib/bitratestats -Ilib/bpf -I../lib/bpf -Ilib/cfgfile -I../lib/cfgfile -Ilib/compressdev -I../lib/compressdev -Ilib/cryptodev -I../lib/cryptodev -Ilib/distributor -I../lib/distributor -Ilib/efd -I../lib/efd -Ilib/eventdev -I../lib/eventdev -Ilib/gpudev -I../lib/gpudev -Ilib/gro -I../lib/gro -Ilib/gso -I../lib/gso -Ilib/ip_frag -I../lib/ip_frag -Ilib/jobstats -I../lib/jobstats -Ilib/kni -I../lib/kni -Ilib/latencystats -I../lib/latencystats -Ilib/lpm -I../lib/lpm -Ilib/member -I../lib/member -Ilib/pcapng -I../lib/pcapng -Ilib/power -I../lib/power -Ilib/rawdev -I../lib/rawdev -Ilib/regexdev -I../lib/regexdev -Ilib/dmadev -I../lib/dmadev -Ilib/rib -I../lib/rib -Ilib/reorder -I../lib/reorder -Ilib/sched -I../lib/sched -Ilib/security -I../lib/security -Ilib/stack -I../lib/stack -Ilib/vhost -I../lib/vhost -Ilib/ipsec -I../lib/ipsec -Ilib/fib -I../lib/fib -Ilib/port -I../lib/port -Ilib/pdump -I../lib/pdump -Ilib/table -I../lib/table -Ilib/pipeline -I../lib/pipeline -Ilib/flow_classify -I../lib/flow_classify -Ilib/graph -I../lib/graph -Ilib/node -I../lib/node -Idrivers/bus/pci -I../drivers/bus/pci -I../drivers/bus/pci/linux -Idrivers/bus/vdev -I../drivers/bus/vdev -Idrivers/mempool/ring -I../drivers/mempool/ring -Idrivers/mempool/stack -I../drivers/mempool/stack -Idrivers/event/skeleton -I../drivers/event/skeleton -Idrivers/net/bonding -I../drivers/net/bonding -Idrivers/net/ring -I../drivers/net/ring -Idrivers/net/null -I../drivers/net/null -Idrivers/crypto/scheduler -I../drivers/crypto/scheduler -fdiagnostics-color=always -D_FILE_OFFSET_BITS=64 -Wall -Winvalid-pch -Wextra -Werror -O3 -include rte_config.h -Wcast-qual -Wdeprecated -Wformat -Wformat-nonliteral -Wformat-security -Wmissing-declarations -Wmissing-prototypes -Wnested-externs -Wold-style-definition -Wpointer-arith -Wsign-compare -Wstrict-prototypes -Wundef -Wwrite-strings -Wno-address-of-packed-member -Wno-packed-not-aligned -Wno-missing-field-initializers -Wno-zero-length-bounds -D_GNU_SOURCE -march=native -DALLOW_EXPERIMENTAL_API -Wno-format-truncation -fno-strict-aliasing -DALLOW_INTERNAL_API -MD -MQ app/test/dpdk-test.p/test_compressdev.c.o -MF app/test/dpdk-test.p/test_compressdev.c.o.d -o app/test/dpdk-test.p/test_compressdev.c.o -c ../app/test/test_compressdev.c
In file included from ../app/test/test_compressdev.c:19:
../app/test/test.h:193:16: fatal error: opening dependency file app/test/dpdk-test.p/test_compressdev.c.o.d: No such file or directory
../app/test/test_compressdev.c:4270:1: note: in expansion of macro ‘REGISTER_TEST_COMMAND’
 4270 | REGISTER_TEST_COMMAND(compressdev_autotest, test_compressdev);
      | ^~~~~~~~~~~~~~~~~~~~~
compilation terminated.
[3389/3394] Compiling C object app/test/dpdk-test.p/test_trace_perf.c.o
FAILED: app/test/dpdk-test.p/test_trace_perf.c.o 
gcc -Iapp/test/dpdk-test.p -Iapp/test -I../app/test -I. -I.. -Iconfig -I../config -Ilib/eal/include -I../lib/eal/include -Ilib/eal/linux/include -I../lib/eal/linux/include -Ilib/eal/x86/include -I../lib/eal/x86/include -Ilib/kvargs -I../lib/kvargs -Ilib/metrics -I../lib/metrics -Ilib/telemetry -I../lib/telemetry -Ilib/eal/common -I../lib/eal/common -Ilib/eal -I../lib/eal -Ilib/ring -I../lib/ring -Ilib/rcu -I../lib/rcu -Ilib/mempool -I../lib/mempool -Ilib/mbuf -I../lib/mbuf -Ilib/net -I../lib/net -Ilib/meter -I../lib/meter -Ilib/ethdev -I../lib/ethdev -Ilib/pci -I../lib/pci -Ilib/cmdline -I../lib/cmdline -Ilib/hash -I../lib/hash -Ilib/timer -I../lib/timer -Ilib/acl -I../lib/acl -Ilib/bbdev -I../lib/bbdev -Ilib/bitratestats -I../lib/bitratestats -Ilib/bpf -I../lib/bpf -Ilib/cfgfile -I../lib/cfgfile -Ilib/compressdev -I../lib/compressdev -Ilib/cryptodev -I../lib/cryptodev -Ilib/distributor -I../lib/distributor -Ilib/efd -I../lib/efd -Ilib/eventdev -I../lib/eventdev -Ilib/gpudev -I../lib/gpudev -Ilib/gro -I../lib/gro -Ilib/gso -I../lib/gso -Ilib/ip_frag -I../lib/ip_frag -Ilib/jobstats -I../lib/jobstats -Ilib/kni -I../lib/kni -Ilib/latencystats -I../lib/latencystats -Ilib/lpm -I../lib/lpm -Ilib/member -I../lib/member -Ilib/pcapng -I../lib/pcapng -Ilib/power -I../lib/power -Ilib/rawdev -I../lib/rawdev -Ilib/regexdev -I../lib/regexdev -Ilib/dmadev -I../lib/dmadev -Ilib/rib -I../lib/rib -Ilib/reorder -I../lib/reorder -Ilib/sched -I../lib/sched -Ilib/security -I../lib/security -Ilib/stack -I../lib/stack -Ilib/vhost -I../lib/vhost -Ilib/ipsec -I../lib/ipsec -Ilib/fib -I../lib/fib -Ilib/port -I../lib/port -Ilib/pdump -I../lib/pdump -Ilib/table -I../lib/table -Ilib/pipeline -I../lib/pipeline -Ilib/flow_classify -I../lib/flow_classify -Ilib/graph -I../lib/graph -Ilib/node -I../lib/node -Idrivers/bus/pci -I../drivers/bus/pci -I../drivers/bus/pci/linux -Idrivers/bus/vdev -I../drivers/bus/vdev -Idrivers/mempool/ring -I../drivers/mempool/ring -Idrivers/mempool/stack -I../drivers/mempool/stack -Idrivers/event/skeleton -I../drivers/event/skeleton -Idrivers/net/bonding -I../drivers/net/bonding -Idrivers/net/ring -I../drivers/net/ring -Idrivers/net/null -I../drivers/net/null -Idrivers/crypto/scheduler -I../drivers/crypto/scheduler -fdiagnostics-color=always -D_FILE_OFFSET_BITS=64 -Wall -Winvalid-pch -Wextra -Werror -O3 -include rte_config.h -Wcast-qual -Wdeprecated -Wformat -Wformat-nonliteral -Wformat-security -Wmissing-declarations -Wmissing-prototypes -Wnested-externs -Wold-style-definition -Wpointer-arith -Wsign-compare -Wstrict-prototypes -Wundef -Wwrite-strings -Wno-address-of-packed-member -Wno-packed-not-aligned -Wno-missing-field-initializers -Wno-zero-length-bounds -D_GNU_SOURCE -march=native -DALLOW_EXPERIMENTAL_API -Wno-format-truncation -fno-strict-aliasing -DALLOW_INTERNAL_API -MD -MQ app/test/dpdk-test.p/test_trace_perf.c.o -MF app/test/dpdk-test.p/test_trace_perf.c.o.d -o app/test/dpdk-test.p/test_trace_perf.c.o -c ../app/test/test_trace_perf.c
In file included from ../app/test/test_trace_perf.c:12:
../app/test/test.h:193:16: fatal error: opening dependency file app/test/dpdk-test.p/test_trace_perf.c.o.d: No such file or directory
../app/test/test_trace_perf.c:182:1: note: in expansion of macro ‘REGISTER_TEST_COMMAND’
  182 | REGISTER_TEST_COMMAND(trace_perf_autotest, test_trace_perf);
      | ^~~~~~~~~~~~~~~~~~~~~
compilation terminated.
[3390/3394] Compiling C object app/test/dpdk-test.p/test_ring.c.o
FAILED: app/test/dpdk-test.p/test_ring.c.o 
gcc -Iapp/test/dpdk-test.p -Iapp/test -I../app/test -I. -I.. -Iconfig -I../config -Ilib/eal/include -I../lib/eal/include -Ilib/eal/linux/include -I../lib/eal/linux/include -Ilib/eal/x86/include -I../lib/eal/x86/include -Ilib/kvargs -I../lib/kvargs -Ilib/metrics -I../lib/metrics -Ilib/telemetry -I../lib/telemetry -Ilib/eal/common -I../lib/eal/common -Ilib/eal -I../lib/eal -Ilib/ring -I../lib/ring -Ilib/rcu -I../lib/rcu -Ilib/mempool -I../lib/mempool -Ilib/mbuf -I../lib/mbuf -Ilib/net -I../lib/net -Ilib/meter -I../lib/meter -Ilib/ethdev -I../lib/ethdev -Ilib/pci -I../lib/pci -Ilib/cmdline -I../lib/cmdline -Ilib/hash -I../lib/hash -Ilib/timer -I../lib/timer -Ilib/acl -I../lib/acl -Ilib/bbdev -I../lib/bbdev -Ilib/bitratestats -I../lib/bitratestats -Ilib/bpf -I../lib/bpf -Ilib/cfgfile -I../lib/cfgfile -Ilib/compressdev -I../lib/compressdev -Ilib/cryptodev -I../lib/cryptodev -Ilib/distributor -I../lib/distributor -Ilib/efd -I../lib/efd -Ilib/eventdev -I../lib/eventdev -Ilib/gpudev -I../lib/gpudev -Ilib/gro -I../lib/gro -Ilib/gso -I../lib/gso -Ilib/ip_frag -I../lib/ip_frag -Ilib/jobstats -I../lib/jobstats -Ilib/kni -I../lib/kni -Ilib/latencystats -I../lib/latencystats -Ilib/lpm -I../lib/lpm -Ilib/member -I../lib/member -Ilib/pcapng -I../lib/pcapng -Ilib/power -I../lib/power -Ilib/rawdev -I../lib/rawdev -Ilib/regexdev -I../lib/regexdev -Ilib/dmadev -I../lib/dmadev -Ilib/rib -I../lib/rib -Ilib/reorder -I../lib/reorder -Ilib/sched -I../lib/sched -Ilib/security -I../lib/security -Ilib/stack -I../lib/stack -Ilib/vhost -I../lib/vhost -Ilib/ipsec -I../lib/ipsec -Ilib/fib -I../lib/fib -Ilib/port -I../lib/port -Ilib/pdump -I../lib/pdump -Ilib/table -I../lib/table -Ilib/pipeline -I../lib/pipeline -Ilib/flow_classify -I../lib/flow_classify -Ilib/graph -I../lib/graph -Ilib/node -I../lib/node -Idrivers/bus/pci -I../drivers/bus/pci -I../drivers/bus/pci/linux -Idrivers/bus/vdev -I../drivers/bus/vdev -Idrivers/mempool/ring -I../drivers/mempool/ring -Idrivers/mempool/stack -I../drivers/mempool/stack -Idrivers/event/skeleton -I../drivers/event/skeleton -Idrivers/net/bonding -I../drivers/net/bonding -Idrivers/net/ring -I../drivers/net/ring -Idrivers/net/null -I../drivers/net/null -Idrivers/crypto/scheduler -I../drivers/crypto/scheduler -fdiagnostics-color=always -D_FILE_OFFSET_BITS=64 -Wall -Winvalid-pch -Wextra -Werror -O3 -include rte_config.h -Wcast-qual -Wdeprecated -Wformat -Wformat-nonliteral -Wformat-security -Wmissing-declarations -Wmissing-prototypes -Wnested-externs -Wold-style-definition -Wpointer-arith -Wsign-compare -Wstrict-prototypes -Wundef -Wwrite-strings -Wno-address-of-packed-member -Wno-packed-not-aligned -Wno-missing-field-initializers -Wno-zero-length-bounds -D_GNU_SOURCE -march=native -DALLOW_EXPERIMENTAL_API -Wno-format-truncation -fno-strict-aliasing -DALLOW_INTERNAL_API -MD -MQ app/test/dpdk-test.p/test_ring.c.o -MF app/test/dpdk-test.p/test_ring.c.o.d -o app/test/dpdk-test.p/test_ring.c.o -c ../app/test/test_ring.c
In file included from ../app/test/test_ring.c:31:
../app/test/test.h:193:16: fatal error: opening dependency file app/test/dpdk-test.p/test_ring.c.o.d: No such file or directory
../app/test/test_ring.c:1244:1: note: in expansion of macro ‘REGISTER_TEST_COMMAND’
 1244 | REGISTER_TEST_COMMAND(ring_autotest, test_ring);
      | ^~~~~~~~~~~~~~~~~~~~~
compilation terminated.
[3391/3394] Generating html_guides with a custom command
FAILED: doc/guides/html 
/usr/bin/python3 ../buildtools/call-sphinx-build.py /usr/bin/sphinx-build 22.07.0-rc1 /root/UB2004-64_K5.8.0_GCC10.3.0/x86_64-native-linuxapp-doc/20220623045513/dpdk/doc/guides /root/UB2004-64_K5.8.0_GCC10.3.0/x86_64-native-linuxapp-doc/20220623045513/dpdk/x86_64-native-linuxapp-doc/doc/guides -W

Application error:
config directory doesn't contain a conf.py file (/root/UB2004-64_K5.8.0_GCC10.3.0/x86_64-native-linuxapp-doc/20220623045513/dpdk/doc/guides)
Traceback (most recent call last):
  File "../buildtools/call-sphinx-build.py", line 36, in <module>
FileNotFoundError: [Errno 2] No such file or directory: '/root/UB2004-64_K5.8.0_GCC10.3.0/x86_64-native-linuxapp-doc/20220623045513/dpdk/x86_64-native-linuxapp-doc/doc/guides/.html.d'
[3392/3394] Generating doxygen with a custom command
FAILED: doc/api/html 
/usr/bin/python3 ../doc/api/generate_doxygen.py doc/api/html /usr/bin/doxygen doc/api/doxy-api.conf
error: Could not create output directory /root/UB2004-64_K5.8.0_GCC10.3.0/x86_64-native-linuxapp-doc/20220623045513/dpdk/x86_64-native-linuxapp-doc/doc/api/html
Traceback (most recent call last):
  File "../doc/api/generate_doxygen.py", line 13, in <module>
  File "/usr/lib/python3.8/subprocess.py", line 516, in run
    raise CalledProcessError(retcode, process.args,
subprocess.CalledProcessError: Command '['/usr/bin/doxygen', 'doc/api/doxy-api.conf']' returned non-zero exit status 1.
[3393/3394] Generating rte_kni with a custom command
FAILED: kernel/linux/kni/rte_kni.ko 
/usr/bin/make -j4 -C /lib/modules/5.8.0-48-generic/build M=/root/UB2004-64_K5.8.0_GCC10.3.0/x86_64-native-linuxapp-doc/20220623045513/dpdk/x86_64-native-linuxapp-doc/kernel/linux/kni src=/root/UB2004-64_K5.8.0_GCC10.3.0/x86_64-native-linuxapp-doc/20220623045513/dpdk/kernel/linux/kni 'MODULE_CFLAGS=  -include /root/UB2004-64_K5.8.0_GCC10.3.0/x86_64-native-linuxapp-doc/20220623045513/dpdk/config/rte_config.h -I/root/UB2004-64_K5.8.0_GCC10.3.0/x86_64-native-linuxapp-doc/20220623045513/dpdk/lib/eal/include -I/root/UB2004-64_K5.8.0_GCC10.3.0/x86_64-native-linuxapp-doc/20220623045513/dpdk/lib/kni -I/root/UB2004-64_K5.8.0_GCC10.3.0/x86_64-native-linuxapp-doc/20220623045513/dpdk/x86_64-native-linuxapp-doc -I/root/UB2004-64_K5.8.0_GCC10.3.0/x86_64-native-linuxapp-doc/20220623045513/dpdk/kernel/linux/kni' modules
make: Entering directory '/usr/src/linux-headers-5.8.0-48-generic'
scripts/Makefile.build:44: /root/UB2004-64_K5.8.0_GCC10.3.0/x86_64-native-linuxapp-doc/20220623045513/dpdk/kernel/linux/kni/Makefile: No such file or directory
make[1]: *** No rule to make target '/root/UB2004-64_K5.8.0_GCC10.3.0/x86_64-native-linuxapp-doc/20220623045513/dpdk/kernel/linux/kni/Makefile'.  Stop.
make: *** [Makefile:1783: /root/UB2004-64_K5.8.0_GCC10.3.0/x86_64-native-linuxapp-doc/20220623045513/dpdk/x86_64-native-linuxapp-doc/kernel/linux/kni] Error 2
make: Leaving directory '/usr/src/linux-headers-5.8.0-48-generic'
ninja: build stopped


DPDK STV team

             reply	other threads:[~2022-06-22 21:09 UTC|newest]

Thread overview: 41+ messages / expand[flat|nested]  mbox.gz  Atom feed  top
2022-06-22 21:09 sys_stv [this message]
  -- strict thread matches above, loose matches on Subject: below --
2022-06-09  9:08 sys_stv
2022-06-06  7:26 sys_stv
2022-06-06  2:06 sys_stv
2022-06-01 21:06 sys_stv
2022-06-01  1:57 sys_stv
2022-05-31 21:06 sys_stv
2022-05-30  8:26 sys_stv
2022-05-26  8:57 sys_stv
2022-05-20  5:13 sys_stv
2022-05-20  4:47 sys_stv
2022-05-18 21:07 sys_stv
2022-05-18 10:08 sys_stv
2022-05-17 21:07 sys_stv
2022-05-17  9:36 sys_stv
2022-05-17  9:15 sys_stv
2022-05-17  8:58 sys_stv
2022-05-16 21:06 sys_stv
2022-05-07  7:26 sys_stv
2022-05-06 21:06 sys_stv
2022-05-06  9:49 sys_stv
2022-05-06  9:32 sys_stv
2022-03-08 21:07 sys_stv
2022-03-08 17:16 sys_stv
2022-01-21  7:59 sys_stv
2022-01-21  7:55 sys_stv
2021-12-18 21:50 sys_stv
2021-10-22 22:14 sys_stv
2021-10-14  3:03 sys_stv
2021-08-15 22:10 sys_stv
2021-06-29 15:39 sys_stv
2021-05-27 22:08 sys_stv
2021-05-07  1:05 sys_stv
2021-03-22 22:07 sys_stv
2021-01-28 22:07 sys_stv
2021-01-27 22:07 sys_stv
2021-01-26 22:08 sys_stv
2021-01-26  6:13 sys_stv
2020-11-05 22:08 sys_stv
2020-11-03 22:07 sys_stv
2020-10-20  5:41 sys_stv

Reply instructions:

You may reply publicly to this message via plain-text email
using any one of the following methods:

* Save the following mbox file, import it into your mail client,
  and reply-to-all from there: mbox

  Avoid top-posting and favor interleaved quoting:
  https://en.wikipedia.org/wiki/Posting_style#Interleaved_style

* Reply using the --to, --cc, and --in-reply-to
  switches of git-send-email(1):

  git send-email \
    --in-reply-to='7f4525$j6hc2f@fmsmga008-auth.fm.intel.com' \
    --to=sys_stv@intel.com \
    --cc=dpdk_sw_eng@intel.com \
    --cc=npg.sw.core.tools.prc@intel.com \
    --cc=test-report@dpdk.org \
    --cc=thomas@monjalon.net \
    /path/to/YOUR_REPLY

  https://kernel.org/pub/software/scm/git/docs/git-send-email.html

* If your mail client supports setting the In-Reply-To header
  via mailto: links, try the mailto: link

automatic DPDK test reports

This inbox may be cloned and mirrored by anyone:

	git clone --mirror http://inbox.dpdk.org/test-report/0 test-report/git/0.git

	# If you have public-inbox 1.1+ installed, you may
	# initialize and index your mirror using the following commands:
	public-inbox-init -V2 test-report test-report/ http://inbox.dpdk.org/test-report \
		test-report@dpdk.org
	public-inbox-index test-report

Example config snippet for mirrors.
Newsgroup available over NNTP:
	nntp://inbox.dpdk.org/inbox.dpdk.test-report


AGPL code for this site: git clone https://public-inbox.org/public-inbox.git