automatic DPDK test reports
 help / color / mirror / Atom feed
From: sys_stv@intel.com
To: test-report@dpdk.org, thomas@monjalon.net
Cc: dpdk_sw_eng@intel.com, npg.sw.core.tools.prc@intel.com
Subject: [dpdk-test-report] |FAILURE| dpdk daily Intel builds
Date: 18 May 2022 14:07:25 -0700
Message-ID: <87f1b2$gvauii@orsmga007-auth.jf.intel.com> (raw)

[-- Attachment #1: Type: text/plain, Size: 7345 bytes --]


Test-Label: Intel-compilation
Test-Status: FAILURE
_Compilation issues_


commit 68c050954ff393b894aa3672a5ef1a231597dab0
Author: Shijith Thotton <sthotton@marvell.com>
Date:   Mon May 16 21:52:29 2022 +0530

    event/cnxk: flush event queues over multiple pass

DPDK git Repo: dpdk 


Meson Build Summary: 23 Builds Done, 22 Successful, 1 Failures, 0 Blocked

+--------------+------------+--------------+------------+------------+-----------+----------+------------+
| os           | gcc-static | clang-static | icc-static | gcc-shared | gcc-debug | document | gcc-16byte |
+--------------+------------+--------------+------------+------------+-----------+----------+------------+
| FC36-64      |            | pass         |            |            |           |          |            |
| FreeBSD13-64 | fail       | pass         |            | pass       | pass      |          |            |
| RHEL86-64    | pass       | pass         |            | pass       | pass      |          |            |
| SUSE15-64    | pass       | pass         |            |            |           |          |            |
| UB2004-32    | pass       |              |            |            |           |          |            |
| UB2004-64    | pass       | pass         |            |            |           | pass     |            |
| UB2204-32    | pass       |              |            |            |           |          |            |
| UB2204-64N   | pass       |              |            | pass       |           |          |            |
| UB2204-64    | pass       | pass         |            |            |           | pass     | pass       |
| CentOS79-64  | pass       |              |            |            |           |          |            |
+--------------+------------+--------------+------------+------------+-----------+----------+------------+

Comments: 
Because of DPDK bug (https://bugs.dpdk.org/show_bug.cgi?id=928),
All the dpdk-next-* branch add `Ddisable_drivers=event/cnxk` option when build with ICC complier. 
 
Test environment and configuration as below:


OS: FC36-64
	Kernel Version: 5.17.7-300.fc36.x86_64
	GCC Version: gcc (GCC) 12.1.1 20220507 (Red Hat 12.1.1-1)
	Clang Version: 14.0.0 (Fedora 14.0.0-1.fc36)
	x86_64-native-linuxapp-clang

OS: FreeBSD13-64
	Kernel Version: 13.1-RELEASE
	GCC Version: gcc (FreeBSD Ports Collection) 10.3.0
	Clang Version: 13.0.0 (git@github.com:llvm/llvm-project.git llvmorg-13.0.0-0-gd7b669b3a303)
	x86_64-native-bsdapp-gcc
	x86_64-native-bsdapp-clang
	x86_64-native-bsdapp-gcc+shared
	x86_64-native-bsdapp-gcc+debug

OS: RHEL86-64
	Kernel Version: 4.18.0-372.9.1.el8.x86_64
	GCC Version: gcc (GCC) 8.5.0 20210514 (Red Hat 8.5.0-13)
	Clang Version: 14.0.0 (Red Hat 14.0.0-1.module_el8.7.0+1142+5343df54)
	x86_64-native-linuxapp-gcc
	x86_64-native-linuxapp-clang
	x86_64-native-linuxapp-gcc+shared
	x86_64-native-linuxapp-gcc+debug

OS: SUSE15-64
	Kernel Version: 5.3.18-57-default
	GCC Version: gcc (SUSE Linux) 7.5.0
	Clang Version: 11.0.1
	x86_64-native-linuxapp-clang
	x86_64-native-linuxapp-gcc

OS: UB2004-32
	Kernel Version: 5.8.0-48-generic
	GCC Version: gcc (Ubuntu 10.3.0-1ubuntu1~20.04) 10.3.0
	Clang Version: 10.0.0-4ubuntu1
	i686-native-linuxapp-gcc

OS: UB2004-64
	Kernel Version: 5.8.0-48-generic
	GCC Version: gcc (Ubuntu 10.3.0-1ubuntu1~20.04) 10.3.0
	Clang Version: 10.0.0-4ubuntu1
	x86_64-native-linuxapp-clang
	x86_64-native-linuxapp-gcc
	x86_64-native-linuxapp-doc

OS: UB2204-32
	Kernel Version: 5.15.0-25-generic
	GCC Version: gcc (Ubuntu 11.2.0-19ubuntu1) 11.2.0
	Clang Version: NA
	i686-native-linuxapp-gcc

OS: UB2204-64N
	Kernel Version: 5.17.5-051705-generic
	GCC Version: gcc (Ubuntu 11.2.0-19ubuntu1) 11.2.0
	Clang Version: 14.0.0-1ubuntu1
	x86_64-native-linuxapp-gcc
	x86_64-native-linuxapp-gcc+shared

OS: UB2204-64
	Kernel Version: 5.15.0-25-generic
	GCC Version: gcc (Ubuntu 11.2.0-19ubuntu1) 11.2.0
	Clang Version: 14.0.0-1ubuntu1
	x86_64-native-linuxapp-gcc+16byte
	x86_64-native-linuxapp-gcc
	x86_64-native-linuxapp-clang
	x86_64-native-linuxapp-doc

OS: CentOS79-64
	Kernel Version: 3.10.0-1160.el7.x86_64
	GCC Version: gcc (GCC) 4.8.5 20150623 (Red Hat 4.8.5-44)
	Clang Version: 3.4.2 (tags/RELEASE_34/dot2-final)
	x86_64-native-linuxapp-gcc



*Build Failed #1:
OS: FreeBSD13-64
Target: x86_64-native-bsdapp-gcc
FAILED: kernel/freebsd/contigmem.ko 
/usr/bin/make -f ../kernel/freebsd/BSDmakefile.meson KMOD_OBJDIR=kernel/freebsd KMOD_SRC=../kernel/freebsd/contigmem/contigmem.c KMOD=contigmem 'KMOD_CFLAGS=-I/root/FreeBSD13-64_K13_GCC10.3.0/x86_64-native-bsdapp-gcc/20220519045516/dpdk/x86_64-native-bsdapp-gcc -I/root/FreeBSD13-64_K13_GCC10.3.0/x86_64-native-bsdapp-gcc/20220519045516/dpdk/config -include rte_config.h' CC=clang
machine -> /usr/src/sys/amd64/include
x86 -> /usr/src/sys/x86/include
awk -f /usr/src/sys/tools/makeobjops.awk /usr/src/sys/kern/device_if.m -h
awk -f /usr/src/sys/tools/makeobjops.awk /usr/src/sys/kern/bus_if.m -h
awk -f /usr/src/sys/tools/makeobjops.awk /usr/src/sys/dev/pci/pci_if.m -h
touch opt_global.h
clang  -O2 -pipe -include rte_config.h  -fno-strict-aliasing -Werror -D_KERNEL -DKLD_MODULE -nostdinc  -I/root/FreeBSD13-64_K13_GCC10.3.0/x86_64-native-bsdapp-gcc/20220519045516/dpdk/x86_64-native-bsdapp-gcc -I/root/FreeBSD13-64_K13_GCC10.3.0/x86_64-native-bsdapp-gcc/20220519045516/dpdk/config -include /root/FreeBSD13-64_K13_GCC10.3.0/x86_64-native-bsdapp-gcc/20220519045516/dpdk/x86_64-native-bsdapp-gcc/kernel/freebsd/opt_global.h -I. -I/usr/src/sys -I/usr/src/sys/contrib/ck/include -fno-common  -fno-omit-frame-pointer -mno-omit-leaf-frame-pointer -fdebug-prefix-map=./machine=/usr/src/sys/amd64/include -fdebug-prefix-map=./x86=/usr/src/sys/x86/include     -MD  -MF.depend.contigmem.o -MTcontigmem.o -mcmodel=kernel -mno-red-zone -mno-mmx -mno-sse -msoft-float  -fno-asynchronous-unwind-tables -ffreestanding -fwrapv -fstack-protector -Wall -Wredundant-decls -Wnested-externs -Wstrict-prototypes -Wmissing-prototypes -Wpointer-arith -Wcast-qual -Wundef -Wno-pointer-sign -D__printf__=__freebsd_kprintf__ -Wmissing-include-dirs -fdiagnostics-show-option -Wno-unknown-pragmas -Wno-error-tautological-compare -Wno-error-empty-body -Wno-error-parentheses-equality -Wno-error-unused-function -Wno-error-pointer-sign -Wno-error-shift-negative-value -Wno-address-of-packed-member -Wno-format-zero-length   -mno-aes -mno-avx  -std=iso9899:1999 -c /root/FreeBSD13-64_K13_GCC10.3.0/x86_64-native-bsdapp-gcc/20220519045516/dpdk/kernel/freebsd/contigmem/contigmem.c -o contigmem.o
error: unknown -Werror warning specifier: '-Wno-error-tautological-compare' [-Werror,-Wunknown-warning-option]
error: unknown -Werror warning specifier: '-Wno-error-empty-body' [-Werror,-Wunknown-warning-option]
error: unknown -Werror warning specifier: '-Wno-error-parentheses-equality' [-Werror,-Wunknown-warning-option]
error: unknown -Werror warning specifier: '-Wno-error-unused-function' [-Werror,-Wunknown-warning-option]
error: unknown -Werror warning specifier: '-Wno-error-pointer-sign' [-Werror,-Wunknown-warning-option]
error: unknown -Werror warning specifier: '-Wno-error-shift-negative-value' [-Werror,-Wunknown-warning-option]
*** Error code 1

Stop.
make: stopped in /root/FreeBSD13-64_K13_GCC10.3.0/x86_64-native-bsdapp-gcc/20220519045516/dpdk/x86_64-native-bsdapp-gcc
ninja: build stopped


DPDK STV team

             reply	other threads:[~2022-05-18 21:07 UTC|newest]

Thread overview: 41+ messages / expand[flat|nested]  mbox.gz  Atom feed  top
2022-05-18 21:07 sys_stv [this message]
  -- strict thread matches above, loose matches on Subject: below --
2022-06-22 21:09 sys_stv
2022-06-09  9:08 sys_stv
2022-06-06  7:26 sys_stv
2022-06-06  2:06 sys_stv
2022-06-01 21:06 sys_stv
2022-06-01  1:57 sys_stv
2022-05-31 21:06 sys_stv
2022-05-30  8:26 sys_stv
2022-05-26  8:57 sys_stv
2022-05-20  5:13 sys_stv
2022-05-20  4:47 sys_stv
2022-05-18 10:08 sys_stv
2022-05-17 21:07 sys_stv
2022-05-17  9:36 sys_stv
2022-05-17  9:15 sys_stv
2022-05-17  8:58 sys_stv
2022-05-16 21:06 sys_stv
2022-05-07  7:26 sys_stv
2022-05-06 21:06 sys_stv
2022-05-06  9:49 sys_stv
2022-05-06  9:32 sys_stv
2022-03-08 21:07 sys_stv
2022-03-08 17:16 sys_stv
2022-01-21  7:59 sys_stv
2022-01-21  7:55 sys_stv
2021-12-18 21:50 sys_stv
2021-10-22 22:14 sys_stv
2021-10-14  3:03 sys_stv
2021-08-15 22:10 sys_stv
2021-06-29 15:39 sys_stv
2021-05-27 22:08 sys_stv
2021-05-07  1:05 sys_stv
2021-03-22 22:07 sys_stv
2021-01-28 22:07 sys_stv
2021-01-27 22:07 sys_stv
2021-01-26 22:08 sys_stv
2021-01-26  6:13 sys_stv
2020-11-05 22:08 sys_stv
2020-11-03 22:07 sys_stv
2020-10-20  5:41 sys_stv

Reply instructions:

You may reply publicly to this message via plain-text email
using any one of the following methods:

* Save the following mbox file, import it into your mail client,
  and reply-to-all from there: mbox

  Avoid top-posting and favor interleaved quoting:
  https://en.wikipedia.org/wiki/Posting_style#Interleaved_style

* Reply using the --to, --cc, and --in-reply-to
  switches of git-send-email(1):

  git send-email \
    --in-reply-to='87f1b2$gvauii@orsmga007-auth.jf.intel.com' \
    --to=sys_stv@intel.com \
    --cc=dpdk_sw_eng@intel.com \
    --cc=npg.sw.core.tools.prc@intel.com \
    --cc=test-report@dpdk.org \
    --cc=thomas@monjalon.net \
    /path/to/YOUR_REPLY

  https://kernel.org/pub/software/scm/git/docs/git-send-email.html

* If your mail client supports setting the In-Reply-To header
  via mailto: links, try the mailto: link

automatic DPDK test reports

This inbox may be cloned and mirrored by anyone:

	git clone --mirror http://inbox.dpdk.org/test-report/0 test-report/git/0.git

	# If you have public-inbox 1.1+ installed, you may
	# initialize and index your mirror using the following commands:
	public-inbox-init -V2 test-report test-report/ http://inbox.dpdk.org/test-report \
		test-report@dpdk.org
	public-inbox-index test-report

Example config snippet for mirrors.
Newsgroup available over NNTP:
	nntp://inbox.dpdk.org/inbox.dpdk.test-report


AGPL code for this site: git clone https://public-inbox.org/public-inbox.git