automatic DPDK test reports
 help / color / mirror / Atom feed
From: sys_stv@intel.com
To: test-report@dpdk.org, thomas@monjalon.net
Cc: dpdk_sw_eng@intel.com, npg.sw.core.tools.prc@intel.com
Subject: [dpdk-test-report] |FAILURE| dpdk daily Intel builds
Date: 26 May 2022 01:57:00 -0700
Message-ID: <87f1b2$h36bt7@orsmga007-auth.jf.intel.com> (raw)

[-- Attachment #1: Type: text/plain, Size: 27798 bytes --]


Test-Label: Intel-compilation
Test-Status: FAILURE
_Compilation issues_


commit 64fcadeac0f70c8c9c215196a3d580b4ad37dcdc
Author: Thomas Monjalon <thomas@monjalon.net>
Date:   Tue May 3 14:03:21 2022 +0200

    avoid AltiVec keyword vector

DPDK git Repo: dpdk 


Meson Build Summary: 23 Builds Done, 22 Successful, 1 Failures, 0 Blocked

+--------------+------------+--------------+------------+------------+-----------+----------+------------+
| os           | gcc-static | clang-static | icc-static | gcc-shared | gcc-debug | document | gcc-16byte |
+--------------+------------+--------------+------------+------------+-----------+----------+------------+
| FC36-64      |            | pass         |            |            |           |          |            |
| FreeBSD13-64 | pass       | pass         |            | pass       | pass      |          |            |
| RHEL86-64    | pass       | pass         |            | pass       | pass      |          |            |
| SUSE15-64    | pass       | pass         |            |            |           |          |            |
| UB2004-32    | pass       |              |            |            |           |          |            |
| UB2004-64    | pass       | pass         |            |            |           | fail     |            |
| UB2204-32    | pass       |              |            |            |           |          |            |
| UB2204-64N   | pass       |              |            | pass       |           |          |            |
| UB2204-64    | pass       | pass         |            |            |           | pass     | pass       |
| CentOS79-64  | pass       |              |            |            |           |          |            |
+--------------+------------+--------------+------------+------------+-----------+----------+------------+

Comments: 
Because of DPDK bug (https://bugs.dpdk.org/show_bug.cgi?id=928),
All the dpdk-next-* branch add `Ddisable_drivers=event/cnxk` option when build with ICC complier. 
 
Test environment and configuration as below:


OS: FC36-64
	Kernel Version: 5.17.7-300.fc36.x86_64
	GCC Version: gcc (GCC) 12.1.1 20220507 (Red Hat 12.1.1-1)
	Clang Version: 14.0.0 (Fedora 14.0.0-1.fc36)
	x86_64-native-linuxapp-clang

OS: FreeBSD13-64
	Kernel Version: 13.0-RELEASE
	GCC Version: gcc (FreeBSD Ports Collection) 10.3.0
	Clang Version: 11.0.1 (git@github.com:llvm/llvm-project.git llvmorg-11.0.1-0-g43ff75f2c3fe)
	x86_64-native-bsdapp-gcc
	x86_64-native-bsdapp-clang
	x86_64-native-bsdapp-gcc+shared
	x86_64-native-bsdapp-gcc+debug

OS: RHEL86-64
	Kernel Version: 4.18.0-372.9.1.el8.x86_64
	GCC Version: gcc (GCC) 8.5.0 20210514 (Red Hat 8.5.0-13)
	Clang Version: 14.0.0 (Red Hat 14.0.0-1.module_el8.7.0+1142+5343df54)
	x86_64-native-linuxapp-gcc
	x86_64-native-linuxapp-clang
	x86_64-native-linuxapp-gcc+shared
	x86_64-native-linuxapp-gcc+debug

OS: SUSE15-64
	Kernel Version: 5.3.18-57-default
	GCC Version: gcc (SUSE Linux) 7.5.0
	Clang Version: 11.0.1
	x86_64-native-linuxapp-clang
	x86_64-native-linuxapp-gcc

OS: UB2004-32
	Kernel Version: 5.8.0-48-generic
	GCC Version: gcc (Ubuntu 10.3.0-1ubuntu1~20.04) 10.3.0
	Clang Version: 10.0.0-4ubuntu1
	i686-native-linuxapp-gcc

OS: UB2004-64
	Kernel Version: 5.8.0-48-generic
	GCC Version: gcc (Ubuntu 10.3.0-1ubuntu1~20.04) 10.3.0
	Clang Version: 10.0.0-4ubuntu1
	x86_64-native-linuxapp-clang
	x86_64-native-linuxapp-gcc
	x86_64-native-linuxapp-doc

OS: UB2204-32
	Kernel Version: 5.15.0-25-generic
	GCC Version: gcc (Ubuntu 11.2.0-19ubuntu1) 11.2.0
	Clang Version: NA
	i686-native-linuxapp-gcc

OS: UB2204-64N
	Kernel Version: 5.17.5-051705-generic
	GCC Version: gcc (Ubuntu 11.2.0-19ubuntu1) 11.2.0
	Clang Version: 14.0.0-1ubuntu1
	x86_64-native-linuxapp-gcc
	x86_64-native-linuxapp-gcc+shared

OS: UB2204-64
	Kernel Version: 5.15.0-25-generic
	GCC Version: gcc (Ubuntu 11.2.0-19ubuntu1) 11.2.0
	Clang Version: 14.0.0-1ubuntu1
	x86_64-native-linuxapp-gcc+16byte
	x86_64-native-linuxapp-gcc
	x86_64-native-linuxapp-clang
	x86_64-native-linuxapp-doc

OS: CentOS79-64
	Kernel Version: 3.10.0-1160.el7.x86_64
	GCC Version: gcc (GCC) 4.8.5 20150623 (Red Hat 4.8.5-44)
	Clang Version: 3.4.2 (tags/RELEASE_34/dot2-final)
	x86_64-native-linuxapp-gcc



*Build Failed #1:
OS: UB2004-64
Target: x86_64-native-linuxapp-doc
FAILED: drivers/libtmp_rte_event_cnxk.a.p/event_cnxk_deq_cn9k_deq_48_63_dual_seg_burst.c.o 
gcc -Idrivers/libtmp_rte_event_cnxk.a.p -Idrivers -I../drivers -Idrivers/event/cnxk -I../drivers/event/cnxk -Ilib/eventdev -I../lib/eventdev -I. -I.. -Iconfig -I../config -Ilib/eal/include -I../lib/eal/include -Ilib/eal/linux/include -I../lib/eal/linux/include -Ilib/eal/x86/include -I../lib/eal/x86/include -Ilib/eal/common -I../lib/eal/common -Ilib/eal -I../lib/eal -Ilib/kvargs -I../lib/kvargs -Ilib/metrics -I../lib/metrics -Ilib/telemetry -I../lib/telemetry -Ilib/ring -I../lib/ring -Ilib/ethdev -I../lib/ethdev -Ilib/net -I../lib/net -Ilib/mbuf -I../lib/mbuf -Ilib/mempool -I../lib/mempool -Ilib/meter -I../lib/meter -Ilib/hash -I../lib/hash -Ilib/rcu -I../lib/rcu -Ilib/timer -I../lib/timer -Ilib/cryptodev -I../lib/cryptodev -Idrivers/bus/pci -I../drivers/bus/pci -I../drivers/bus/pci/linux -Ilib/pci -I../lib/pci -Idrivers/common/cnxk -I../drivers/common/cnxk -Ilib/security -I../lib/security -Idrivers/net/cnxk -I../drivers/net/cnxk -Idrivers/bus/vdev -I../drivers/bus/vdev -Idrivers/mempool/cnxk -I../drivers/mempool/cnxk -Idrivers/crypto/cnxk -I../drivers/crypto/cnxk -fdiagnostics-color=always -D_FILE_OFFSET_BITS=64 -Wall -Winvalid-pch -Wextra -Werror -O3 -include rte_config.h -Wcast-qual -Wdeprecated -Wformat -Wformat-nonliteral -Wformat-security -Wmissing-declarations -Wmissing-prototypes -Wnested-externs -Wold-style-definition -Wpointer-arith -Wsign-compare -Wstrict-prototypes -Wundef -Wwrite-strings -Wno-address-of-packed-member -Wno-packed-not-aligned -Wno-missing-field-initializers -Wno-zero-length-bounds -D_GNU_SOURCE -fPIC -march=native -DALLOW_EXPERIMENTAL_API -DALLOW_INTERNAL_API -Wno-format-truncation -flax-vector-conversions -Wno-strict-aliasing -DRTE_LOG_DEFAULT_LOGTYPE=pmd.event.cnxk -MD -MQ drivers/libtmp_rte_event_cnxk.a.p/event_cnxk_deq_cn9k_deq_48_63_dual_seg_burst.c.o -MF drivers/libtmp_rte_event_cnxk.a.p/event_cnxk_deq_cn9k_deq_48_63_dual_seg_burst.c.o.d -o drivers/libtmp_rte_event_cnxk.a.p/event_cnxk_deq_cn9k_deq_48_63_dual_seg_burst.c.o -c ../drivers/event/cnxk/deq/cn9k/deq_48_63_dual_seg_burst.c
cc1: fatal error: ../drivers/event/cnxk/deq/cn9k/deq_48_63_dual_seg_burst.c: No such file or directory
compilation terminated.
[2649/3384] Compiling C object drivers/libtmp_rte_event_cnxk.a.p/event_cnxk_deq_cn9k_deq_80_95_ca_tmo_seg.c.o
[2650/3384] Compiling C object drivers/libtmp_rte_event_cnxk.a.p/event_cnxk_deq_cn9k_deq_64_79_dual_burst.c.o
[2651/3384] Compiling C object drivers/libtmp_rte_event_cnxk.a.p/event_cnxk_deq_cn9k_deq_0_15_dual_seg_burst.c.o
FAILED: drivers/libtmp_rte_event_cnxk.a.p/event_cnxk_deq_cn9k_deq_0_15_dual_seg_burst.c.o 
gcc -Idrivers/libtmp_rte_event_cnxk.a.p -Idrivers -I../drivers -Idrivers/event/cnxk -I../drivers/event/cnxk -Ilib/eventdev -I../lib/eventdev -I. -I.. -Iconfig -I../config -Ilib/eal/include -I../lib/eal/include -Ilib/eal/linux/include -I../lib/eal/linux/include -Ilib/eal/x86/include -I../lib/eal/x86/include -Ilib/eal/common -I../lib/eal/common -Ilib/eal -I../lib/eal -Ilib/kvargs -I../lib/kvargs -Ilib/metrics -I../lib/metrics -Ilib/telemetry -I../lib/telemetry -Ilib/ring -I../lib/ring -Ilib/ethdev -I../lib/ethdev -Ilib/net -I../lib/net -Ilib/mbuf -I../lib/mbuf -Ilib/mempool -I../lib/mempool -Ilib/meter -I../lib/meter -Ilib/hash -I../lib/hash -Ilib/rcu -I../lib/rcu -Ilib/timer -I../lib/timer -Ilib/cryptodev -I../lib/cryptodev -Idrivers/bus/pci -I../drivers/bus/pci -I../drivers/bus/pci/linux -Ilib/pci -I../lib/pci -Idrivers/common/cnxk -I../drivers/common/cnxk -Ilib/security -I../lib/security -Idrivers/net/cnxk -I../drivers/net/cnxk -Idrivers/bus/vdev -I../drivers/bus/vdev -Idrivers/mempool/cnxk -I../drivers/mempool/cnxk -Idrivers/crypto/cnxk -I../drivers/crypto/cnxk -fdiagnostics-color=always -D_FILE_OFFSET_BITS=64 -Wall -Winvalid-pch -Wextra -Werror -O3 -include rte_config.h -Wcast-qual -Wdeprecated -Wformat -Wformat-nonliteral -Wformat-security -Wmissing-declarations -Wmissing-prototypes -Wnested-externs -Wold-style-definition -Wpointer-arith -Wsign-compare -Wstrict-prototypes -Wundef -Wwrite-strings -Wno-address-of-packed-member -Wno-packed-not-aligned -Wno-missing-field-initializers -Wno-zero-length-bounds -D_GNU_SOURCE -fPIC -march=native -DALLOW_EXPERIMENTAL_API -DALLOW_INTERNAL_API -Wno-format-truncation -flax-vector-conversions -Wno-strict-aliasing -DRTE_LOG_DEFAULT_LOGTYPE=pmd.event.cnxk -MD -MQ drivers/libtmp_rte_event_cnxk.a.p/event_cnxk_deq_cn9k_deq_0_15_dual_seg_burst.c.o -MF drivers/libtmp_rte_event_cnxk.a.p/event_cnxk_deq_cn9k_deq_0_15_dual_seg_burst.c.o.d -o drivers/libtmp_rte_event_cnxk.a.p/event_cnxk_deq_cn9k_deq_0_15_dual_seg_burst.c.o -c ../drivers/event/cnxk/deq/cn9k/deq_0_15_dual_seg_burst.c
In file included from ../lib/ethdev/rte_ethdev.h:1494,
                 from ../lib/ethdev/ethdev_driver.h:22,
                 from ../drivers/net/cnxk/cnxk_ethdev.h:10,
                 from ../drivers/event/cnxk/cn9k_worker.h:11,
                 from ../drivers/event/cnxk/deq/cn9k/deq_0_15_dual_seg_burst.c:5:
../lib/ethdev/rte_eth_ctrl.h:12:10: fatal error: ../lib/ethdev/rte_ethdev.h: No such file or directory
compilation terminated.
[2652/3384] Compiling C object drivers/libtmp_rte_event_cnxk.a.p/event_cnxk_deq_cn9k_deq_96_111_dual_burst.c.o
FAILED: drivers/libtmp_rte_event_cnxk.a.p/event_cnxk_deq_cn9k_deq_96_111_dual_burst.c.o 
gcc -Idrivers/libtmp_rte_event_cnxk.a.p -Idrivers -I../drivers -Idrivers/event/cnxk -I../drivers/event/cnxk -Ilib/eventdev -I../lib/eventdev -I. -I.. -Iconfig -I../config -Ilib/eal/include -I../lib/eal/include -Ilib/eal/linux/include -I../lib/eal/linux/include -Ilib/eal/x86/include -I../lib/eal/x86/include -Ilib/eal/common -I../lib/eal/common -Ilib/eal -I../lib/eal -Ilib/kvargs -I../lib/kvargs -Ilib/metrics -I../lib/metrics -Ilib/telemetry -I../lib/telemetry -Ilib/ring -I../lib/ring -Ilib/ethdev -I../lib/ethdev -Ilib/net -I../lib/net -Ilib/mbuf -I../lib/mbuf -Ilib/mempool -I../lib/mempool -Ilib/meter -I../lib/meter -Ilib/hash -I../lib/hash -Ilib/rcu -I../lib/rcu -Ilib/timer -I../lib/timer -Ilib/cryptodev -I../lib/cryptodev -Idrivers/bus/pci -I../drivers/bus/pci -I../drivers/bus/pci/linux -Ilib/pci -I../lib/pci -Idrivers/common/cnxk -I../drivers/common/cnxk -Ilib/security -I../lib/security -Idrivers/net/cnxk -I../drivers/net/cnxk -Idrivers/bus/vdev -I../drivers/bus/vdev -Idrivers/mempool/cnxk -I../drivers/mempool/cnxk -Idrivers/crypto/cnxk -I../drivers/crypto/cnxk -fdiagnostics-color=always -D_FILE_OFFSET_BITS=64 -Wall -Winvalid-pch -Wextra -Werror -O3 -include rte_config.h -Wcast-qual -Wdeprecated -Wformat -Wformat-nonliteral -Wformat-security -Wmissing-declarations -Wmissing-prototypes -Wnested-externs -Wold-style-definition -Wpointer-arith -Wsign-compare -Wstrict-prototypes -Wundef -Wwrite-strings -Wno-address-of-packed-member -Wno-packed-not-aligned -Wno-missing-field-initializers -Wno-zero-length-bounds -D_GNU_SOURCE -fPIC -march=native -DALLOW_EXPERIMENTAL_API -DALLOW_INTERNAL_API -Wno-format-truncation -flax-vector-conversions -Wno-strict-aliasing -DRTE_LOG_DEFAULT_LOGTYPE=pmd.event.cnxk -MD -MQ drivers/libtmp_rte_event_cnxk.a.p/event_cnxk_deq_cn9k_deq_96_111_dual_burst.c.o -MF drivers/libtmp_rte_event_cnxk.a.p/event_cnxk_deq_cn9k_deq_96_111_dual_burst.c.o.d -o drivers/libtmp_rte_event_cnxk.a.p/event_cnxk_deq_cn9k_deq_96_111_dual_burst.c.o -c ../drivers/event/cnxk/deq/cn9k/deq_96_111_dual_burst.c
In file included from ../drivers/net/cnxk/cnxk_ethdev.h:11,
                 from ../drivers/event/cnxk/cn9k_worker.h:11,
                 from ../drivers/event/cnxk/deq/cn9k/deq_96_111_dual_burst.c:5:
../lib/ethdev/ethdev_pci.h:15:10: fatal error: rte_bus_pci.h: No such file or directory
compilation terminated.
[2653/3384] Compiling C object drivers/libtmp_rte_event_cnxk.a.p/event_cnxk_deq_cn9k_deq_16_31_dual_seg_burst.c.o
FAILED: drivers/libtmp_rte_event_cnxk.a.p/event_cnxk_deq_cn9k_deq_16_31_dual_seg_burst.c.o 
gcc -Idrivers/libtmp_rte_event_cnxk.a.p -Idrivers -I../drivers -Idrivers/event/cnxk -I../drivers/event/cnxk -Ilib/eventdev -I../lib/eventdev -I. -I.. -Iconfig -I../config -Ilib/eal/include -I../lib/eal/include -Ilib/eal/linux/include -I../lib/eal/linux/include -Ilib/eal/x86/include -I../lib/eal/x86/include -Ilib/eal/common -I../lib/eal/common -Ilib/eal -I../lib/eal -Ilib/kvargs -I../lib/kvargs -Ilib/metrics -I../lib/metrics -Ilib/telemetry -I../lib/telemetry -Ilib/ring -I../lib/ring -Ilib/ethdev -I../lib/ethdev -Ilib/net -I../lib/net -Ilib/mbuf -I../lib/mbuf -Ilib/mempool -I../lib/mempool -Ilib/meter -I../lib/meter -Ilib/hash -I../lib/hash -Ilib/rcu -I../lib/rcu -Ilib/timer -I../lib/timer -Ilib/cryptodev -I../lib/cryptodev -Idrivers/bus/pci -I../drivers/bus/pci -I../drivers/bus/pci/linux -Ilib/pci -I../lib/pci -Idrivers/common/cnxk -I../drivers/common/cnxk -Ilib/security -I../lib/security -Idrivers/net/cnxk -I../drivers/net/cnxk -Idrivers/bus/vdev -I../drivers/bus/vdev -Idrivers/mempool/cnxk -I../drivers/mempool/cnxk -Idrivers/crypto/cnxk -I../drivers/crypto/cnxk -fdiagnostics-color=always -D_FILE_OFFSET_BITS=64 -Wall -Winvalid-pch -Wextra -Werror -O3 -include rte_config.h -Wcast-qual -Wdeprecated -Wformat -Wformat-nonliteral -Wformat-security -Wmissing-declarations -Wmissing-prototypes -Wnested-externs -Wold-style-definition -Wpointer-arith -Wsign-compare -Wstrict-prototypes -Wundef -Wwrite-strings -Wno-address-of-packed-member -Wno-packed-not-aligned -Wno-missing-field-initializers -Wno-zero-length-bounds -D_GNU_SOURCE -fPIC -march=native -DALLOW_EXPERIMENTAL_API -DALLOW_INTERNAL_API -Wno-format-truncation -flax-vector-conversions -Wno-strict-aliasing -DRTE_LOG_DEFAULT_LOGTYPE=pmd.event.cnxk -MD -MQ drivers/libtmp_rte_event_cnxk.a.p/event_cnxk_deq_cn9k_deq_16_31_dual_seg_burst.c.o -MF drivers/libtmp_rte_event_cnxk.a.p/event_cnxk_deq_cn9k_deq_16_31_dual_seg_burst.c.o.d -o drivers/libtmp_rte_event_cnxk.a.p/event_cnxk_deq_cn9k_deq_16_31_dual_seg_burst.c.o -c ../drivers/event/cnxk/deq/cn9k/deq_16_31_dual_seg_burst.c
In file included from ../lib/eventdev/rte_eventdev.h:216,
                 from ../drivers/event/cnxk/cn9k_worker.h:8,
                 from ../drivers/event/cnxk/deq/cn9k/deq_16_31_dual_seg_burst.c:5:
../lib/mempool/rte_mempool.h:49:10: fatal error: rte_mempool_trace_fp.h: No such file or directory
compilation terminated.
[2654/3384] Compiling C object drivers/libtmp_rte_event_cnxk.a.p/event_cnxk_deq_cn9k_deq_64_79_ca_tmo_seg.c.o
FAILED: drivers/libtmp_rte_event_cnxk.a.p/event_cnxk_deq_cn9k_deq_64_79_ca_tmo_seg.c.o 
gcc -Idrivers/libtmp_rte_event_cnxk.a.p -Idrivers -I../drivers -Idrivers/event/cnxk -I../drivers/event/cnxk -Ilib/eventdev -I../lib/eventdev -I. -I.. -Iconfig -I../config -Ilib/eal/include -I../lib/eal/include -Ilib/eal/linux/include -I../lib/eal/linux/include -Ilib/eal/x86/include -I../lib/eal/x86/include -Ilib/eal/common -I../lib/eal/common -Ilib/eal -I../lib/eal -Ilib/kvargs -I../lib/kvargs -Ilib/metrics -I../lib/metrics -Ilib/telemetry -I../lib/telemetry -Ilib/ring -I../lib/ring -Ilib/ethdev -I../lib/ethdev -Ilib/net -I../lib/net -Ilib/mbuf -I../lib/mbuf -Ilib/mempool -I../lib/mempool -Ilib/meter -I../lib/meter -Ilib/hash -I../lib/hash -Ilib/rcu -I../lib/rcu -Ilib/timer -I../lib/timer -Ilib/cryptodev -I../lib/cryptodev -Idrivers/bus/pci -I../drivers/bus/pci -I../drivers/bus/pci/linux -Ilib/pci -I../lib/pci -Idrivers/common/cnxk -I../drivers/common/cnxk -Ilib/security -I../lib/security -Idrivers/net/cnxk -I../drivers/net/cnxk -Idrivers/bus/vdev -I../drivers/bus/vdev -Idrivers/mempool/cnxk -I../drivers/mempool/cnxk -Idrivers/crypto/cnxk -I../drivers/crypto/cnxk -fdiagnostics-color=always -D_FILE_OFFSET_BITS=64 -Wall -Winvalid-pch -Wextra -Werror -O3 -include rte_config.h -Wcast-qual -Wdeprecated -Wformat -Wformat-nonliteral -Wformat-security -Wmissing-declarations -Wmissing-prototypes -Wnested-externs -Wold-style-definition -Wpointer-arith -Wsign-compare -Wstrict-prototypes -Wundef -Wwrite-strings -Wno-address-of-packed-member -Wno-packed-not-aligned -Wno-missing-field-initializers -Wno-zero-length-bounds -D_GNU_SOURCE -fPIC -march=native -DALLOW_EXPERIMENTAL_API -DALLOW_INTERNAL_API -Wno-format-truncation -flax-vector-conversions -Wno-strict-aliasing -DRTE_LOG_DEFAULT_LOGTYPE=pmd.event.cnxk -MD -MQ drivers/libtmp_rte_event_cnxk.a.p/event_cnxk_deq_cn9k_deq_64_79_ca_tmo_seg.c.o -MF drivers/libtmp_rte_event_cnxk.a.p/event_cnxk_deq_cn9k_deq_64_79_ca_tmo_seg.c.o.d -o drivers/libtmp_rte_event_cnxk.a.p/event_cnxk_deq_cn9k_deq_64_79_ca_tmo_seg.c.o -c ../drivers/event/cnxk/deq/cn9k/deq_64_79_ca_tmo_seg.c
In file included from ../drivers/event/cnxk/deq/cn9k/deq_64_79_ca_tmo_seg.c:5:
../drivers/event/cnxk/cn9k_worker.h:439:10: fatal error: opening dependency file drivers/libtmp_rte_event_cnxk.a.p/event_cnxk_deq_cn9k_deq_64_79_ca_tmo_seg.c.o.d: No such file or directory
  439 |   struct cn9k_sso_hws *ws = port;                                \
      |          ^~~~~~~~~~~~
../drivers/event/cnxk/cn9k_worker.h:454:39: note: in expansion of macro ‘SSO_DEQ_TMO’
  454 | #define SSO_DEQ_TMO_SEG(fn, flags)    SSO_DEQ_TMO(fn, flags | NIX_RX_MULTI_SEG_F)
      |                                       ^~~~~~~~~~~
../drivers/event/cnxk/cn9k_worker.h:456:39: note: in expansion of macro ‘SSO_DEQ_TMO_SEG’
  456 | #define SSO_DEQ_TMO_CA_SEG(fn, flags) SSO_DEQ_TMO_SEG(fn, flags | CPT_RX_WQE_F)
      |                                       ^~~~~~~~~~~~~~~
../drivers/event/cnxk/deq/cn9k/deq_64_79_ca_tmo_seg.c:10:2: note: in expansion of macro ‘SSO_DEQ_TMO_CA_SEG’
../drivers/net/cnxk/cn9k_rx.h:981:2: note: in expansion of macro ‘R’
  981 |  R(sec_mark_cksum_ptype_rss,                                            \
      |  ^
../drivers/event/cnxk/deq/cn9k/deq_64_79_ca_tmo_seg.c:12:1: note: in expansion of macro ‘NIX_RX_FASTPATH_MODES_64_79’
compilation terminated.
[2655/3384] Compiling C object drivers/libtmp_rte_event_cnxk.a.p/event_cnxk_deq_cn9k_deq_32_47_dual_seg_burst.c.o
FAILED: drivers/libtmp_rte_event_cnxk.a.p/event_cnxk_deq_cn9k_deq_32_47_dual_seg_burst.c.o 
gcc -Idrivers/libtmp_rte_event_cnxk.a.p -Idrivers -I../drivers -Idrivers/event/cnxk -I../drivers/event/cnxk -Ilib/eventdev -I../lib/eventdev -I. -I.. -Iconfig -I../config -Ilib/eal/include -I../lib/eal/include -Ilib/eal/linux/include -I../lib/eal/linux/include -Ilib/eal/x86/include -I../lib/eal/x86/include -Ilib/eal/common -I../lib/eal/common -Ilib/eal -I../lib/eal -Ilib/kvargs -I../lib/kvargs -Ilib/metrics -I../lib/metrics -Ilib/telemetry -I../lib/telemetry -Ilib/ring -I../lib/ring -Ilib/ethdev -I../lib/ethdev -Ilib/net -I../lib/net -Ilib/mbuf -I../lib/mbuf -Ilib/mempool -I../lib/mempool -Ilib/meter -I../lib/meter -Ilib/hash -I../lib/hash -Ilib/rcu -I../lib/rcu -Ilib/timer -I../lib/timer -Ilib/cryptodev -I../lib/cryptodev -Idrivers/bus/pci -I../drivers/bus/pci -I../drivers/bus/pci/linux -Ilib/pci -I../lib/pci -Idrivers/common/cnxk -I../drivers/common/cnxk -Ilib/security -I../lib/security -Idrivers/net/cnxk -I../drivers/net/cnxk -Idrivers/bus/vdev -I../drivers/bus/vdev -Idrivers/mempool/cnxk -I../drivers/mempool/cnxk -Idrivers/crypto/cnxk -I../drivers/crypto/cnxk -fdiagnostics-color=always -D_FILE_OFFSET_BITS=64 -Wall -Winvalid-pch -Wextra -Werror -O3 -include rte_config.h -Wcast-qual -Wdeprecated -Wformat -Wformat-nonliteral -Wformat-security -Wmissing-declarations -Wmissing-prototypes -Wnested-externs -Wold-style-definition -Wpointer-arith -Wsign-compare -Wstrict-prototypes -Wundef -Wwrite-strings -Wno-address-of-packed-member -Wno-packed-not-aligned -Wno-missing-field-initializers -Wno-zero-length-bounds -D_GNU_SOURCE -fPIC -march=native -DALLOW_EXPERIMENTAL_API -DALLOW_INTERNAL_API -Wno-format-truncation -flax-vector-conversions -Wno-strict-aliasing -DRTE_LOG_DEFAULT_LOGTYPE=pmd.event.cnxk -MD -MQ drivers/libtmp_rte_event_cnxk.a.p/event_cnxk_deq_cn9k_deq_32_47_dual_seg_burst.c.o -MF drivers/libtmp_rte_event_cnxk.a.p/event_cnxk_deq_cn9k_deq_32_47_dual_seg_burst.c.o.d -o drivers/libtmp_rte_event_cnxk.a.p/event_cnxk_deq_cn9k_deq_32_47_dual_seg_burst.c.o -c ../drivers/event/cnxk/deq/cn9k/deq_32_47_dual_seg_burst.c
In file included from ../lib/eventdev/rte_eventdev.h:216,
                 from ../drivers/event/cnxk/cn9k_worker.h:8,
                 from ../drivers/event/cnxk/deq/cn9k/deq_32_47_dual_seg_burst.c:5:
../lib/mempool/rte_mempool.h:49:10: fatal error: rte_mempool_trace_fp.h: No such file or directory
compilation terminated.
[2656/3384] Compiling C object drivers/libtmp_rte_event_cnxk.a.p/event_cnxk_deq_cn9k_deq_112_127_ca_tmo_seg.c.o
FAILED: drivers/libtmp_rte_event_cnxk.a.p/event_cnxk_deq_cn9k_deq_112_127_ca_tmo_seg.c.o 
gcc -Idrivers/libtmp_rte_event_cnxk.a.p -Idrivers -I../drivers -Idrivers/event/cnxk -I../drivers/event/cnxk -Ilib/eventdev -I../lib/eventdev -I. -I.. -Iconfig -I../config -Ilib/eal/include -I../lib/eal/include -Ilib/eal/linux/include -I../lib/eal/linux/include -Ilib/eal/x86/include -I../lib/eal/x86/include -Ilib/eal/common -I../lib/eal/common -Ilib/eal -I../lib/eal -Ilib/kvargs -I../lib/kvargs -Ilib/metrics -I../lib/metrics -Ilib/telemetry -I../lib/telemetry -Ilib/ring -I../lib/ring -Ilib/ethdev -I../lib/ethdev -Ilib/net -I../lib/net -Ilib/mbuf -I../lib/mbuf -Ilib/mempool -I../lib/mempool -Ilib/meter -I../lib/meter -Ilib/hash -I../lib/hash -Ilib/rcu -I../lib/rcu -Ilib/timer -I../lib/timer -Ilib/cryptodev -I../lib/cryptodev -Idrivers/bus/pci -I../drivers/bus/pci -I../drivers/bus/pci/linux -Ilib/pci -I../lib/pci -Idrivers/common/cnxk -I../drivers/common/cnxk -Ilib/security -I../lib/security -Idrivers/net/cnxk -I../drivers/net/cnxk -Idrivers/bus/vdev -I../drivers/bus/vdev -Idrivers/mempool/cnxk -I../drivers/mempool/cnxk -Idrivers/crypto/cnxk -I../drivers/crypto/cnxk -fdiagnostics-color=always -D_FILE_OFFSET_BITS=64 -Wall -Winvalid-pch -Wextra -Werror -O3 -include rte_config.h -Wcast-qual -Wdeprecated -Wformat -Wformat-nonliteral -Wformat-security -Wmissing-declarations -Wmissing-prototypes -Wnested-externs -Wold-style-definition -Wpointer-arith -Wsign-compare -Wstrict-prototypes -Wundef -Wwrite-strings -Wno-address-of-packed-member -Wno-packed-not-aligned -Wno-missing-field-initializers -Wno-zero-length-bounds -D_GNU_SOURCE -fPIC -march=native -DALLOW_EXPERIMENTAL_API -DALLOW_INTERNAL_API -Wno-format-truncation -flax-vector-conversions -Wno-strict-aliasing -DRTE_LOG_DEFAULT_LOGTYPE=pmd.event.cnxk -MD -MQ drivers/libtmp_rte_event_cnxk.a.p/event_cnxk_deq_cn9k_deq_112_127_ca_tmo_seg.c.o -MF drivers/libtmp_rte_event_cnxk.a.p/event_cnxk_deq_cn9k_deq_112_127_ca_tmo_seg.c.o.d -o drivers/libtmp_rte_event_cnxk.a.p/event_cnxk_deq_cn9k_deq_112_127_ca_tmo_seg.c.o -c ../drivers/event/cnxk/deq/cn9k/deq_112_127_ca_tmo_seg.c
In file included from ../drivers/event/cnxk/deq/cn9k/deq_112_127_ca_tmo_seg.c:5:
../drivers/event/cnxk/cn9k_worker.h:439:10: fatal error: opening dependency file drivers/libtmp_rte_event_cnxk.a.p/event_cnxk_deq_cn9k_deq_112_127_ca_tmo_seg.c.o.d: No such file or directory
  439 |   struct cn9k_sso_hws *ws = port;                                \
      |          ^~~~~~~~~~~~
../drivers/event/cnxk/cn9k_worker.h:454:39: note: in expansion of macro ‘SSO_DEQ_TMO’
  454 | #define SSO_DEQ_TMO_SEG(fn, flags)    SSO_DEQ_TMO(fn, flags | NIX_RX_MULTI_SEG_F)
      |                                       ^~~~~~~~~~~
../drivers/event/cnxk/cn9k_worker.h:456:39: note: in expansion of macro ‘SSO_DEQ_TMO_SEG’
  456 | #define SSO_DEQ_TMO_CA_SEG(fn, flags) SSO_DEQ_TMO_SEG(fn, flags | CPT_RX_WQE_F)
      |                                       ^~~~~~~~~~~~~~~
../drivers/event/cnxk/deq/cn9k/deq_112_127_ca_tmo_seg.c:10:2: note: in expansion of macro ‘SSO_DEQ_TMO_CA_SEG’
../drivers/net/cnxk/cn9k_rx.h:1050:2: note: in expansion of macro ‘R’
 1050 |  R(sec_vlan_ts_mark_cksum_ptype_rss,                                    \
      |  ^
../drivers/event/cnxk/deq/cn9k/deq_112_127_ca_tmo_seg.c:12:1: note: in expansion of macro ‘NIX_RX_FASTPATH_MODES_112_127’
compilation terminated.
[2657/3384] Compiling C object drivers/libtmp_rte_event_cnxk.a.p/event_cnxk_deq_cn9k_deq_96_111_ca_tmo_seg.c.o
FAILED: drivers/libtmp_rte_event_cnxk.a.p/event_cnxk_deq_cn9k_deq_96_111_ca_tmo_seg.c.o 
gcc -Idrivers/libtmp_rte_event_cnxk.a.p -Idrivers -I../drivers -Idrivers/event/cnxk -I../drivers/event/cnxk -Ilib/eventdev -I../lib/eventdev -I. -I.. -Iconfig -I../config -Ilib/eal/include -I../lib/eal/include -Ilib/eal/linux/include -I../lib/eal/linux/include -Ilib/eal/x86/include -I../lib/eal/x86/include -Ilib/eal/common -I../lib/eal/common -Ilib/eal -I../lib/eal -Ilib/kvargs -I../lib/kvargs -Ilib/metrics -I../lib/metrics -Ilib/telemetry -I../lib/telemetry -Ilib/ring -I../lib/ring -Ilib/ethdev -I../lib/ethdev -Ilib/net -I../lib/net -Ilib/mbuf -I../lib/mbuf -Ilib/mempool -I../lib/mempool -Ilib/meter -I../lib/meter -Ilib/hash -I../lib/hash -Ilib/rcu -I../lib/rcu -Ilib/timer -I../lib/timer -Ilib/cryptodev -I../lib/cryptodev -Idrivers/bus/pci -I../drivers/bus/pci -I../drivers/bus/pci/linux -Ilib/pci -I../lib/pci -Idrivers/common/cnxk -I../drivers/common/cnxk -Ilib/security -I../lib/security -Idrivers/net/cnxk -I../drivers/net/cnxk -Idrivers/bus/vdev -I../drivers/bus/vdev -Idrivers/mempool/cnxk -I../drivers/mempool/cnxk -Idrivers/crypto/cnxk -I../drivers/crypto/cnxk -fdiagnostics-color=always -D_FILE_OFFSET_BITS=64 -Wall -Winvalid-pch -Wextra -Werror -O3 -include rte_config.h -Wcast-qual -Wdeprecated -Wformat -Wformat-nonliteral -Wformat-security -Wmissing-declarations -Wmissing-prototypes -Wnested-externs -Wold-style-definition -Wpointer-arith -Wsign-compare -Wstrict-prototypes -Wundef -Wwrite-strings -Wno-address-of-packed-member -Wno-packed-not-aligned -Wno-missing-field-initializers -Wno-zero-length-bounds -D_GNU_SOURCE -fPIC -march=native -DALLOW_EXPERIMENTAL_API -DALLOW_INTERNAL_API -Wno-format-truncation -flax-vector-conversions -Wno-strict-aliasing -DRTE_LOG_DEFAULT_LOGTYPE=pmd.event.cnxk -MD -MQ drivers/libtmp_rte_event_cnxk.a.p/event_cnxk_deq_cn9k_deq_96_111_ca_tmo_seg.c.o -MF drivers/libtmp_rte_event_cnxk.a.p/event_cnxk_deq_cn9k_deq_96_111_ca_tmo_seg.c.o.d -o drivers/libtmp_rte_event_cnxk.a.p/event_cnxk_deq_cn9k_deq_96_111_ca_tmo_seg.c.o -c ../drivers/event/cnxk/deq/cn9k/deq_96_111_ca_tmo_seg.c
In file included from ../drivers/event/cnxk/deq/cn9k/deq_96_111_ca_tmo_seg.c:5:
../drivers/event/cnxk/cn9k_worker.h:439:10: fatal error: opening dependency file drivers/libtmp_rte_event_cnxk.a.p/event_cnxk_deq_cn9k_deq_96_111_ca_tmo_seg.c.o.d: No such file or directory
  439 |   struct cn9k_sso_hws *ws = port;                                \
      |          ^~~~~~~~~~~~
../drivers/event/cnxk/cn9k_worker.h:454:39: note: in expansion of macro ‘SSO_DEQ_TMO’
  454 | #define SSO_DEQ_TMO_SEG(fn, flags)    SSO_DEQ_TMO(fn, flags | NIX_RX_MULTI_SEG_F)
      |                                       ^~~~~~~~~~~
../drivers/event/cnxk/cn9k_worker.h:456:39: note: in expansion of macro ‘SSO_DEQ_TMO_SEG’
  456 | #define SSO_DEQ_TMO_CA_SEG(fn, flags) SSO_DEQ_TMO_SEG(fn, flags | CPT_RX_WQE_F)
      |                                       ^~~~~~~~~~~~~~~
../drivers/event/cnxk/deq/cn9k/deq_96_111_ca_tmo_seg.c:10:2: note: in expansion of macro ‘SSO_DEQ_TMO_CA_SEG’
../drivers/net/cnxk/cn9k_rx.h:1024:2: note: in expansion of macro ‘R’
 1024 |  R(sec_vlan_mark_cksum_ptype_rss,                                       \
      |  ^
../drivers/event/cnxk/deq/cn9k/deq_96_111_ca_tmo_seg.c:12:1: note: in expansion of macro ‘NIX_RX_FASTPATH_MODES_96_111’
compilation terminated.
ninja: build stopped


DPDK STV team

             reply	other threads:[~2022-05-26  8:57 UTC|newest]

Thread overview: 41+ messages / expand[flat|nested]  mbox.gz  Atom feed  top
2022-05-26  8:57 sys_stv [this message]
  -- strict thread matches above, loose matches on Subject: below --
2022-06-22 21:09 sys_stv
2022-06-09  9:08 sys_stv
2022-06-06  7:26 sys_stv
2022-06-06  2:06 sys_stv
2022-06-01 21:06 sys_stv
2022-06-01  1:57 sys_stv
2022-05-31 21:06 sys_stv
2022-05-30  8:26 sys_stv
2022-05-20  5:13 sys_stv
2022-05-20  4:47 sys_stv
2022-05-18 21:07 sys_stv
2022-05-18 10:08 sys_stv
2022-05-17 21:07 sys_stv
2022-05-17  9:36 sys_stv
2022-05-17  9:15 sys_stv
2022-05-17  8:58 sys_stv
2022-05-16 21:06 sys_stv
2022-05-07  7:26 sys_stv
2022-05-06 21:06 sys_stv
2022-05-06  9:49 sys_stv
2022-05-06  9:32 sys_stv
2022-03-08 21:07 sys_stv
2022-03-08 17:16 sys_stv
2022-01-21  7:59 sys_stv
2022-01-21  7:55 sys_stv
2021-12-18 21:50 sys_stv
2021-10-22 22:14 sys_stv
2021-10-14  3:03 sys_stv
2021-08-15 22:10 sys_stv
2021-06-29 15:39 sys_stv
2021-05-27 22:08 sys_stv
2021-05-07  1:05 sys_stv
2021-03-22 22:07 sys_stv
2021-01-28 22:07 sys_stv
2021-01-27 22:07 sys_stv
2021-01-26 22:08 sys_stv
2021-01-26  6:13 sys_stv
2020-11-05 22:08 sys_stv
2020-11-03 22:07 sys_stv
2020-10-20  5:41 sys_stv

Reply instructions:

You may reply publicly to this message via plain-text email
using any one of the following methods:

* Save the following mbox file, import it into your mail client,
  and reply-to-all from there: mbox

  Avoid top-posting and favor interleaved quoting:
  https://en.wikipedia.org/wiki/Posting_style#Interleaved_style

* Reply using the --to, --cc, and --in-reply-to
  switches of git-send-email(1):

  git send-email \
    --in-reply-to='87f1b2$h36bt7@orsmga007-auth.jf.intel.com' \
    --to=sys_stv@intel.com \
    --cc=dpdk_sw_eng@intel.com \
    --cc=npg.sw.core.tools.prc@intel.com \
    --cc=test-report@dpdk.org \
    --cc=thomas@monjalon.net \
    /path/to/YOUR_REPLY

  https://kernel.org/pub/software/scm/git/docs/git-send-email.html

* If your mail client supports setting the In-Reply-To header
  via mailto: links, try the mailto: link

automatic DPDK test reports

This inbox may be cloned and mirrored by anyone:

	git clone --mirror http://inbox.dpdk.org/test-report/0 test-report/git/0.git

	# If you have public-inbox 1.1+ installed, you may
	# initialize and index your mirror using the following commands:
	public-inbox-init -V2 test-report test-report/ http://inbox.dpdk.org/test-report \
		test-report@dpdk.org
	public-inbox-index test-report

Example config snippet for mirrors.
Newsgroup available over NNTP:
	nntp://inbox.dpdk.org/inbox.dpdk.test-report


AGPL code for this site: git clone https://public-inbox.org/public-inbox.git