automatic DPDK test reports
 help / color / mirror / Atom feed
From: sys_stv@intel.com
To: test-report@dpdk.org, thomas@monjalon.net
Cc: dpdk_sw_eng@intel.com, npg.sw.core.tools.prc@intel.com
Subject: [dpdk-test-report] |FAILURE| dpdk daily Intel builds
Date: 09 Jun 2022 02:08:06 -0700
Message-ID: <8b0460$ib859v@orsmga001-auth.jf.intel.com> (raw)

[-- Attachment #1: Type: text/plain, Size: 26508 bytes --]


Test-Label: Intel-compilation
Test-Status: FAILURE
_Compilation issues_


commit 1ab4156e7d57858fca1db448ac7a0792e1d527b6
Author: Thomas Monjalon <thomas@monjalon.net>
Date:   Wed Jun 8 21:43:41 2022 +0200

    version: 22.07-rc1

DPDK git Repo: dpdk 


Meson Build Summary: 23 Builds Done, 22 Successful, 1 Failures, 0 Blocked

+--------------+------------+--------------+------------+------------+-----------+----------+------------+
| os           | gcc-static | clang-static | icc-static | gcc-shared | gcc-debug | document | gcc-16byte |
+--------------+------------+--------------+------------+------------+-----------+----------+------------+
| FC36-64      |            | pass         |            |            |           |          |            |
| FreeBSD13-64 | pass       | pass         |            | pass       | pass      |          |            |
| RHEL86-64    | pass       | pass         |            | pass       | pass      |          |            |
| SUSE15-64    | pass       | pass         |            |            |           |          |            |
| UB2004-32    | pass       |              |            |            |           |          |            |
| UB2004-64    | pass       | pass         |            |            |           | fail     |            |
| UB2204-32    | pass       |              |            |            |           |          |            |
| UB2204-64N   | pass       |              |            | pass       |           |          |            |
| UB2204-64    | pass       | pass         |            |            |           | pass     | pass       |
| CentOS79-64  | pass       |              |            |            |           |          |            |
+--------------+------------+--------------+------------+------------+-----------+----------+------------+

Comments: 
Because of DPDK bug (https://bugs.dpdk.org/show_bug.cgi?id=928),
All the dpdk-next-* branch add `Ddisable_drivers=event/cnxk` option when build with ICC complier. 
 
Test environment and configuration as below:


OS: FC36-64
	Kernel Version: 5.17.7-300.fc36.x86_64
	GCC Version: gcc (GCC) 12.1.1 20220507 (Red Hat 12.1.1-1)
	Clang Version: 14.0.0 (Fedora 14.0.0-1.fc36)
	x86_64-native-linuxapp-clang

OS: FreeBSD13-64
	Kernel Version: 13.1-RELEASE
	GCC Version: gcc (FreeBSD Ports Collection) 10.3.0
	Clang Version: 13.0.0 (git@github.com:llvm/llvm-project.git llvmorg-13.0.0-0-gd7b669b3a303)
	x86_64-native-bsdapp-gcc
	x86_64-native-bsdapp-clang
	x86_64-native-bsdapp-gcc+shared
	x86_64-native-bsdapp-gcc+debug

OS: RHEL86-64
	Kernel Version: 4.18.0-372.9.1.el8.x86_64
	GCC Version: gcc (GCC) 8.5.0 20210514 (Red Hat 8.5.0-13)
	Clang Version: 14.0.0 (Red Hat 14.0.0-1.module_el8.7.0+1142+5343df54)
	x86_64-native-linuxapp-gcc
	x86_64-native-linuxapp-clang
	x86_64-native-linuxapp-gcc+shared
	x86_64-native-linuxapp-gcc+debug

OS: SUSE15-64
	Kernel Version: 5.3.18-57-default
	GCC Version: gcc (SUSE Linux) 7.5.0
	Clang Version: 11.0.1
	x86_64-native-linuxapp-clang
	x86_64-native-linuxapp-gcc

OS: UB2004-32
	Kernel Version: 5.8.0-48-generic
	GCC Version: gcc (Ubuntu 10.3.0-1ubuntu1~20.04) 10.3.0
	Clang Version: 10.0.0-4ubuntu1
	i686-native-linuxapp-gcc

OS: UB2004-64
	Kernel Version: 5.8.0-48-generic
	GCC Version: gcc (Ubuntu 10.3.0-1ubuntu1~20.04) 10.3.0
	Clang Version: 10.0.0-4ubuntu1
	x86_64-native-linuxapp-clang
	x86_64-native-linuxapp-gcc
	x86_64-native-linuxapp-doc

OS: UB2204-32
	Kernel Version: 5.15.0-25-generic
	GCC Version: gcc (Ubuntu 11.2.0-19ubuntu1) 11.2.0
	Clang Version: NA
	i686-native-linuxapp-gcc

OS: UB2204-64N
	Kernel Version: 5.17.5-051705-generic
	GCC Version: gcc (Ubuntu 11.2.0-19ubuntu1) 11.2.0
	Clang Version: 14.0.0-1ubuntu1
	x86_64-native-linuxapp-gcc
	x86_64-native-linuxapp-gcc+shared

OS: UB2204-64
	Kernel Version: 5.15.0-25-generic
	GCC Version: gcc (Ubuntu 11.2.0-19ubuntu1) 11.2.0
	Clang Version: 14.0.0-1ubuntu1
	x86_64-native-linuxapp-gcc+16byte
	x86_64-native-linuxapp-gcc
	x86_64-native-linuxapp-clang
	x86_64-native-linuxapp-doc

OS: CentOS79-64
	Kernel Version: 3.10.0-1160.el7.x86_64
	GCC Version: gcc (GCC) 4.8.5 20150623 (Red Hat 4.8.5-44)
	Clang Version: 3.4.2 (tags/RELEASE_34/dot2-final)
	x86_64-native-linuxapp-gcc



*Build Failed #1:
OS: UB2004-64
Target: x86_64-native-linuxapp-doc
FAILED: drivers/libtmp_rte_net_cnxk.a.p/net_cnxk_rx_cn9k_rx_112_127.c.o 
gcc -Idrivers/libtmp_rte_net_cnxk.a.p -Idrivers -I../drivers -Idrivers/net/cnxk -I../drivers/net/cnxk -Ilib/ethdev -I../lib/ethdev -I. -I.. -Iconfig -I../config -Ilib/eal/include -I../lib/eal/include -Ilib/eal/linux/include -I../lib/eal/linux/include -Ilib/eal/x86/include -I../lib/eal/x86/include -Ilib/eal/common -I../lib/eal/common -Ilib/eal -I../lib/eal -Ilib/kvargs -I../lib/kvargs -Ilib/metrics -I../lib/metrics -Ilib/telemetry -I../lib/telemetry -Ilib/net -I../lib/net -Ilib/mbuf -I../lib/mbuf -Ilib/mempool -I../lib/mempool -Ilib/ring -I../lib/ring -Ilib/meter -I../lib/meter -Idrivers/bus/pci -I../drivers/bus/pci -I../drivers/bus/pci/linux -Ilib/pci -I../lib/pci -Idrivers/bus/vdev -I../drivers/bus/vdev -Ilib/cryptodev -I../lib/cryptodev -Ilib/rcu -I../lib/rcu -Ilib/eventdev -I../lib/eventdev -Ilib/hash -I../lib/hash -Ilib/timer -I../lib/timer -Ilib/security -I../lib/security -Idrivers/common/cnxk -I../drivers/common/cnxk -Idrivers/mempool/cnxk -I../drivers/mempool/cnxk -fdiagnostics-color=always -D_FILE_OFFSET_BITS=64 -Wall -Winvalid-pch -Wextra -Werror -O3 -include rte_config.h -Wcast-qual -Wdeprecated -Wformat -Wformat-nonliteral -Wformat-security -Wmissing-declarations -Wmissing-prototypes -Wnested-externs -Wold-style-definition -Wpointer-arith -Wsign-compare -Wstrict-prototypes -Wundef -Wwrite-strings -Wno-address-of-packed-member -Wno-packed-not-aligned -Wno-missing-field-initializers -Wno-zero-length-bounds -D_GNU_SOURCE -fPIC -march=native -DALLOW_EXPERIMENTAL_API -DALLOW_INTERNAL_API -Wno-format-truncation -flax-vector-conversions -Wno-strict-aliasing -DRTE_LOG_DEFAULT_LOGTYPE=pmd.net.cnxk -MD -MQ drivers/libtmp_rte_net_cnxk.a.p/net_cnxk_rx_cn9k_rx_112_127.c.o -MF drivers/libtmp_rte_net_cnxk.a.p/net_cnxk_rx_cn9k_rx_112_127.c.o.d -o drivers/libtmp_rte_net_cnxk.a.p/net_cnxk_rx_cn9k_rx_112_127.c.o -c ../drivers/net/cnxk/rx/cn9k/rx_112_127.c
In file included from ../drivers/net/cnxk/cnxk_ethdev.h:23,
                 from ../drivers/net/cnxk/cn9k_ethdev.h:7,
                 from ../drivers/net/cnxk/rx/cn9k/rx_112_127.c:5:
../drivers/common/cnxk/roc_api.h:38:10: fatal error: hw/npa.h: No such file or directory
compilation terminated.
[1297/3392] Compiling C object drivers/libtmp_rte_net_cnxk.a.p/net_cnxk_rx_cn9k_rx_16_31.c.o
[1298/3392] Compiling C object drivers/libtmp_rte_net_cnxk.a.p/net_cnxk_tx_cn9k_tx_0_15.c.o
FAILED: drivers/libtmp_rte_net_cnxk.a.p/net_cnxk_tx_cn9k_tx_0_15.c.o 
gcc -Idrivers/libtmp_rte_net_cnxk.a.p -Idrivers -I../drivers -Idrivers/net/cnxk -I../drivers/net/cnxk -Ilib/ethdev -I../lib/ethdev -I. -I.. -Iconfig -I../config -Ilib/eal/include -I../lib/eal/include -Ilib/eal/linux/include -I../lib/eal/linux/include -Ilib/eal/x86/include -I../lib/eal/x86/include -Ilib/eal/common -I../lib/eal/common -Ilib/eal -I../lib/eal -Ilib/kvargs -I../lib/kvargs -Ilib/metrics -I../lib/metrics -Ilib/telemetry -I../lib/telemetry -Ilib/net -I../lib/net -Ilib/mbuf -I../lib/mbuf -Ilib/mempool -I../lib/mempool -Ilib/ring -I../lib/ring -Ilib/meter -I../lib/meter -Idrivers/bus/pci -I../drivers/bus/pci -I../drivers/bus/pci/linux -Ilib/pci -I../lib/pci -Idrivers/bus/vdev -I../drivers/bus/vdev -Ilib/cryptodev -I../lib/cryptodev -Ilib/rcu -I../lib/rcu -Ilib/eventdev -I../lib/eventdev -Ilib/hash -I../lib/hash -Ilib/timer -I../lib/timer -Ilib/security -I../lib/security -Idrivers/common/cnxk -I../drivers/common/cnxk -Idrivers/mempool/cnxk -I../drivers/mempool/cnxk -fdiagnostics-color=always -D_FILE_OFFSET_BITS=64 -Wall -Winvalid-pch -Wextra -Werror -O3 -include rte_config.h -Wcast-qual -Wdeprecated -Wformat -Wformat-nonliteral -Wformat-security -Wmissing-declarations -Wmissing-prototypes -Wnested-externs -Wold-style-definition -Wpointer-arith -Wsign-compare -Wstrict-prototypes -Wundef -Wwrite-strings -Wno-address-of-packed-member -Wno-packed-not-aligned -Wno-missing-field-initializers -Wno-zero-length-bounds -D_GNU_SOURCE -fPIC -march=native -DALLOW_EXPERIMENTAL_API -DALLOW_INTERNAL_API -Wno-format-truncation -flax-vector-conversions -Wno-strict-aliasing -DRTE_LOG_DEFAULT_LOGTYPE=pmd.net.cnxk -MD -MQ drivers/libtmp_rte_net_cnxk.a.p/net_cnxk_tx_cn9k_tx_0_15.c.o -MF drivers/libtmp_rte_net_cnxk.a.p/net_cnxk_tx_cn9k_tx_0_15.c.o.d -o drivers/libtmp_rte_net_cnxk.a.p/net_cnxk_tx_cn9k_tx_0_15.c.o -c ../drivers/net/cnxk/tx/cn9k/tx_0_15.c
In file included from ../lib/mempool/rte_mempool.h:49,
                 from ../lib/mbuf/rte_mbuf.h:38,
                 from ../lib/net/rte_ether.h:22,
                 from ../lib/ethdev/rte_ethdev.h:172,
                 from ../lib/ethdev/ethdev_driver.h:22,
                 from ../drivers/net/cnxk/cnxk_ethdev.h:10,
                 from ../drivers/net/cnxk/cn9k_ethdev.h:7,
                 from ../drivers/net/cnxk/tx/cn9k/tx_0_15.c:5:
../lib/mempool/rte_mempool_trace_fp.h:18:10: fatal error: rte_trace_point.h: No such file or directory
   18 | #include <rte_trace_point.h>
      |          ^~~~~~~~~~~~~~~~~~~
compilation terminated.
[1299/3392] Generating rte_net_bond.sym_chk with a custom command (wrapped by meson to capture output)
FAILED: drivers/rte_net_bond.sym_chk 
/usr/local/bin/meson --internal exe --capture drivers/rte_net_bond.sym_chk -- /root/UB2004-64_K5.8.0_GCC10.3.0/x86_64-native-linuxapp-doc/20220609165521/dpdk/buildtools/check-symbols.sh /root/UB2004-64_K5.8.0_GCC10.3.0/x86_64-native-linuxapp-doc/20220609165521/dpdk/drivers/net/bonding/version.map drivers/librte_net_bond.a
--- stderr ---
/root/UB2004-64_K5.8.0_GCC10.3.0/x86_64-native-linuxapp-doc/20220609165521/dpdk/buildtools/check-symbols.sh: 29: /root/UB2004-64_K5.8.0_GCC10.3.0/x86_64-native-linuxapp-doc/20220609165521/dpdk/devtools/check-symbol-maps.sh: not found

[1300/3392] Compiling C object drivers/libtmp_rte_net_cnxk.a.p/net_cnxk_rx_cn9k_rx_48_63.c.o
FAILED: drivers/libtmp_rte_net_cnxk.a.p/net_cnxk_rx_cn9k_rx_48_63.c.o 
gcc -Idrivers/libtmp_rte_net_cnxk.a.p -Idrivers -I../drivers -Idrivers/net/cnxk -I../drivers/net/cnxk -Ilib/ethdev -I../lib/ethdev -I. -I.. -Iconfig -I../config -Ilib/eal/include -I../lib/eal/include -Ilib/eal/linux/include -I../lib/eal/linux/include -Ilib/eal/x86/include -I../lib/eal/x86/include -Ilib/eal/common -I../lib/eal/common -Ilib/eal -I../lib/eal -Ilib/kvargs -I../lib/kvargs -Ilib/metrics -I../lib/metrics -Ilib/telemetry -I../lib/telemetry -Ilib/net -I../lib/net -Ilib/mbuf -I../lib/mbuf -Ilib/mempool -I../lib/mempool -Ilib/ring -I../lib/ring -Ilib/meter -I../lib/meter -Idrivers/bus/pci -I../drivers/bus/pci -I../drivers/bus/pci/linux -Ilib/pci -I../lib/pci -Idrivers/bus/vdev -I../drivers/bus/vdev -Ilib/cryptodev -I../lib/cryptodev -Ilib/rcu -I../lib/rcu -Ilib/eventdev -I../lib/eventdev -Ilib/hash -I../lib/hash -Ilib/timer -I../lib/timer -Ilib/security -I../lib/security -Idrivers/common/cnxk -I../drivers/common/cnxk -Idrivers/mempool/cnxk -I../drivers/mempool/cnxk -fdiagnostics-color=always -D_FILE_OFFSET_BITS=64 -Wall -Winvalid-pch -Wextra -Werror -O3 -include rte_config.h -Wcast-qual -Wdeprecated -Wformat -Wformat-nonliteral -Wformat-security -Wmissing-declarations -Wmissing-prototypes -Wnested-externs -Wold-style-definition -Wpointer-arith -Wsign-compare -Wstrict-prototypes -Wundef -Wwrite-strings -Wno-address-of-packed-member -Wno-packed-not-aligned -Wno-missing-field-initializers -Wno-zero-length-bounds -D_GNU_SOURCE -fPIC -march=native -DALLOW_EXPERIMENTAL_API -DALLOW_INTERNAL_API -Wno-format-truncation -flax-vector-conversions -Wno-strict-aliasing -DRTE_LOG_DEFAULT_LOGTYPE=pmd.net.cnxk -MD -MQ drivers/libtmp_rte_net_cnxk.a.p/net_cnxk_rx_cn9k_rx_48_63.c.o -MF drivers/libtmp_rte_net_cnxk.a.p/net_cnxk_rx_cn9k_rx_48_63.c.o.d -o drivers/libtmp_rte_net_cnxk.a.p/net_cnxk_rx_cn9k_rx_48_63.c.o -c ../drivers/net/cnxk/rx/cn9k/rx_48_63.c
In file included from ../drivers/net/cnxk/rx/cn9k/rx_48_63.c:6:
../drivers/net/cnxk/cn9k_rx.h:1078:26: fatal error: opening dependency file drivers/libtmp_rte_net_cnxk.a.p/net_cnxk_rx_cn9k_rx_48_63.c.o.d: No such file or directory
 1078 |   void *rx_queue, struct rte_mbuf **rx_pkts, uint16_t pkts)      \
      |                          ^~~~~~~~
../drivers/net/cnxk/rx/cn9k/rx_48_63.c:8:24: note: in expansion of macro ‘NIX_RX_RECV’
../drivers/net/cnxk/cn9k_rx.h:962:2: note: in expansion of macro ‘R’
  962 |  R(vlan_ts_mark_cksum_ptype_rss,                                        \
      |  ^
../drivers/net/cnxk/rx/cn9k/rx_48_63.c:10:1: note: in expansion of macro ‘NIX_RX_FASTPATH_MODES_48_63’
compilation terminated.
[1301/3392] Compiling C object drivers/libtmp_rte_net_cnxk.a.p/net_cnxk_rx_cn9k_rx_32_47.c.o
FAILED: drivers/libtmp_rte_net_cnxk.a.p/net_cnxk_rx_cn9k_rx_32_47.c.o 
gcc -Idrivers/libtmp_rte_net_cnxk.a.p -Idrivers -I../drivers -Idrivers/net/cnxk -I../drivers/net/cnxk -Ilib/ethdev -I../lib/ethdev -I. -I.. -Iconfig -I../config -Ilib/eal/include -I../lib/eal/include -Ilib/eal/linux/include -I../lib/eal/linux/include -Ilib/eal/x86/include -I../lib/eal/x86/include -Ilib/eal/common -I../lib/eal/common -Ilib/eal -I../lib/eal -Ilib/kvargs -I../lib/kvargs -Ilib/metrics -I../lib/metrics -Ilib/telemetry -I../lib/telemetry -Ilib/net -I../lib/net -Ilib/mbuf -I../lib/mbuf -Ilib/mempool -I../lib/mempool -Ilib/ring -I../lib/ring -Ilib/meter -I../lib/meter -Idrivers/bus/pci -I../drivers/bus/pci -I../drivers/bus/pci/linux -Ilib/pci -I../lib/pci -Idrivers/bus/vdev -I../drivers/bus/vdev -Ilib/cryptodev -I../lib/cryptodev -Ilib/rcu -I../lib/rcu -Ilib/eventdev -I../lib/eventdev -Ilib/hash -I../lib/hash -Ilib/timer -I../lib/timer -Ilib/security -I../lib/security -Idrivers/common/cnxk -I../drivers/common/cnxk -Idrivers/mempool/cnxk -I../drivers/mempool/cnxk -fdiagnostics-color=always -D_FILE_OFFSET_BITS=64 -Wall -Winvalid-pch -Wextra -Werror -O3 -include rte_config.h -Wcast-qual -Wdeprecated -Wformat -Wformat-nonliteral -Wformat-security -Wmissing-declarations -Wmissing-prototypes -Wnested-externs -Wold-style-definition -Wpointer-arith -Wsign-compare -Wstrict-prototypes -Wundef -Wwrite-strings -Wno-address-of-packed-member -Wno-packed-not-aligned -Wno-missing-field-initializers -Wno-zero-length-bounds -D_GNU_SOURCE -fPIC -march=native -DALLOW_EXPERIMENTAL_API -DALLOW_INTERNAL_API -Wno-format-truncation -flax-vector-conversions -Wno-strict-aliasing -DRTE_LOG_DEFAULT_LOGTYPE=pmd.net.cnxk -MD -MQ drivers/libtmp_rte_net_cnxk.a.p/net_cnxk_rx_cn9k_rx_32_47.c.o -MF drivers/libtmp_rte_net_cnxk.a.p/net_cnxk_rx_cn9k_rx_32_47.c.o.d -o drivers/libtmp_rte_net_cnxk.a.p/net_cnxk_rx_cn9k_rx_32_47.c.o -c ../drivers/net/cnxk/rx/cn9k/rx_32_47.c
In file included from ../drivers/net/cnxk/rx/cn9k/rx_32_47.c:6:
../drivers/net/cnxk/cn9k_rx.h:1078:26: fatal error: opening dependency file drivers/libtmp_rte_net_cnxk.a.p/net_cnxk_rx_cn9k_rx_32_47.c.o.d: No such file or directory
 1078 |   void *rx_queue, struct rte_mbuf **rx_pkts, uint16_t pkts)      \
      |                          ^~~~~~~~
../drivers/net/cnxk/rx/cn9k/rx_32_47.c:8:24: note: in expansion of macro ‘NIX_RX_RECV’
../drivers/net/cnxk/cn9k_rx.h:941:2: note: in expansion of macro ‘R’
  941 |  R(vlan_mark_cksum_ptype_rss,                                           \
      |  ^
../drivers/net/cnxk/rx/cn9k/rx_32_47.c:10:1: note: in expansion of macro ‘NIX_RX_FASTPATH_MODES_32_47’
compilation terminated.
[1302/3392] Compiling C object drivers/libtmp_rte_net_cnxk.a.p/net_cnxk_rx_cn9k_rx_0_15_mseg.c.o
FAILED: drivers/libtmp_rte_net_cnxk.a.p/net_cnxk_rx_cn9k_rx_0_15_mseg.c.o 
gcc -Idrivers/libtmp_rte_net_cnxk.a.p -Idrivers -I../drivers -Idrivers/net/cnxk -I../drivers/net/cnxk -Ilib/ethdev -I../lib/ethdev -I. -I.. -Iconfig -I../config -Ilib/eal/include -I../lib/eal/include -Ilib/eal/linux/include -I../lib/eal/linux/include -Ilib/eal/x86/include -I../lib/eal/x86/include -Ilib/eal/common -I../lib/eal/common -Ilib/eal -I../lib/eal -Ilib/kvargs -I../lib/kvargs -Ilib/metrics -I../lib/metrics -Ilib/telemetry -I../lib/telemetry -Ilib/net -I../lib/net -Ilib/mbuf -I../lib/mbuf -Ilib/mempool -I../lib/mempool -Ilib/ring -I../lib/ring -Ilib/meter -I../lib/meter -Idrivers/bus/pci -I../drivers/bus/pci -I../drivers/bus/pci/linux -Ilib/pci -I../lib/pci -Idrivers/bus/vdev -I../drivers/bus/vdev -Ilib/cryptodev -I../lib/cryptodev -Ilib/rcu -I../lib/rcu -Ilib/eventdev -I../lib/eventdev -Ilib/hash -I../lib/hash -Ilib/timer -I../lib/timer -Ilib/security -I../lib/security -Idrivers/common/cnxk -I../drivers/common/cnxk -Idrivers/mempool/cnxk -I../drivers/mempool/cnxk -fdiagnostics-color=always -D_FILE_OFFSET_BITS=64 -Wall -Winvalid-pch -Wextra -Werror -O3 -include rte_config.h -Wcast-qual -Wdeprecated -Wformat -Wformat-nonliteral -Wformat-security -Wmissing-declarations -Wmissing-prototypes -Wnested-externs -Wold-style-definition -Wpointer-arith -Wsign-compare -Wstrict-prototypes -Wundef -Wwrite-strings -Wno-address-of-packed-member -Wno-packed-not-aligned -Wno-missing-field-initializers -Wno-zero-length-bounds -D_GNU_SOURCE -fPIC -march=native -DALLOW_EXPERIMENTAL_API -DALLOW_INTERNAL_API -Wno-format-truncation -flax-vector-conversions -Wno-strict-aliasing -DRTE_LOG_DEFAULT_LOGTYPE=pmd.net.cnxk -MD -MQ drivers/libtmp_rte_net_cnxk.a.p/net_cnxk_rx_cn9k_rx_0_15_mseg.c.o -MF drivers/libtmp_rte_net_cnxk.a.p/net_cnxk_rx_cn9k_rx_0_15_mseg.c.o.d -o drivers/libtmp_rte_net_cnxk.a.p/net_cnxk_rx_cn9k_rx_0_15_mseg.c.o -c ../drivers/net/cnxk/rx/cn9k/rx_0_15_mseg.c
In file included from ../lib/mbuf/rte_mbuf.h:38,
                 from ../lib/net/rte_ether.h:22,
                 from ../lib/ethdev/rte_ethdev.h:172,
                 from ../lib/ethdev/ethdev_driver.h:22,
                 from ../drivers/net/cnxk/cnxk_ethdev.h:10,
                 from ../drivers/net/cnxk/cn9k_ethdev.h:7,
                 from ../drivers/net/cnxk/rx/cn9k/rx_0_15_mseg.c:5:
../lib/mempool/rte_mempool.h:49:10: fatal error: rte_mempool_trace_fp.h: No such file or directory
compilation terminated.
[1303/3392] Compiling C object drivers/libtmp_rte_net_cnxk.a.p/net_cnxk_rx_cn9k_rx_64_79.c.o
FAILED: drivers/libtmp_rte_net_cnxk.a.p/net_cnxk_rx_cn9k_rx_64_79.c.o 
gcc -Idrivers/libtmp_rte_net_cnxk.a.p -Idrivers -I../drivers -Idrivers/net/cnxk -I../drivers/net/cnxk -Ilib/ethdev -I../lib/ethdev -I. -I.. -Iconfig -I../config -Ilib/eal/include -I../lib/eal/include -Ilib/eal/linux/include -I../lib/eal/linux/include -Ilib/eal/x86/include -I../lib/eal/x86/include -Ilib/eal/common -I../lib/eal/common -Ilib/eal -I../lib/eal -Ilib/kvargs -I../lib/kvargs -Ilib/metrics -I../lib/metrics -Ilib/telemetry -I../lib/telemetry -Ilib/net -I../lib/net -Ilib/mbuf -I../lib/mbuf -Ilib/mempool -I../lib/mempool -Ilib/ring -I../lib/ring -Ilib/meter -I../lib/meter -Idrivers/bus/pci -I../drivers/bus/pci -I../drivers/bus/pci/linux -Ilib/pci -I../lib/pci -Idrivers/bus/vdev -I../drivers/bus/vdev -Ilib/cryptodev -I../lib/cryptodev -Ilib/rcu -I../lib/rcu -Ilib/eventdev -I../lib/eventdev -Ilib/hash -I../lib/hash -Ilib/timer -I../lib/timer -Ilib/security -I../lib/security -Idrivers/common/cnxk -I../drivers/common/cnxk -Idrivers/mempool/cnxk -I../drivers/mempool/cnxk -fdiagnostics-color=always -D_FILE_OFFSET_BITS=64 -Wall -Winvalid-pch -Wextra -Werror -O3 -include rte_config.h -Wcast-qual -Wdeprecated -Wformat -Wformat-nonliteral -Wformat-security -Wmissing-declarations -Wmissing-prototypes -Wnested-externs -Wold-style-definition -Wpointer-arith -Wsign-compare -Wstrict-prototypes -Wundef -Wwrite-strings -Wno-address-of-packed-member -Wno-packed-not-aligned -Wno-missing-field-initializers -Wno-zero-length-bounds -D_GNU_SOURCE -fPIC -march=native -DALLOW_EXPERIMENTAL_API -DALLOW_INTERNAL_API -Wno-format-truncation -flax-vector-conversions -Wno-strict-aliasing -DRTE_LOG_DEFAULT_LOGTYPE=pmd.net.cnxk -MD -MQ drivers/libtmp_rte_net_cnxk.a.p/net_cnxk_rx_cn9k_rx_64_79.c.o -MF drivers/libtmp_rte_net_cnxk.a.p/net_cnxk_rx_cn9k_rx_64_79.c.o.d -o drivers/libtmp_rte_net_cnxk.a.p/net_cnxk_rx_cn9k_rx_64_79.c.o -c ../drivers/net/cnxk/rx/cn9k/rx_64_79.c
In file included from ../drivers/net/cnxk/rx/cn9k/rx_64_79.c:6:
../drivers/net/cnxk/cn9k_rx.h:1078:26: fatal error: opening dependency file drivers/libtmp_rte_net_cnxk.a.p/net_cnxk_rx_cn9k_rx_64_79.c.o.d: No such file or directory
 1078 |   void *rx_queue, struct rte_mbuf **rx_pkts, uint16_t pkts)      \
      |                          ^~~~~~~~
../drivers/net/cnxk/rx/cn9k/rx_64_79.c:8:24: note: in expansion of macro ‘NIX_RX_RECV’
../drivers/net/cnxk/cn9k_rx.h:981:2: note: in expansion of macro ‘R’
  981 |  R(sec_mark_cksum_ptype_rss,                                            \
      |  ^
../drivers/net/cnxk/rx/cn9k/rx_64_79.c:10:1: note: in expansion of macro ‘NIX_RX_FASTPATH_MODES_64_79’
compilation terminated.
[1304/3392] Compiling C object drivers/libtmp_rte_net_cnxk.a.p/net_cnxk_rx_cn9k_rx_80_95.c.o
FAILED: drivers/libtmp_rte_net_cnxk.a.p/net_cnxk_rx_cn9k_rx_80_95.c.o 
gcc -Idrivers/libtmp_rte_net_cnxk.a.p -Idrivers -I../drivers -Idrivers/net/cnxk -I../drivers/net/cnxk -Ilib/ethdev -I../lib/ethdev -I. -I.. -Iconfig -I../config -Ilib/eal/include -I../lib/eal/include -Ilib/eal/linux/include -I../lib/eal/linux/include -Ilib/eal/x86/include -I../lib/eal/x86/include -Ilib/eal/common -I../lib/eal/common -Ilib/eal -I../lib/eal -Ilib/kvargs -I../lib/kvargs -Ilib/metrics -I../lib/metrics -Ilib/telemetry -I../lib/telemetry -Ilib/net -I../lib/net -Ilib/mbuf -I../lib/mbuf -Ilib/mempool -I../lib/mempool -Ilib/ring -I../lib/ring -Ilib/meter -I../lib/meter -Idrivers/bus/pci -I../drivers/bus/pci -I../drivers/bus/pci/linux -Ilib/pci -I../lib/pci -Idrivers/bus/vdev -I../drivers/bus/vdev -Ilib/cryptodev -I../lib/cryptodev -Ilib/rcu -I../lib/rcu -Ilib/eventdev -I../lib/eventdev -Ilib/hash -I../lib/hash -Ilib/timer -I../lib/timer -Ilib/security -I../lib/security -Idrivers/common/cnxk -I../drivers/common/cnxk -Idrivers/mempool/cnxk -I../drivers/mempool/cnxk -fdiagnostics-color=always -D_FILE_OFFSET_BITS=64 -Wall -Winvalid-pch -Wextra -Werror -O3 -include rte_config.h -Wcast-qual -Wdeprecated -Wformat -Wformat-nonliteral -Wformat-security -Wmissing-declarations -Wmissing-prototypes -Wnested-externs -Wold-style-definition -Wpointer-arith -Wsign-compare -Wstrict-prototypes -Wundef -Wwrite-strings -Wno-address-of-packed-member -Wno-packed-not-aligned -Wno-missing-field-initializers -Wno-zero-length-bounds -D_GNU_SOURCE -fPIC -march=native -DALLOW_EXPERIMENTAL_API -DALLOW_INTERNAL_API -Wno-format-truncation -flax-vector-conversions -Wno-strict-aliasing -DRTE_LOG_DEFAULT_LOGTYPE=pmd.net.cnxk -MD -MQ drivers/libtmp_rte_net_cnxk.a.p/net_cnxk_rx_cn9k_rx_80_95.c.o -MF drivers/libtmp_rte_net_cnxk.a.p/net_cnxk_rx_cn9k_rx_80_95.c.o.d -o drivers/libtmp_rte_net_cnxk.a.p/net_cnxk_rx_cn9k_rx_80_95.c.o -c ../drivers/net/cnxk/rx/cn9k/rx_80_95.c
In file included from ../drivers/net/cnxk/rx/cn9k/rx_80_95.c:6:
../drivers/net/cnxk/cn9k_rx.h:1078:26: fatal error: opening dependency file drivers/libtmp_rte_net_cnxk.a.p/net_cnxk_rx_cn9k_rx_80_95.c.o.d: No such file or directory
 1078 |   void *rx_queue, struct rte_mbuf **rx_pkts, uint16_t pkts)      \
      |                          ^~~~~~~~
../drivers/net/cnxk/rx/cn9k/rx_80_95.c:8:24: note: in expansion of macro ‘NIX_RX_RECV’
../drivers/net/cnxk/cn9k_rx.h:1001:2: note: in expansion of macro ‘R’
 1001 |  R(sec_ts_mark_cksum_ptype_rss,                                         \
      |  ^
../drivers/net/cnxk/rx/cn9k/rx_80_95.c:10:1: note: in expansion of macro ‘NIX_RX_FASTPATH_MODES_80_95’
compilation terminated.
[1305/3392] Compiling C object drivers/libtmp_rte_net_cnxk.a.p/net_cnxk_rx_cn9k_rx_96_111.c.o
FAILED: drivers/libtmp_rte_net_cnxk.a.p/net_cnxk_rx_cn9k_rx_96_111.c.o 
gcc -Idrivers/libtmp_rte_net_cnxk.a.p -Idrivers -I../drivers -Idrivers/net/cnxk -I../drivers/net/cnxk -Ilib/ethdev -I../lib/ethdev -I. -I.. -Iconfig -I../config -Ilib/eal/include -I../lib/eal/include -Ilib/eal/linux/include -I../lib/eal/linux/include -Ilib/eal/x86/include -I../lib/eal/x86/include -Ilib/eal/common -I../lib/eal/common -Ilib/eal -I../lib/eal -Ilib/kvargs -I../lib/kvargs -Ilib/metrics -I../lib/metrics -Ilib/telemetry -I../lib/telemetry -Ilib/net -I../lib/net -Ilib/mbuf -I../lib/mbuf -Ilib/mempool -I../lib/mempool -Ilib/ring -I../lib/ring -Ilib/meter -I../lib/meter -Idrivers/bus/pci -I../drivers/bus/pci -I../drivers/bus/pci/linux -Ilib/pci -I../lib/pci -Idrivers/bus/vdev -I../drivers/bus/vdev -Ilib/cryptodev -I../lib/cryptodev -Ilib/rcu -I../lib/rcu -Ilib/eventdev -I../lib/eventdev -Ilib/hash -I../lib/hash -Ilib/timer -I../lib/timer -Ilib/security -I../lib/security -Idrivers/common/cnxk -I../drivers/common/cnxk -Idrivers/mempool/cnxk -I../drivers/mempool/cnxk -fdiagnostics-color=always -D_FILE_OFFSET_BITS=64 -Wall -Winvalid-pch -Wextra -Werror -O3 -include rte_config.h -Wcast-qual -Wdeprecated -Wformat -Wformat-nonliteral -Wformat-security -Wmissing-declarations -Wmissing-prototypes -Wnested-externs -Wold-style-definition -Wpointer-arith -Wsign-compare -Wstrict-prototypes -Wundef -Wwrite-strings -Wno-address-of-packed-member -Wno-packed-not-aligned -Wno-missing-field-initializers -Wno-zero-length-bounds -D_GNU_SOURCE -fPIC -march=native -DALLOW_EXPERIMENTAL_API -DALLOW_INTERNAL_API -Wno-format-truncation -flax-vector-conversions -Wno-strict-aliasing -DRTE_LOG_DEFAULT_LOGTYPE=pmd.net.cnxk -MD -MQ drivers/libtmp_rte_net_cnxk.a.p/net_cnxk_rx_cn9k_rx_96_111.c.o -MF drivers/libtmp_rte_net_cnxk.a.p/net_cnxk_rx_cn9k_rx_96_111.c.o.d -o drivers/libtmp_rte_net_cnxk.a.p/net_cnxk_rx_cn9k_rx_96_111.c.o -c ../drivers/net/cnxk/rx/cn9k/rx_96_111.c
In file included from ../drivers/net/cnxk/rx/cn9k/rx_96_111.c:6:
../drivers/net/cnxk/cn9k_rx.h:1078:26: fatal error: opening dependency file drivers/libtmp_rte_net_cnxk.a.p/net_cnxk_rx_cn9k_rx_96_111.c.o.d: No such file or directory
 1078 |   void *rx_queue, struct rte_mbuf **rx_pkts, uint16_t pkts)      \
      |                          ^~~~~~~~
../drivers/net/cnxk/rx/cn9k/rx_96_111.c:8:24: note: in expansion of macro ‘NIX_RX_RECV’
../drivers/net/cnxk/cn9k_rx.h:1024:2: note: in expansion of macro ‘R’
 1024 |  R(sec_vlan_mark_cksum_ptype_rss,                                       \
      |  ^
../drivers/net/cnxk/rx/cn9k/rx_96_111.c:10:1: note: in expansion of macro ‘NIX_RX_FASTPATH_MODES_96_111’
compilation terminated.
ninja: build stopped


DPDK STV team

             reply	other threads:[~2022-06-09  9:08 UTC|newest]

Thread overview: 41+ messages / expand[flat|nested]  mbox.gz  Atom feed  top
2022-06-09  9:08 sys_stv [this message]
  -- strict thread matches above, loose matches on Subject: below --
2022-06-22 21:09 sys_stv
2022-06-06  7:26 sys_stv
2022-06-06  2:06 sys_stv
2022-06-01 21:06 sys_stv
2022-06-01  1:57 sys_stv
2022-05-31 21:06 sys_stv
2022-05-30  8:26 sys_stv
2022-05-26  8:57 sys_stv
2022-05-20  5:13 sys_stv
2022-05-20  4:47 sys_stv
2022-05-18 21:07 sys_stv
2022-05-18 10:08 sys_stv
2022-05-17 21:07 sys_stv
2022-05-17  9:36 sys_stv
2022-05-17  9:15 sys_stv
2022-05-17  8:58 sys_stv
2022-05-16 21:06 sys_stv
2022-05-07  7:26 sys_stv
2022-05-06 21:06 sys_stv
2022-05-06  9:49 sys_stv
2022-05-06  9:32 sys_stv
2022-03-08 21:07 sys_stv
2022-03-08 17:16 sys_stv
2022-01-21  7:59 sys_stv
2022-01-21  7:55 sys_stv
2021-12-18 21:50 sys_stv
2021-10-22 22:14 sys_stv
2021-10-14  3:03 sys_stv
2021-08-15 22:10 sys_stv
2021-06-29 15:39 sys_stv
2021-05-27 22:08 sys_stv
2021-05-07  1:05 sys_stv
2021-03-22 22:07 sys_stv
2021-01-28 22:07 sys_stv
2021-01-27 22:07 sys_stv
2021-01-26 22:08 sys_stv
2021-01-26  6:13 sys_stv
2020-11-05 22:08 sys_stv
2020-11-03 22:07 sys_stv
2020-10-20  5:41 sys_stv

Reply instructions:

You may reply publicly to this message via plain-text email
using any one of the following methods:

* Save the following mbox file, import it into your mail client,
  and reply-to-all from there: mbox

  Avoid top-posting and favor interleaved quoting:
  https://en.wikipedia.org/wiki/Posting_style#Interleaved_style

* Reply using the --to, --cc, and --in-reply-to
  switches of git-send-email(1):

  git send-email \
    --in-reply-to='8b0460$ib859v@orsmga001-auth.jf.intel.com' \
    --to=sys_stv@intel.com \
    --cc=dpdk_sw_eng@intel.com \
    --cc=npg.sw.core.tools.prc@intel.com \
    --cc=test-report@dpdk.org \
    --cc=thomas@monjalon.net \
    /path/to/YOUR_REPLY

  https://kernel.org/pub/software/scm/git/docs/git-send-email.html

* If your mail client supports setting the In-Reply-To header
  via mailto: links, try the mailto: link

automatic DPDK test reports

This inbox may be cloned and mirrored by anyone:

	git clone --mirror http://inbox.dpdk.org/test-report/0 test-report/git/0.git

	# If you have public-inbox 1.1+ installed, you may
	# initialize and index your mirror using the following commands:
	public-inbox-init -V2 test-report test-report/ http://inbox.dpdk.org/test-report \
		test-report@dpdk.org
	public-inbox-index test-report

Example config snippet for mirrors.
Newsgroup available over NNTP:
	nntp://inbox.dpdk.org/inbox.dpdk.test-report


AGPL code for this site: git clone https://public-inbox.org/public-inbox.git