automatic DPDK test reports
 help / color / mirror / Atom feed
From: sys_stv@intel.com
To: test-report@dpdk.org, thomas@monjalon.net
Cc: dpdk_sw_eng@intel.com, npg.sw.core.tools.prc@intel.com
Subject: [dpdk-test-report] |FAILURE| dpdk daily Intel builds
Date: 25 Jan 2021 22:13:25 -0800
Message-ID: <925d15$bhnnk7@orsmga008-auth.jf.intel.com> (raw)

[-- Attachment #1: Type: text/plain, Size: 26301 bytes --]


Test-Label: Intel-compilation
Test-Status: FAILURE
_Compilation issues_


commit 696b8139fea45a653e7262388cc1d48a47d77a62
Author: Dmitry Kozlyuk <dmitry.kozliuk@gmail.com>
Date:   Fri Jan 8 05:47:23 2021 +0300

    build: enable pmdinfogen for Windows

DPDK git Repo: dpdk 


Meson Build Summary: 24 Builds Done, 14 Successful, 10 Failures, 0 Blocked

+------------------+------------+--------------+------------+------------+-----------+----------+
| os               | gcc-static | clang-static | icc-static | gcc-shared | gcc-debug | document |
+------------------+------------+--------------+------------+------------+-----------+----------+
| UB2004-64        | pass       | pass         | pass       |            |           | pass     |
| RHEL83-64        | FAIL       |              |            |            |           |          |
| FC33-64          | pass       | pass         |            |            |           |          |
| CentOsStream8-64 | FAIL       |              |            |            |           |          |
| UB2010-64        | pass       |              |            |            |           |          |
| WIN10-64         |            | FAIL         |            |            |           |          |
| UB2004-32        | pass       |              |            |            |           |          |
| CENTOS83-64      | FAIL       | FAIL         | FAIL       | FAIL       | FAIL      |          |
| FreeBSD1201-64   | pass       | pass         |            | pass       | pass      |          |
| SUSE15-64        | FAIL       | FAIL         |            |            |           |          |
| UB2004-64N       | pass       |              |            | pass       |           |          |
+------------------+------------+--------------+------------+------------+-----------+----------+
Test environment and configuration as below:


OS: UB2004-64
	Kernel Version: 5.6.0-050600-generic
	CPU info: Intel(R) Xeon(R) Platinum 8180 CPU @ 2.50GHz
	GCC Version: gcc (Ubuntu 10-20200416-0ubuntu1) 10.0.1 20200416 (experimental) [master revision 3c3f12e2a76:dcee354ce56:44b326839d864fc10c459916abcc97f35a9ac3de]
	Clang Version: 10.0.0-4ubuntu1
	x86_64-native-linuxapp-clang
	x86_64-native-linuxapp-gcc
	x86_64-native-linuxapp-icc
	x86_64-native-linuxapp-doc

OS: RHEL83-64
	Kernel Version: 4.18.0-240.el8.x86_64
	CPU info: Intel(R) Xeon(R) CPU E5-2699 v4 @ 2.20GHz
	GCC Version: gcc (GCC) 8.3.1 20191121 (Red Hat 8.3.1-5)
	Clang Version: 10.0.1 (Red Hat 10.0.1-1.module+el8.3.0+7459+90c24896)
	x86_64-native-linuxapp-gcc

OS: FC33-64
	Kernel Version: 5.8.16-300.fc33.x86_64
	CPU info: Intel(R) Xeon(R) CPU E5-2699 v4 @ 2.20GHz
	GCC Version: gcc (GCC) 10.2.1 20201005 (Red Hat 10.2.1-5)
	Clang Version: 11.0.0 (Fedora 11.0.0-1.fc33)
	x86_64-native-linuxapp-gcc
	x86_64-native-linuxapp-clang

OS: CentOsStream8-64
	Kernel Version: 4.18.0-257.el8.x86_64
	CPU info: Intel(R) Xeon(R) CPU E5-2699 v4 @ 2.20GHz
	GCC Version: gcc (GCC) 8.4.1 20200928 (Red Hat 8.4.1-1)
	Clang Version: 11.0.0 (Red Hat 11.0.0-0.2.rc2.module_el8.4.0+533+50191577)
	x86_64-native-linuxapp-gcc

OS: UB2010-64
	Kernel Version: 5.8.0-25-generic
	CPU info: Intel(R) Xeon(R) CPU E5-2699 v4 @ 2.20GHz
	GCC Version: gcc (Ubuntu 10.2.0-13ubuntu1) 10.2.0
	Clang Version: 11.0.0-2
	x86_64-native-linuxapp-gcc

OS: WIN10-64
	Kernel Version: N/A
	CPU info: N/A
	GCC Version: N/A
	Clang Version: Clang 8.0.0
	x86_64-windows-clang

OS: UB2004-32
	Kernel Version: 5.6.0-050600-generic
	CPU info: Intel(R) Xeon(R) Platinum 8180 CPU @ 2.50GHz
	GCC Version: gcc (Ubuntu 9.3.0-10ubuntu2) 9.3.0
	Clang Version: 10.0.0-4ubuntu1
	i686-native-linuxapp-gcc

OS: CENTOS83-64
	Kernel Version: 4.18.0-240.1.1.el8_3.x86_64
	CPU info: Intel(R) Xeon(R) Platinum 8180 CPU @ 2.50GHz
	GCC Version: gcc (GCC) 8.3.1 20191121 (Red Hat 8.3.1-5)
	Clang Version: 10.0.1 (Red Hat 10.0.1-1.module_el8.3.0+467+cb298d5b)
	x86_64-native-linuxapp-gcc
	x86_64-native-linuxapp-clang
	x86_64-native-linuxapp-icc
	x86_64-native-linuxapp-gcc+shared
	x86_64-native-linuxapp-gcc+debug

OS: FreeBSD1201-64
	Kernel Version: 12.1-RELEASE
	CPU info: Intel(R) Xeon(R) CPU E5-2699 v3 @ 2.30GHz (2294.74-MHz K8-class CPU)
	GCC Version: gcc (FreeBSD Ports Collection) 9.2.0
	Clang Version: 8.0.1 (tags/RELEASE_801/final 366581) (based on LLVM 8.0.1)
	x86_64-native-bsdapp-gcc
	x86_64-native-bsdapp-clang
	x86_64-native-bsdapp-gcc+shared
	x86_64-native-bsdapp-gcc+debug

OS: SUSE15-64
	Kernel Version: 5.3.18-lp152.57-default
	CPU info: Intel(R) Xeon(R) CPU E5-2699 v4 @ 2.20GHz
	GCC Version: gcc (SUSE Linux) 7.5.0
	Clang Version: 9.0.1
	x86_64-native-linuxapp-clang
	x86_64-native-linuxapp-gcc

OS: UB2004-64N
	Kernel Version: 5.10.0-051000-generic
	CPU info: Intel(R) Xeon(R) Platinum 8180 CPU @ 2.50GHz
	GCC Version: gcc (Ubuntu 9.3.0-10ubuntu2) 9.3.0
	Clang Version: 10.0.0-4ubuntu1
	x86_64-native-linuxapp-gcc
	x86_64-native-linuxapp-gcc+shared



*Build Failed #1:
OS: CENTOS83-64
Target: x86_64-native-linuxapp-gcc
FAILED: drivers/rte_common_dpaax.pmd.c 
/usr/bin/python3 ../buildtools/gen-pmdinfo-cfile.py ar /root/CENTOS83-64_K4.18.0_GCC8.3.1/x86_64-native-linuxapp-gcc/22ea222ada9a4842b676defdf68ce3e3/dpdk/x86_64-native-linuxapp-gcc/drivers/libtmp_rte_common_dpaax.a drivers/rte_common_dpaax.pmd.c /usr/bin/python3 ../buildtools/pmdinfogen.py elf
Traceback (most recent call last):
  File "../buildtools/gen-pmdinfo-cfile.py", line 14, in <module>
    [ar, "xv", os.path.abspath(archive)], capture_output=True, check=True, cwd=temp
  File "/usr/lib64/python3.6/subprocess.py", line 423, in run
    with Popen(*popenargs, **kwargs) as process:
TypeError: __init__() got an unexpected keyword argument 'capture_output'
[550/2810] Generating rte_common_iavf_mingw with a custom command
[551/2810] Generating rte_common_cpt.pmd.c with a custom command
FAILED: drivers/rte_common_cpt.pmd.c 
/usr/bin/python3 ../buildtools/gen-pmdinfo-cfile.py ar /root/CENTOS83-64_K4.18.0_GCC8.3.1/x86_64-native-linuxapp-gcc/22ea222ada9a4842b676defdf68ce3e3/dpdk/x86_64-native-linuxapp-gcc/drivers/libtmp_rte_common_cpt.a drivers/rte_common_cpt.pmd.c /usr/bin/python3 ../buildtools/pmdinfogen.py elf
Traceback (most recent call last):
  File "../buildtools/gen-pmdinfo-cfile.py", line 14, in <module>
    [ar, "xv", os.path.abspath(archive)], capture_output=True, check=True, cwd=temp
  File "/usr/lib64/python3.6/subprocess.py", line 423, in run
    with Popen(*popenargs, **kwargs) as process:
TypeError: __init__() got an unexpected keyword argument 'capture_output'
[552/2810] Linking target lib/librte_flow_classify.so.21.1
[553/2810] Compiling C object lib/librte_node.a.p/librte_node_ip4_rewrite.c.o
[554/2810] Compiling C object drivers/libtmp_rte_common_iavf.a.p/common_iavf_iavf_impl.c.o
[555/2810] Compiling C object drivers/libtmp_rte_common_octeontx.a.p/common_octeontx_octeontx_mbox.c.o
[556/2810] Compiling C object drivers/libtmp_rte_common_iavf.a.p/common_iavf_iavf_adminq.c.o
[557/2810] Compiling C object drivers/libtmp_rte_common_iavf.a.p/common_iavf_iavf_common.c.o
[558/2810] Generating graph.sym_chk with a meson_exe.py custom command
[559/2810] Compiling C object lib/librte_vhost.a.p/librte_vhost_vhost_crypto.c.o
[560/2810] Compiling C object lib/librte_pipeline.a.p/librte_pipeline_rte_table_action.c.o
ninja: build stopped




*Build Failed #2:
OS: CENTOS83-64
Target: x86_64-native-linuxapp-clang
FAILED: drivers/rte_common_dpaax.pmd.c 
/usr/bin/python3 ../buildtools/gen-pmdinfo-cfile.py ar /root/CENTOS83-64_K4.18.0_Clang7.0.1/x86_64-native-linuxapp-clang/22ea222ada9a4842b676defdf68ce3e3/dpdk/x86_64-native-linuxapp-clang/drivers/libtmp_rte_common_dpaax.a drivers/rte_common_dpaax.pmd.c /usr/bin/python3 ../buildtools/pmdinfogen.py elf
Traceback (most recent call last):
  File "../buildtools/gen-pmdinfo-cfile.py", line 14, in <module>
    [ar, "xv", os.path.abspath(archive)], capture_output=True, check=True, cwd=temp
  File "/usr/lib64/python3.6/subprocess.py", line 423, in run
    with Popen(*popenargs, **kwargs) as process:
TypeError: __init__() got an unexpected keyword argument 'capture_output'
[571/2813] Generating rte_common_octeontx.pmd.c with a custom command
FAILED: drivers/rte_common_octeontx.pmd.c 
/usr/bin/python3 ../buildtools/gen-pmdinfo-cfile.py ar /root/CENTOS83-64_K4.18.0_Clang7.0.1/x86_64-native-linuxapp-clang/22ea222ada9a4842b676defdf68ce3e3/dpdk/x86_64-native-linuxapp-clang/drivers/libtmp_rte_common_octeontx.a drivers/rte_common_octeontx.pmd.c /usr/bin/python3 ../buildtools/pmdinfogen.py elf
Traceback (most recent call last):
  File "../buildtools/gen-pmdinfo-cfile.py", line 14, in <module>
    [ar, "xv", os.path.abspath(archive)], capture_output=True, check=True, cwd=temp
  File "/usr/lib64/python3.6/subprocess.py", line 423, in run
    with Popen(*popenargs, **kwargs) as process:
TypeError: __init__() got an unexpected keyword argument 'capture_output'
[572/2813] Linking static target drivers/libtmp_rte_common_iavf.a
[573/2813] Generating rte_common_cpt.pmd.c with a custom command
FAILED: drivers/rte_common_cpt.pmd.c 
/usr/bin/python3 ../buildtools/gen-pmdinfo-cfile.py ar /root/CENTOS83-64_K4.18.0_Clang7.0.1/x86_64-native-linuxapp-clang/22ea222ada9a4842b676defdf68ce3e3/dpdk/x86_64-native-linuxapp-clang/drivers/libtmp_rte_common_cpt.a drivers/rte_common_cpt.pmd.c /usr/bin/python3 ../buildtools/pmdinfogen.py elf
Traceback (most recent call last):
  File "../buildtools/gen-pmdinfo-cfile.py", line 14, in <module>
    [ar, "xv", os.path.abspath(archive)], capture_output=True, check=True, cwd=temp
  File "/usr/lib64/python3.6/subprocess.py", line 423, in run
    with Popen(*popenargs, **kwargs) as process:
TypeError: __init__() got an unexpected keyword argument 'capture_output'
[574/2813] Compiling C object drivers/libtmp_rte_common_octeontx2.a.p/common_octeontx2_otx2_irq.c.o
[575/2813] Generating symbol file lib/librte_graph.so.21.1.p/librte_graph.so.21.1.symbols
[576/2813] Generating node.sym_chk with a meson_exe.py custom command
[577/2813] Compiling C object drivers/libtmp_rte_common_octeontx2.a.p/common_octeontx2_otx2_mbox.c.o
[578/2813] Compiling C object drivers/libtmp_rte_common_octeontx2.a.p/common_octeontx2_otx2_dev.c.o
[579/2813] Compiling C object lib/librte_pipeline.a.p/librte_pipeline_rte_table_action.c.o
ninja: build stopped




*Build Failed #3:
OS: CENTOS83-64
Target: x86_64-native-linuxapp-icc
FAILED: drivers/rte_common_cpt.pmd.c 
/usr/bin/python3 ../buildtools/gen-pmdinfo-cfile.py ar /root/CENTOS83-64_K4.18.0_ICC19.1.1/x86_64-native-linuxapp-icc/22ea222ada9a4842b676defdf68ce3e3/dpdk/x86_64-native-linuxapp-icc/drivers/libtmp_rte_common_cpt.a drivers/rte_common_cpt.pmd.c /usr/bin/python3 ../buildtools/pmdinfogen.py elf
Traceback (most recent call last):
  File "../buildtools/gen-pmdinfo-cfile.py", line 14, in <module>
    [ar, "xv", os.path.abspath(archive)], capture_output=True, check=True, cwd=temp
  File "/usr/lib64/python3.6/subprocess.py", line 423, in run
    with Popen(*popenargs, **kwargs) as process:
TypeError: __init__() got an unexpected keyword argument 'capture_output'
[544/2813] Linking target lib/librte_bpf.so.21.1
[545/2813] Compiling C object drivers/libtmp_rte_common_dpaax.a.p/common_dpaax_dpaa_of.c.o
[546/2813] Generating graph.sym_chk with a meson_exe.py custom command
[547/2813] Compiling C object drivers/libtmp_rte_common_dpaax.a.p/common_dpaax_caamflib.c.o
[548/2813] Compiling C object lib/librte_node.a.p/librte_node_ip4_rewrite.c.o
[549/2813] Compiling C object drivers/libtmp_rte_common_iavf.a.p/common_iavf_iavf_impl.c.o
[550/2813] Generating port.sym_chk with a meson_exe.py custom command
[551/2813] Compiling C object drivers/libtmp_rte_common_iavf.a.p/common_iavf_iavf_adminq.c.o
[552/2813] Compiling C object drivers/libtmp_rte_common_iavf.a.p/common_iavf_iavf_common.c.o
[553/2813] Compiling C object lib/librte_vhost.a.p/librte_vhost_vhost_crypto.c.o
[554/2813] Compiling C object lib/librte_pipeline.a.p/librte_pipeline_rte_table_action.c.o
ninja: build stopped




*Build Failed #4:
OS: CENTOS83-64
Target: x86_64-native-linuxapp-gcc+shared
FAILED: drivers/rte_common_cpt.pmd.c 
/usr/bin/python3 ../buildtools/gen-pmdinfo-cfile.py ar /root/CENTOS83-64_K4.18.0_GCC8.3.1/x86_64-native-linuxapp-gcc+shared/22ea222ada9a4842b676defdf68ce3e3/dpdk/x86_64-native-linuxapp-gcc+shared/drivers/libtmp_rte_common_cpt.a drivers/rte_common_cpt.pmd.c /usr/bin/python3 ../buildtools/pmdinfogen.py elf
Traceback (most recent call last):
  File "../buildtools/gen-pmdinfo-cfile.py", line 14, in <module>
    [ar, "xv", os.path.abspath(archive)], capture_output=True, check=True, cwd=temp
  File "/usr/lib64/python3.6/subprocess.py", line 423, in run
    with Popen(*popenargs, **kwargs) as process:
TypeError: __init__() got an unexpected keyword argument 'capture_output'
[562/2653] Linking static target lib/librte_node.a
[563/2653] Compiling C object drivers/libtmp_rte_common_dpaax.a.p/common_dpaax_dpaa_of.c.o
[564/2653] Generating graph.sym_chk with a meson_exe.py custom command
[565/2653] Compiling C object drivers/libtmp_rte_common_iavf.a.p/common_iavf_iavf_impl.c.o
[566/2653] Generating symbol file lib/librte_bpf.so.21.1.p/librte_bpf.so.21.1.symbols
[567/2653] Compiling C object drivers/libtmp_rte_common_iavf.a.p/common_iavf_iavf_common.c.o
[568/2653] Compiling C object drivers/libtmp_rte_common_iavf.a.p/common_iavf_iavf_adminq.c.o
[569/2653] Compiling C object lib/librte_vhost.a.p/librte_vhost_vhost_crypto.c.o
[570/2653] Compiling C object lib/librte_pipeline.a.p/librte_pipeline_rte_table_action.c.o
ninja: build stopped




*Build Failed #5:
OS: CENTOS83-64
Target: x86_64-native-linuxapp-gcc+debug
FAILED: drivers/rte_common_cpt.pmd.c 
/usr/bin/python3 ../buildtools/gen-pmdinfo-cfile.py ar /root/CENTOS83-64_K4.18.0_GCC8.3.1/x86_64-native-linuxapp-gcc+debug/22ea222ada9a4842b676defdf68ce3e3/dpdk/x86_64-native-linuxapp-gcc+debug/drivers/libtmp_rte_common_cpt.a drivers/rte_common_cpt.pmd.c /usr/bin/python3 ../buildtools/pmdinfogen.py elf
Traceback (most recent call last):
  File "../buildtools/gen-pmdinfo-cfile.py", line 14, in <module>
    [ar, "xv", os.path.abspath(archive)], capture_output=True, check=True, cwd=temp
  File "/usr/lib64/python3.6/subprocess.py", line 423, in run
    with Popen(*popenargs, **kwargs) as process:
TypeError: __init__() got an unexpected keyword argument 'capture_output'
[548/2813] Compiling C object drivers/libtmp_rte_common_dpaax.a.p/common_dpaax_caamflib.c.o
[549/2813] Compiling C object drivers/libtmp_rte_common_dpaax.a.p/common_dpaax_dpaa_of.c.o
[550/2813] Compiling C object lib/librte_node.a.p/librte_node_pkt_cls.c.o
[551/2813] Compiling C object lib/librte_node.a.p/librte_node_ip4_rewrite.c.o
[552/2813] Compiling C object lib/librte_node.a.p/librte_node_ip4_lookup.c.o
[553/2813] Generating graph.sym_chk with a meson_exe.py custom command
[554/2813] Compiling C object drivers/libtmp_rte_common_iavf.a.p/common_iavf_iavf_adminq.c.o
[555/2813] Compiling C object lib/librte_vhost.a.p/librte_vhost_vhost_crypto.c.o
[556/2813] Compiling C object lib/librte_pipeline.a.p/librte_pipeline_rte_table_action.c.o
ninja: build stopped




*Build Failed #6:
OS: RHEL83-64
Target: x86_64-native-linuxapp-gcc
FAILED: drivers/rte_common_dpaax.pmd.c 
/usr/bin/python3 ../buildtools/gen-pmdinfo-cfile.py ar /root/RHEL83-64_K4.18.0_GCC8.3.1/x86_64-native-linuxapp-gcc/22ea222ada9a4842b676defdf68ce3e3/dpdk/x86_64-native-linuxapp-gcc/drivers/libtmp_rte_common_dpaax.a drivers/rte_common_dpaax.pmd.c /usr/bin/python3 ../buildtools/pmdinfogen.py elf
Traceback (most recent call last):
  File "../buildtools/gen-pmdinfo-cfile.py", line 14, in <module>
    [ar, "xv", os.path.abspath(archive)], capture_output=True, check=True, cwd=temp
  File "/usr/lib64/python3.6/subprocess.py", line 423, in run
    with Popen(*popenargs, **kwargs) as process:
TypeError: __init__() got an unexpected keyword argument 'capture_output'
[558/2813] Linking static target drivers/libtmp_rte_common_octeontx.a
[559/2813] Generating rte_common_cpt.pmd.c with a custom command
FAILED: drivers/rte_common_cpt.pmd.c 
/usr/bin/python3 ../buildtools/gen-pmdinfo-cfile.py ar /root/RHEL83-64_K4.18.0_GCC8.3.1/x86_64-native-linuxapp-gcc/22ea222ada9a4842b676defdf68ce3e3/dpdk/x86_64-native-linuxapp-gcc/drivers/libtmp_rte_common_cpt.a drivers/rte_common_cpt.pmd.c /usr/bin/python3 ../buildtools/pmdinfogen.py elf
Traceback (most recent call last):
  File "../buildtools/gen-pmdinfo-cfile.py", line 14, in <module>
    [ar, "xv", os.path.abspath(archive)], capture_output=True, check=True, cwd=temp
  File "/usr/lib64/python3.6/subprocess.py", line 423, in run
    with Popen(*popenargs, **kwargs) as process:
TypeError: __init__() got an unexpected keyword argument 'capture_output'
[560/2813] Compiling C object drivers/libtmp_rte_common_iavf.a.p/common_iavf_iavf_impl.c.o
[561/2813] Compiling C object drivers/libtmp_rte_common_iavf.a.p/common_iavf_iavf_common.c.o
[562/2813] Generating graph.sym_chk with a custom command (wrapped by meson to capture output)
[563/2813] Generating node.sym_chk with a custom command (wrapped by meson to capture output)
[564/2813] Compiling C object drivers/libtmp_rte_common_iavf.a.p/common_iavf_iavf_adminq.c.o
[565/2813] Compiling C object lib/librte_vhost.a.p/librte_vhost_vhost_crypto.c.o
[566/2813] Compiling C object lib/librte_pipeline.a.p/librte_pipeline_rte_table_action.c.o
ninja: build stopped




*Build Failed #7:
OS: SUSE15-64
Target: x86_64-native-linuxapp-clang
FAILED: drivers/rte_common_dpaax.pmd.c 
/usr/bin/python3 ../buildtools/gen-pmdinfo-cfile.py ar /root/SUSE15-64_K5.3.18_Clang9.0.1/x86_64-native-linuxapp-clang/22ea222ada9a4842b676defdf68ce3e3/dpdk/x86_64-native-linuxapp-clang/drivers/libtmp_rte_common_dpaax.a drivers/rte_common_dpaax.pmd.c /usr/bin/python3 ../buildtools/pmdinfogen.py elf
Traceback (most recent call last):
  File "../buildtools/gen-pmdinfo-cfile.py", line 14, in <module>
    [ar, "xv", os.path.abspath(archive)], capture_output=True, check=True, cwd=temp
  File "/usr/lib64/python3.6/subprocess.py", line 423, in run
    with Popen(*popenargs, **kwargs) as process:
TypeError: __init__() got an unexpected keyword argument 'capture_output'
[558/2716] Compiling C object lib/librte_node.a.p/librte_node_ip4_rewrite.c.o
[559/2716] Compiling C object drivers/libtmp_rte_common_cpt.a.p/common_cpt_cpt_fpm_tables.c.o
[560/2716] Compiling C object lib/librte_node.a.p/librte_node_pkt_cls.c.o
[561/2716] Compiling C object drivers/libtmp_rte_common_octeontx.a.p/common_octeontx_octeontx_mbox.c.o
[562/2716] Generating graph.sym_chk with a custom command (wrapped by meson to capture output)
[563/2716] Compiling C object drivers/libtmp_rte_common_iavf.a.p/common_iavf_iavf_common.c.o
[564/2716] Compiling C object drivers/libtmp_rte_common_iavf.a.p/common_iavf_iavf_impl.c.o
[565/2716] Compiling C object drivers/libtmp_rte_common_iavf.a.p/common_iavf_iavf_adminq.c.o
[566/2716] Compiling C object lib/librte_pipeline.a.p/librte_pipeline_rte_table_action.c.o
ninja: build stopped




*Build Failed #8:
OS: SUSE15-64
Target: x86_64-native-linuxapp-gcc
FAILED: drivers/rte_common_dpaax.pmd.c 
/usr/bin/python3 ../buildtools/gen-pmdinfo-cfile.py ar /root/SUSE15-64_K5.3.18_GCC7.5.1/x86_64-native-linuxapp-gcc/22ea222ada9a4842b676defdf68ce3e3/dpdk/x86_64-native-linuxapp-gcc/drivers/libtmp_rte_common_dpaax.a drivers/rte_common_dpaax.pmd.c /usr/bin/python3 ../buildtools/pmdinfogen.py elf
Traceback (most recent call last):
  File "../buildtools/gen-pmdinfo-cfile.py", line 14, in <module>
    [ar, "xv", os.path.abspath(archive)], capture_output=True, check=True, cwd=temp
  File "/usr/lib64/python3.6/subprocess.py", line 423, in run
    with Popen(*popenargs, **kwargs) as process:
TypeError: __init__() got an unexpected keyword argument 'capture_output'
[553/2714] Generating rte_common_cpt.pmd.c with a custom command
FAILED: drivers/rte_common_cpt.pmd.c 
/usr/bin/python3 ../buildtools/gen-pmdinfo-cfile.py ar /root/SUSE15-64_K5.3.18_GCC7.5.1/x86_64-native-linuxapp-gcc/22ea222ada9a4842b676defdf68ce3e3/dpdk/x86_64-native-linuxapp-gcc/drivers/libtmp_rte_common_cpt.a drivers/rte_common_cpt.pmd.c /usr/bin/python3 ../buildtools/pmdinfogen.py elf
Traceback (most recent call last):
  File "../buildtools/gen-pmdinfo-cfile.py", line 14, in <module>
    [ar, "xv", os.path.abspath(archive)], capture_output=True, check=True, cwd=temp
  File "/usr/lib64/python3.6/subprocess.py", line 423, in run
    with Popen(*popenargs, **kwargs) as process:
TypeError: __init__() got an unexpected keyword argument 'capture_output'
[554/2714] Compiling C object drivers/libtmp_rte_common_iavf.a.p/common_iavf_iavf_common.c.o
[555/2714] Generating node.sym_chk with a custom command (wrapped by meson to capture output)
[556/2714] Generating symbol file lib/librte_graph.so.21.1.p/librte_graph.so.21.1.symbols
[557/2714] Compiling C object drivers/libtmp_rte_common_iavf.a.p/common_iavf_iavf_adminq.c.o
[558/2714] Compiling C object lib/librte_vhost.a.p/librte_vhost_vhost_crypto.c.o
[559/2714] Compiling C object lib/librte_pipeline.a.p/librte_pipeline_rte_table_action.c.o
ninja: build stopped




*Build Failed #9:
OS: CentOsStream8-64
Target: x86_64-native-linuxapp-gcc
FAILED: drivers/rte_common_dpaax.pmd.c 
/usr/bin/python3.6 ../buildtools/gen-pmdinfo-cfile.py ar /root/CentOsStream8-64_K4.18.0_GCC8.4.1/x86_64-native-linuxapp-gcc/22ea222ada9a4842b676defdf68ce3e3/dpdk/x86_64-native-linuxapp-gcc/drivers/libtmp_rte_common_dpaax.a drivers/rte_common_dpaax.pmd.c /usr/bin/python3.6 ../buildtools/pmdinfogen.py elf
Traceback (most recent call last):
  File "../buildtools/gen-pmdinfo-cfile.py", line 14, in <module>
    [ar, "xv", os.path.abspath(archive)], capture_output=True, check=True, cwd=temp
  File "/usr/lib64/python3.6/subprocess.py", line 423, in run
    with Popen(*popenargs, **kwargs) as process:
TypeError: __init__() got an unexpected keyword argument 'capture_output'
[555/2813] Generating rte_common_octeontx_def with a custom command
[556/2813] Generating rte_common_octeontx_mingw with a custom command
[557/2813] Generating rte_common_cpt.pmd.c with a custom command
FAILED: drivers/rte_common_cpt.pmd.c 
/usr/bin/python3.6 ../buildtools/gen-pmdinfo-cfile.py ar /root/CentOsStream8-64_K4.18.0_GCC8.4.1/x86_64-native-linuxapp-gcc/22ea222ada9a4842b676defdf68ce3e3/dpdk/x86_64-native-linuxapp-gcc/drivers/libtmp_rte_common_cpt.a drivers/rte_common_cpt.pmd.c /usr/bin/python3.6 ../buildtools/pmdinfogen.py elf
Traceback (most recent call last):
  File "../buildtools/gen-pmdinfo-cfile.py", line 14, in <module>
    [ar, "xv", os.path.abspath(archive)], capture_output=True, check=True, cwd=temp
  File "/usr/lib64/python3.6/subprocess.py", line 423, in run
    with Popen(*popenargs, **kwargs) as process:
TypeError: __init__() got an unexpected keyword argument 'capture_output'
[558/2813] Compiling C object drivers/libtmp_rte_common_octeontx.a.p/common_octeontx_octeontx_mbox.c.o
[559/2813] Compiling C object lib/librte_node.a.p/librte_node_ip4_rewrite.c.o
[560/2813] Compiling C object drivers/libtmp_rte_common_iavf.a.p/common_iavf_iavf_impl.c.o
[561/2813] Compiling C object drivers/libtmp_rte_common_iavf.a.p/common_iavf_iavf_common.c.o
[562/2813] Generating graph.sym_chk with a custom command (wrapped by meson to capture output)
[563/2813] Compiling C object drivers/libtmp_rte_common_iavf.a.p/common_iavf_iavf_adminq.c.o
[564/2813] Compiling C object lib/librte_vhost.a.p/librte_vhost_vhost_crypto.c.o
[565/2813] Compiling C object lib/librte_pipeline.a.p/librte_pipeline_rte_table_action.c.o
ninja: build stopped




*Build Failed #10:
OS: WIN10-64
Target: x86_64-windows-clang
FAILED: drivers/rte_bus_pci.pmd.c 
"C:/Program Files/Python37/Scripts/meson" "--internal" "exe" "--unpickle" "C:/windows-dpdk/dpdk/build/meson-private/meson_exe_python.exe_e6f270698ff228889b689544e34b589f317d6bbf.dat"
usage: pmdinfogen.py [-h] format input [input ...] output
pmdinfogen.py: error: the following arguments are required: output
Traceback (most recent call last):
  File "../buildtools/gen-pmdinfo-cfile.py", line 19, in <module>
    subprocess.run(pmdinfogen + paths + [output], check=True)
  File "c:\program files\python37\lib\subprocess.py", line 487, in run
    output=stdout, stderr=stderr)
subprocess.CalledProcessError: Command '['c:/program files/python37/python.exe', '../buildtools/pmdinfogen.py', 'coff', 'drivers/rte_bus_pci.pmd.c']' returned non-zero exit status 2.
[171/229] Linking static target drivers/net/i40e/libi40e_avx512_lib.a
[172/229] Linking static target lib/librte_hash.a
[173/229] Compiling C object drivers/libtmp_rte_net_i40e.a.p/net_i40e_i40e_rxtx.c.obj
[174/229] Generating rte_bus_vdev.pmd.c with a meson_exe.py custom command
FAILED: drivers/rte_bus_vdev.pmd.c 
"C:/Program Files/Python37/Scripts/meson" "--internal" "exe" "--unpickle" "C:/windows-dpdk/dpdk/build/meson-private/meson_exe_python.exe_b27050aa97c2c29583ff012d6490d2a52df5910d.dat"
usage: pmdinfogen.py [-h] format input [input ...] output
pmdinfogen.py: error: the following arguments are required: output
Traceback (most recent call last):
  File "../buildtools/gen-pmdinfo-cfile.py", line 19, in <module>
    subprocess.run(pmdinfogen + paths + [output], check=True)
  File "c:\program files\python37\lib\subprocess.py", line 487, in run
    output=stdout, stderr=stderr)
subprocess.CalledProcessError: Command '['c:/program files/python37/python.exe', '../buildtools/pmdinfogen.py', 'coff', 'drivers/rte_bus_vdev.pmd.c']' returned non-zero exit status 2.
[175/229] Compiling C object drivers/net/i40e/base/libi40e_base.a.p/i40e_hmc.c.obj
[176/229] Compiling C object drivers/net/i40e/base/libi40e_base.a.p/i40e_dcb.c.obj
[177/229] Compiling C object drivers/libtmp_rte_mempool_ring.a.p/mempool_ring_rte_mempool_ring.c.obj
[178/229] Generating symbol file lib/rte_net-21.dll.p/rte_net-21.dll.symbols
[179/229] Compiling C object drivers/net/i40e/base/libi40e_base.a.p/i40e_common.c.obj
[180/229] Compiling C object drivers/libtmp_rte_net_i40e.a.p/net_i40e_i40e_pf.c.obj
[181/229] Compiling C object drivers/libtmp_rte_net_i40e.a.p/net_i40e_i40e_fdir.c.obj
[182/229] Compiling C object drivers/libtmp_rte_net_i40e.a.p/net_i40e_i40e_flow.c.obj
[183/229] Compiling C object drivers/libtmp_rte_net_i40e.a.p/net_i40e_i40e_ethdev.c.obj
ninja: build stopped


DPDK STV team

             reply	other threads:[~2021-01-26  6:13 UTC|newest]

Thread overview: 17+ messages / expand[flat|nested]  mbox.gz  Atom feed  top
2021-01-26  6:13 sys_stv [this message]
  -- strict thread matches above, loose matches on Subject: below --
2022-01-21  7:59 sys_stv
2022-01-21  7:55 sys_stv
2021-12-18 21:50 sys_stv
2021-10-22 22:14 sys_stv
2021-10-14  3:03 sys_stv
2021-08-15 22:10 sys_stv
2021-06-29 15:39 sys_stv
2021-05-27 22:08 sys_stv
2021-05-07  1:05 sys_stv
2021-03-22 22:07 sys_stv
2021-01-28 22:07 sys_stv
2021-01-27 22:07 sys_stv
2021-01-26 22:08 sys_stv
2020-11-05 22:08 sys_stv
2020-11-03 22:07 sys_stv
2020-10-20  5:41 sys_stv

Reply instructions:

You may reply publicly to this message via plain-text email
using any one of the following methods:

* Save the following mbox file, import it into your mail client,
  and reply-to-all from there: mbox

  Avoid top-posting and favor interleaved quoting:
  https://en.wikipedia.org/wiki/Posting_style#Interleaved_style

* Reply using the --to, --cc, and --in-reply-to
  switches of git-send-email(1):

  git send-email \
    --in-reply-to='925d15$bhnnk7@orsmga008-auth.jf.intel.com' \
    --to=sys_stv@intel.com \
    --cc=dpdk_sw_eng@intel.com \
    --cc=npg.sw.core.tools.prc@intel.com \
    --cc=test-report@dpdk.org \
    --cc=thomas@monjalon.net \
    /path/to/YOUR_REPLY

  https://kernel.org/pub/software/scm/git/docs/git-send-email.html

* If your mail client supports setting the In-Reply-To header
  via mailto: links, try the mailto: link

automatic DPDK test reports

This inbox may be cloned and mirrored by anyone:

	git clone --mirror http://inbox.dpdk.org/test-report/0 test-report/git/0.git

	# If you have public-inbox 1.1+ installed, you may
	# initialize and index your mirror using the following commands:
	public-inbox-init -V2 test-report test-report/ http://inbox.dpdk.org/test-report \
		test-report@dpdk.org
	public-inbox-index test-report

Example config snippet for mirrors.
Newsgroup available over NNTP:
	nntp://inbox.dpdk.org/inbox.dpdk.test-report


AGPL code for this site: git clone https://public-inbox.org/public-inbox.git