automatic DPDK test reports
 help / color / mirror / Atom feed
* [dpdk-test-report] |FAILURE| pw(86221) [v1, 2/2] net/mlx5: support new device global syntax
@ 2021-01-13  9:05 sys_stv
  0 siblings, 0 replies; only message in thread
From: sys_stv @ 2021-01-13  9:05 UTC (permalink / raw)
  To: test-report

[-- Attachment #1: Type: text/plain, Size: 23365 bytes --]


Test-Label: Intel-compilation
Test-Status: FAILURE
http://dpdk.org/patch/86221

_Compilation issues_

Submitter: Xueming Li <xuemingl@nvidia.com>
Date: 2021-01-08 15:15:00
Reply_mail: 20210108151500.30308-3-xuemingl@nvidia.com

DPDK git baseline: Repo:dpdk-next-net-mlx, CommitID: 2cb998a33a21b62248bb7f58e4312558692228a9


Meson Build Summary: 22 Builds Done, 21 Successful, 1 Failures, 0 Blocked

+------------------+------------+--------------+------------+------------+-----------+----------+
| os               | gcc-static | clang-static | icc-static | gcc-shared | gcc-debug | document |
+------------------+------------+--------------+------------+------------+-----------+----------+
| UB2004-64        | pass       | pass         | pass       |            |           | pass     |
| RHEL83-64        | pass       |              |            |            |           |          |
| FC33-64          | pass       | pass         |            |            |           |          |
| CentOsStream8-64 | pass       |              |            |            |           |          |
| UB2010-64        | pass       |              |            |            |           |          |
| WIN10-64         |            | pass         |            |            |           |          |
| UB2004-32        | pass       |              |            |            |           |          |
| CENTOS83-64      | pass       | pass         | pass       | pass       | FAIL      |          |
| FreeBSD1201-64   | pass       | pass         |            | pass       | pass      |          |
| SUSE15-64        | pass       | pass         |            |            |           |          |
+------------------+------------+--------------+------------+------------+-----------+----------+
Test environment and configuration as below:


OS: UB2004-64
	Kernel Version: 5.6.0-050600-generic
	CPU info: Intel(R) Xeon(R) Platinum 8180 CPU @ 2.50GHz
	GCC Version: gcc (Ubuntu 10-20200416-0ubuntu1) 10.0.1 20200416 (experimental) [master revision 3c3f12e2a76:dcee354ce56:44b326839d864fc10c459916abcc97f35a9ac3de]
	Clang Version: 10.0.0-4ubuntu1
	x86_64-native-linuxapp-clang
	x86_64-native-linuxapp-gcc
	x86_64-native-linuxapp-icc
	x86_64-native-linuxapp-doc

OS: RHEL83-64
	Kernel Version: 4.18.0-240.el8.x86_64
	CPU info: Intel(R) Xeon(R) CPU E5-2699 v4 @ 2.20GHz
	GCC Version: gcc (GCC) 8.3.1 20191121 (Red Hat 8.3.1-5)
	Clang Version: 10.0.1 (Red Hat 10.0.1-1.module+el8.3.0+7459+90c24896)
	x86_64-native-linuxapp-gcc

OS: FC33-64
	Kernel Version: 5.8.16-300.fc33.x86_64
	CPU info: Intel(R) Xeon(R) CPU E5-2699 v4 @ 2.20GHz
	GCC Version: gcc (GCC) 10.2.1 20201005 (Red Hat 10.2.1-5)
	Clang Version: 11.0.0 (Fedora 11.0.0-1.fc33)
	x86_64-native-linuxapp-gcc
	x86_64-native-linuxapp-clang

OS: CentOsStream8-64
	Kernel Version: 4.18.0-257.el8.x86_64
	CPU info: Intel(R) Xeon(R) CPU E5-2699 v4 @ 2.20GHz
	GCC Version: gcc (GCC) 8.4.1 20200928 (Red Hat 8.4.1-1)
	Clang Version: 11.0.0 (Red Hat 11.0.0-0.2.rc2.module_el8.4.0+533+50191577)
	x86_64-native-linuxapp-gcc

OS: UB2010-64
	Kernel Version: 5.8.0-25-generic
	CPU info: Intel(R) Xeon(R) CPU E5-2699 v4 @ 2.20GHz
	GCC Version: gcc (Ubuntu 10.2.0-13ubuntu1) 10.2.0
	Clang Version: 11.0.0-2
	x86_64-native-linuxapp-gcc

OS: WIN10-64
	Kernel Version: N/A
	CPU info: N/A
	GCC Version: N/A
	Clang Version: Clang 8.0.0
	x86_64-windows-clang

OS: UB2004-32
	Kernel Version: 5.6.0-050600-generic
	CPU info: Intel(R) Xeon(R) Platinum 8180 CPU @ 2.50GHz
	GCC Version: gcc (Ubuntu 9.3.0-10ubuntu2) 9.3.0
	Clang Version: 10.0.0-4ubuntu1
	i686-native-linuxapp-gcc

OS: CENTOS83-64
	Kernel Version: 4.18.0-240.1.1.el8_3.x86_64
	CPU info: Intel(R) Xeon(R) Platinum 8180 CPU @ 2.50GHz
	GCC Version: gcc (GCC) 8.3.1 20191121 (Red Hat 8.3.1-5)
	Clang Version: 10.0.1 (Red Hat 10.0.1-1.module_el8.3.0+467+cb298d5b)
	x86_64-native-linuxapp-gcc
	x86_64-native-linuxapp-clang
	x86_64-native-linuxapp-icc
	x86_64-native-linuxapp-gcc+shared
	x86_64-native-linuxapp-gcc+debug

OS: FreeBSD1201-64
	Kernel Version: 12.1-RELEASE
	CPU info: Intel(R) Xeon(R) CPU E5-2699 v3 @ 2.30GHz (2294.74-MHz K8-class CPU)
	GCC Version: gcc (FreeBSD Ports Collection) 9.2.0
	Clang Version: 8.0.1 (tags/RELEASE_801/final 366581) (based on LLVM 8.0.1)
	x86_64-native-bsdapp-gcc
	x86_64-native-bsdapp-clang
	x86_64-native-bsdapp-gcc+shared
	x86_64-native-bsdapp-gcc+debug

OS: SUSE15-64
	Kernel Version: 5.3.18-lp152.57-default
	CPU info: Intel(R) Xeon(R) CPU E5-2699 v4 @ 2.20GHz
	GCC Version: gcc (SUSE Linux) 7.5.0
	Clang Version: 9.0.1
	x86_64-native-linuxapp-clang
	x86_64-native-linuxapp-gcc



*Build Failed #1:
OS: CENTOS83-64
Target: x86_64-native-linuxapp-gcc+debug
FAILED: drivers/common/sfc_efx/base/libsfc_base.a.p/rhead_rx.c.o 
gcc -Idrivers/common/sfc_efx/base/libsfc_base.a.p -Idrivers/common/sfc_efx/base -I../drivers/common/sfc_efx/base -Idrivers/common/sfc_efx -I../drivers/common/sfc_efx -I. -I.. -Iconfig -I../config -Ilib/librte_eal/include -I../lib/librte_eal/include -Ilib/librte_eal/linux/include -I../lib/librte_eal/linux/include -Ilib/librte_eal/x86/include -I../lib/librte_eal/x86/include -Ilib/librte_eal/common -I../lib/librte_eal/common -Ilib/librte_eal -I../lib/librte_eal -Ilib/librte_kvargs -I../lib/librte_kvargs -Ilib/librte_metrics -I../lib/librte_metrics -Ilib/librte_telemetry -I../lib/librte_telemetry -fdiagnostics-color=always -pipe -D_FILE_OFFSET_BITS=64 -Wall -Winvalid-pch -Werror -O2 -g -include rte_config.h -Wextra -Wcast-qual -Wdeprecated -Wformat -Wformat-nonliteral -Wformat-security -Wmissing-declarations -Wmissing-prototypes -Wnested-externs -Wold-style-definition -Wpointer-arith -Wsign-compare -Wstrict-prototypes -Wundef -Wwrite-strings -Wno-packed-not-aligned -Wno-missing-field-initializers -D_GNU_SOURCE -fPIC -march=native -DALLOW_EXPERIMENTAL_API -DALLOW_INTERNAL_API -Wno-format-truncation -Wdisabled-optimization -Waggregate-return -Wbad-function-cast -Wno-sign-compare -Wno-unused-parameter -Wno-unused-variable -Wno-empty-body -Wno-unused-but-set-variable -MD -MQ drivers/common/sfc_efx/base/libsfc_base.a.p/rhead_rx.c.o -MF drivers/common/sfc_efx/base/libsfc_base.a.p/rhead_rx.c.o.d -o drivers/common/sfc_efx/base/libsfc_base.a.p/rhead_rx.c.o -c ../drivers/common/sfc_efx/base/rhead_rx.c
In file included from ../drivers/common/sfc_efx/efsys.h:15,
                 from ../drivers/common/sfc_efx/base/efx.h:11,
                 from ../drivers/common/sfc_efx/base/rhead_rx.c:7:
../lib/librte_eal/x86/include/rte_spinlock.h:13:10: fatal error: rte_rtm.h: No such file or directory
compilation terminated.
[657/2786] Compiling C object drivers/common/sfc_efx/base/libsfc_base.a.p/rhead_tunnel.c.o
FAILED: drivers/common/sfc_efx/base/libsfc_base.a.p/rhead_tunnel.c.o 
gcc -Idrivers/common/sfc_efx/base/libsfc_base.a.p -Idrivers/common/sfc_efx/base -I../drivers/common/sfc_efx/base -Idrivers/common/sfc_efx -I../drivers/common/sfc_efx -I. -I.. -Iconfig -I../config -Ilib/librte_eal/include -I../lib/librte_eal/include -Ilib/librte_eal/linux/include -I../lib/librte_eal/linux/include -Ilib/librte_eal/x86/include -I../lib/librte_eal/x86/include -Ilib/librte_eal/common -I../lib/librte_eal/common -Ilib/librte_eal -I../lib/librte_eal -Ilib/librte_kvargs -I../lib/librte_kvargs -Ilib/librte_metrics -I../lib/librte_metrics -Ilib/librte_telemetry -I../lib/librte_telemetry -fdiagnostics-color=always -pipe -D_FILE_OFFSET_BITS=64 -Wall -Winvalid-pch -Werror -O2 -g -include rte_config.h -Wextra -Wcast-qual -Wdeprecated -Wformat -Wformat-nonliteral -Wformat-security -Wmissing-declarations -Wmissing-prototypes -Wnested-externs -Wold-style-definition -Wpointer-arith -Wsign-compare -Wstrict-prototypes -Wundef -Wwrite-strings -Wno-packed-not-aligned -Wno-missing-field-initializers -D_GNU_SOURCE -fPIC -march=native -DALLOW_EXPERIMENTAL_API -DALLOW_INTERNAL_API -Wno-format-truncation -Wdisabled-optimization -Waggregate-return -Wbad-function-cast -Wno-sign-compare -Wno-unused-parameter -Wno-unused-variable -Wno-empty-body -Wno-unused-but-set-variable -MD -MQ drivers/common/sfc_efx/base/libsfc_base.a.p/rhead_tunnel.c.o -MF drivers/common/sfc_efx/base/libsfc_base.a.p/rhead_tunnel.c.o.d -o drivers/common/sfc_efx/base/libsfc_base.a.p/rhead_tunnel.c.o -c ../drivers/common/sfc_efx/base/rhead_tunnel.c
In file included from ../lib/librte_eal/include/generic/rte_pause.h:19,
                 from ../lib/librte_eal/x86/include/rte_pause.h:12,
                 from ../lib/librte_eal/include/generic/rte_spinlock.h:25,
                 from ../lib/librte_eal/x86/include/rte_spinlock.h:12,
                 from ../drivers/common/sfc_efx/efsys.h:15,
                 from ../drivers/common/sfc_efx/base/efx.h:11,
                 from ../drivers/common/sfc_efx/base/rhead_tunnel.c:6:
../lib/librte_eal/x86/include/rte_atomic.h:16:10: fatal error: generic/rte_atomic.h: No such file or directory
compilation terminated.
[658/2786] Compiling C object drivers/common/sfc_efx/base/libsfc_base.a.p/rhead_ev.c.o
[659/2786] Compiling C object drivers/common/sfc_efx/base/libsfc_base.a.p/hunt_nic.c.o
[660/2786] Compiling C object drivers/common/sfc_efx/base/libsfc_base.a.p/rhead_tx.c.o
FAILED: drivers/common/sfc_efx/base/libsfc_base.a.p/rhead_tx.c.o 
gcc -Idrivers/common/sfc_efx/base/libsfc_base.a.p -Idrivers/common/sfc_efx/base -I../drivers/common/sfc_efx/base -Idrivers/common/sfc_efx -I../drivers/common/sfc_efx -I. -I.. -Iconfig -I../config -Ilib/librte_eal/include -I../lib/librte_eal/include -Ilib/librte_eal/linux/include -I../lib/librte_eal/linux/include -Ilib/librte_eal/x86/include -I../lib/librte_eal/x86/include -Ilib/librte_eal/common -I../lib/librte_eal/common -Ilib/librte_eal -I../lib/librte_eal -Ilib/librte_kvargs -I../lib/librte_kvargs -Ilib/librte_metrics -I../lib/librte_metrics -Ilib/librte_telemetry -I../lib/librte_telemetry -fdiagnostics-color=always -pipe -D_FILE_OFFSET_BITS=64 -Wall -Winvalid-pch -Werror -O2 -g -include rte_config.h -Wextra -Wcast-qual -Wdeprecated -Wformat -Wformat-nonliteral -Wformat-security -Wmissing-declarations -Wmissing-prototypes -Wnested-externs -Wold-style-definition -Wpointer-arith -Wsign-compare -Wstrict-prototypes -Wundef -Wwrite-strings -Wno-packed-not-aligned -Wno-missing-field-initializers -D_GNU_SOURCE -fPIC -march=native -DALLOW_EXPERIMENTAL_API -DALLOW_INTERNAL_API -Wno-format-truncation -Wdisabled-optimization -Waggregate-return -Wbad-function-cast -Wno-sign-compare -Wno-unused-parameter -Wno-unused-variable -Wno-empty-body -Wno-unused-but-set-variable -MD -MQ drivers/common/sfc_efx/base/libsfc_base.a.p/rhead_tx.c.o -MF drivers/common/sfc_efx/base/libsfc_base.a.p/rhead_tx.c.o.d -o drivers/common/sfc_efx/base/libsfc_base.a.p/rhead_tx.c.o -c ../drivers/common/sfc_efx/base/rhead_tx.c
In file included from ../drivers/common/sfc_efx/base/efx.h:11,
                 from ../drivers/common/sfc_efx/base/rhead_tx.c:7:
../drivers/common/sfc_efx/efsys.h:15:10: fatal error: rte_spinlock.h: No such file or directory
 #include <rte_spinlock.h>
          ^~~~~~~~~~~~~~~~
compilation terminated.
[661/2786] Compiling C object drivers/common/sfc_efx/base/libsfc_base.a.p/medford_nic.c.o
[662/2786] Compiling C object drivers/common/sfc_efx/base/libsfc_base.a.p/medford2_nic.c.o
FAILED: drivers/common/sfc_efx/base/libsfc_base.a.p/medford2_nic.c.o 
gcc -Idrivers/common/sfc_efx/base/libsfc_base.a.p -Idrivers/common/sfc_efx/base -I../drivers/common/sfc_efx/base -Idrivers/common/sfc_efx -I../drivers/common/sfc_efx -I. -I.. -Iconfig -I../config -Ilib/librte_eal/include -I../lib/librte_eal/include -Ilib/librte_eal/linux/include -I../lib/librte_eal/linux/include -Ilib/librte_eal/x86/include -I../lib/librte_eal/x86/include -Ilib/librte_eal/common -I../lib/librte_eal/common -Ilib/librte_eal -I../lib/librte_eal -Ilib/librte_kvargs -I../lib/librte_kvargs -Ilib/librte_metrics -I../lib/librte_metrics -Ilib/librte_telemetry -I../lib/librte_telemetry -fdiagnostics-color=always -pipe -D_FILE_OFFSET_BITS=64 -Wall -Winvalid-pch -Werror -O2 -g -include rte_config.h -Wextra -Wcast-qual -Wdeprecated -Wformat -Wformat-nonliteral -Wformat-security -Wmissing-declarations -Wmissing-prototypes -Wnested-externs -Wold-style-definition -Wpointer-arith -Wsign-compare -Wstrict-prototypes -Wundef -Wwrite-strings -Wno-packed-not-aligned -Wno-missing-field-initializers -D_GNU_SOURCE -fPIC -march=native -DALLOW_EXPERIMENTAL_API -DALLOW_INTERNAL_API -Wno-format-truncation -Wdisabled-optimization -Waggregate-return -Wbad-function-cast -Wno-sign-compare -Wno-unused-parameter -Wno-unused-variable -Wno-empty-body -Wno-unused-but-set-variable -MD -MQ drivers/common/sfc_efx/base/libsfc_base.a.p/medford2_nic.c.o -MF drivers/common/sfc_efx/base/libsfc_base.a.p/medford2_nic.c.o.d -o drivers/common/sfc_efx/base/libsfc_base.a.p/medford2_nic.c.o -c ../drivers/common/sfc_efx/base/medford2_nic.c
In file included from ../drivers/common/sfc_efx/base/efx.h:11,
                 from ../drivers/common/sfc_efx/base/medford2_nic.c:7:
../drivers/common/sfc_efx/efsys.h:21:10: fatal error: rte_cycles.h: No such file or directory
compilation terminated.
[663/2786] Compiling C object drivers/common/sfc_efx/base/libsfc_base.a.p/rhead_nic.c.o
FAILED: drivers/common/sfc_efx/base/libsfc_base.a.p/rhead_nic.c.o 
gcc -Idrivers/common/sfc_efx/base/libsfc_base.a.p -Idrivers/common/sfc_efx/base -I../drivers/common/sfc_efx/base -Idrivers/common/sfc_efx -I../drivers/common/sfc_efx -I. -I.. -Iconfig -I../config -Ilib/librte_eal/include -I../lib/librte_eal/include -Ilib/librte_eal/linux/include -I../lib/librte_eal/linux/include -Ilib/librte_eal/x86/include -I../lib/librte_eal/x86/include -Ilib/librte_eal/common -I../lib/librte_eal/common -Ilib/librte_eal -I../lib/librte_eal -Ilib/librte_kvargs -I../lib/librte_kvargs -Ilib/librte_metrics -I../lib/librte_metrics -Ilib/librte_telemetry -I../lib/librte_telemetry -fdiagnostics-color=always -pipe -D_FILE_OFFSET_BITS=64 -Wall -Winvalid-pch -Werror -O2 -g -include rte_config.h -Wextra -Wcast-qual -Wdeprecated -Wformat -Wformat-nonliteral -Wformat-security -Wmissing-declarations -Wmissing-prototypes -Wnested-externs -Wold-style-definition -Wpointer-arith -Wsign-compare -Wstrict-prototypes -Wundef -Wwrite-strings -Wno-packed-not-aligned -Wno-missing-field-initializers -D_GNU_SOURCE -fPIC -march=native -DALLOW_EXPERIMENTAL_API -DALLOW_INTERNAL_API -Wno-format-truncation -Wdisabled-optimization -Waggregate-return -Wbad-function-cast -Wno-sign-compare -Wno-unused-parameter -Wno-unused-variable -Wno-empty-body -Wno-unused-but-set-variable -MD -MQ drivers/common/sfc_efx/base/libsfc_base.a.p/rhead_nic.c.o -MF drivers/common/sfc_efx/base/libsfc_base.a.p/rhead_nic.c.o.d -o drivers/common/sfc_efx/base/libsfc_base.a.p/rhead_nic.c.o -c ../drivers/common/sfc_efx/base/rhead_nic.c
In file included from ../drivers/common/sfc_efx/base/efx.h:11,
                 from ../drivers/common/sfc_efx/base/rhead_nic.c:7:
../drivers/common/sfc_efx/efsys.h:21:10: fatal error: rte_cycles.h: No such file or directory
compilation terminated.
[664/2786] Compiling C object drivers/common/sfc_efx/base/libsfc_base.a.p/rhead_intr.c.o
FAILED: drivers/common/sfc_efx/base/libsfc_base.a.p/rhead_intr.c.o 
gcc -Idrivers/common/sfc_efx/base/libsfc_base.a.p -Idrivers/common/sfc_efx/base -I../drivers/common/sfc_efx/base -Idrivers/common/sfc_efx -I../drivers/common/sfc_efx -I. -I.. -Iconfig -I../config -Ilib/librte_eal/include -I../lib/librte_eal/include -Ilib/librte_eal/linux/include -I../lib/librte_eal/linux/include -Ilib/librte_eal/x86/include -I../lib/librte_eal/x86/include -Ilib/librte_eal/common -I../lib/librte_eal/common -Ilib/librte_eal -I../lib/librte_eal -Ilib/librte_kvargs -I../lib/librte_kvargs -Ilib/librte_metrics -I../lib/librte_metrics -Ilib/librte_telemetry -I../lib/librte_telemetry -fdiagnostics-color=always -pipe -D_FILE_OFFSET_BITS=64 -Wall -Winvalid-pch -Werror -O2 -g -include rte_config.h -Wextra -Wcast-qual -Wdeprecated -Wformat -Wformat-nonliteral -Wformat-security -Wmissing-declarations -Wmissing-prototypes -Wnested-externs -Wold-style-definition -Wpointer-arith -Wsign-compare -Wstrict-prototypes -Wundef -Wwrite-strings -Wno-packed-not-aligned -Wno-missing-field-initializers -D_GNU_SOURCE -fPIC -march=native -DALLOW_EXPERIMENTAL_API -DALLOW_INTERNAL_API -Wno-format-truncation -Wdisabled-optimization -Waggregate-return -Wbad-function-cast -Wno-sign-compare -Wno-unused-parameter -Wno-unused-variable -Wno-empty-body -Wno-unused-but-set-variable -MD -MQ drivers/common/sfc_efx/base/libsfc_base.a.p/rhead_intr.c.o -MF drivers/common/sfc_efx/base/libsfc_base.a.p/rhead_intr.c.o.d -o drivers/common/sfc_efx/base/libsfc_base.a.p/rhead_intr.c.o -c ../drivers/common/sfc_efx/base/rhead_intr.c
In file included from ../drivers/common/sfc_efx/base/efx.h:11,
                 from ../drivers/common/sfc_efx/base/rhead_intr.c:7:
../drivers/common/sfc_efx/efsys.h:21:10: fatal error: rte_cycles.h: No such file or directory
compilation terminated.
[665/2786] Compiling C object drivers/common/sfc_efx/base/libsfc_base.a.p/rhead_pci.c.o
FAILED: drivers/common/sfc_efx/base/libsfc_base.a.p/rhead_pci.c.o 
gcc -Idrivers/common/sfc_efx/base/libsfc_base.a.p -Idrivers/common/sfc_efx/base -I../drivers/common/sfc_efx/base -Idrivers/common/sfc_efx -I../drivers/common/sfc_efx -I. -I.. -Iconfig -I../config -Ilib/librte_eal/include -I../lib/librte_eal/include -Ilib/librte_eal/linux/include -I../lib/librte_eal/linux/include -Ilib/librte_eal/x86/include -I../lib/librte_eal/x86/include -Ilib/librte_eal/common -I../lib/librte_eal/common -Ilib/librte_eal -I../lib/librte_eal -Ilib/librte_kvargs -I../lib/librte_kvargs -Ilib/librte_metrics -I../lib/librte_metrics -Ilib/librte_telemetry -I../lib/librte_telemetry -fdiagnostics-color=always -pipe -D_FILE_OFFSET_BITS=64 -Wall -Winvalid-pch -Werror -O2 -g -include rte_config.h -Wextra -Wcast-qual -Wdeprecated -Wformat -Wformat-nonliteral -Wformat-security -Wmissing-declarations -Wmissing-prototypes -Wnested-externs -Wold-style-definition -Wpointer-arith -Wsign-compare -Wstrict-prototypes -Wundef -Wwrite-strings -Wno-packed-not-aligned -Wno-missing-field-initializers -D_GNU_SOURCE -fPIC -march=native -DALLOW_EXPERIMENTAL_API -DALLOW_INTERNAL_API -Wno-format-truncation -Wdisabled-optimization -Waggregate-return -Wbad-function-cast -Wno-sign-compare -Wno-unused-parameter -Wno-unused-variable -Wno-empty-body -Wno-unused-but-set-variable -MD -MQ drivers/common/sfc_efx/base/libsfc_base.a.p/rhead_pci.c.o -MF drivers/common/sfc_efx/base/libsfc_base.a.p/rhead_pci.c.o.d -o drivers/common/sfc_efx/base/libsfc_base.a.p/rhead_pci.c.o -c ../drivers/common/sfc_efx/base/rhead_pci.c
In file included from ../drivers/common/sfc_efx/efsys.h:20,
                 from ../drivers/common/sfc_efx/base/efx.h:11,
                 from ../drivers/common/sfc_efx/base/rhead_pci.c:7:
../lib/librte_eal/x86/include/rte_memcpy.h:19:10: fatal error: ../config/rte_config.h: No such file or directory
compilation terminated.
[666/2786] Compiling C object lib/librte_vhost.a.p/librte_vhost_vhost_crypto.c.o
FAILED: lib/librte_vhost.a.p/librte_vhost_vhost_crypto.c.o 
gcc -Ilib/librte_vhost.a.p -Ilib -I../lib -Ilib/librte_vhost -I../lib/librte_vhost -I. -I.. -Iconfig -I../config -Ilib/librte_eal/include -I../lib/librte_eal/include -Ilib/librte_eal/linux/include -I../lib/librte_eal/linux/include -Ilib/librte_eal/x86/include -I../lib/librte_eal/x86/include -Ilib/librte_eal/common -I../lib/librte_eal/common -Ilib/librte_eal -I../lib/librte_eal -Ilib/librte_kvargs -I../lib/librte_kvargs -Ilib/librte_metrics -I../lib/librte_metrics -Ilib/librte_telemetry -I../lib/librte_telemetry -Ilib/librte_ethdev -I../lib/librte_ethdev -Ilib/librte_net -I../lib/librte_net -Ilib/librte_mbuf -I../lib/librte_mbuf -Ilib/librte_mempool -I../lib/librte_mempool -Ilib/librte_ring -I../lib/librte_ring -Ilib/librte_meter -I../lib/librte_meter -Ilib/librte_cryptodev -I../lib/librte_cryptodev -Ilib/librte_hash -I../lib/librte_hash -Ilib/librte_rcu -I../lib/librte_rcu -Ilib/librte_pci -I../lib/librte_pci -fdiagnostics-color=always -pipe -D_FILE_OFFSET_BITS=64 -Wall -Winvalid-pch -Werror -O2 -g -include rte_config.h -Wextra -Wcast-qual -Wdeprecated -Wformat -Wformat-nonliteral -Wformat-security -Wmissing-declarations -Wmissing-prototypes -Wnested-externs -Wold-style-definition -Wpointer-arith -Wsign-compare -Wstrict-prototypes -Wundef -Wwrite-strings -Wno-packed-not-aligned -Wno-missing-field-initializers -D_GNU_SOURCE -fPIC -march=native -DALLOW_EXPERIMENTAL_API -DALLOW_INTERNAL_API -Wno-format-truncation -DVHOST_GCC_UNROLL_PRAGMA -fno-strict-aliasing -MD -MQ lib/librte_vhost.a.p/librte_vhost_vhost_crypto.c.o -MF lib/librte_vhost.a.p/librte_vhost_vhost_crypto.c.o.d -o lib/librte_vhost.a.p/librte_vhost_vhost_crypto.c.o -c ../lib/librte_vhost/vhost_crypto.c
../lib/librte_vhost/vhost_crypto.c:1733:1: fatal error: opening dependency file lib/librte_vhost.a.p/librte_vhost_vhost_crypto.c.o.d: No such file or directory
 }
 ^
compilation terminated.
[667/2786] Compiling C object lib/librte_pipeline.a.p/librte_pipeline_rte_table_action.c.o
FAILED: lib/librte_pipeline.a.p/librte_pipeline_rte_table_action.c.o 
gcc -Ilib/librte_pipeline.a.p -Ilib -I../lib -Ilib/librte_pipeline -I../lib/librte_pipeline -I. -I.. -Iconfig -I../config -Ilib/librte_eal/include -I../lib/librte_eal/include -Ilib/librte_eal/linux/include -I../lib/librte_eal/linux/include -Ilib/librte_eal/x86/include -I../lib/librte_eal/x86/include -Ilib/librte_eal/common -I../lib/librte_eal/common -Ilib/librte_eal -I../lib/librte_eal -Ilib/librte_kvargs -I../lib/librte_kvargs -Ilib/librte_metrics -I../lib/librte_metrics -Ilib/librte_telemetry -I../lib/librte_telemetry -Ilib/librte_port -I../lib/librte_port -Ilib/librte_ethdev -I../lib/librte_ethdev -Ilib/librte_net -I../lib/librte_net -Ilib/librte_mbuf -I../lib/librte_mbuf -Ilib/librte_mempool -I../lib/librte_mempool -Ilib/librte_ring -I../lib/librte_ring -Ilib/librte_meter -I../lib/librte_meter -Ilib/librte_sched -I../lib/librte_sched -Ilib/librte_ip_frag -I../lib/librte_ip_frag -Ilib/librte_hash -I../lib/librte_hash -Ilib/librte_rcu -I../lib/librte_rcu -Ilib/librte_cryptodev -I../lib/librte_cryptodev -Ilib/librte_eventdev -I../lib/librte_eventdev -Ilib/librte_timer -I../lib/librte_timer -Ilib/librte_kni -I../lib/librte_kni -Ilib/librte_pci -I../lib/librte_pci -Ilib/librte_table -I../lib/librte_table -Ilib/librte_lpm -I../lib/librte_lpm -Ilib/librte_acl -I../lib/librte_acl -fdiagnostics-color=always -pipe -D_FILE_OFFSET_BITS=64 -Wall -Winvalid-pch -Werror -O2 -g -include rte_config.h -Wextra -Wcast-qual -Wdeprecated -Wformat -Wformat-nonliteral -Wformat-security -Wmissing-declarations -Wmissing-prototypes -Wnested-externs -Wold-style-definition -Wpointer-arith -Wsign-compare -Wstrict-prototypes -Wundef -Wwrite-strings -Wno-packed-not-aligned -Wno-missing-field-initializers -D_GNU_SOURCE -fPIC -march=native -DALLOW_EXPERIMENTAL_API -DALLOW_INTERNAL_API -Wno-format-truncation -MD -MQ lib/librte_pipeline.a.p/librte_pipeline_rte_table_action.c.o -MF lib/librte_pipeline.a.p/librte_pipeline_rte_table_action.c.o.d -o lib/librte_pipeline.a.p/librte_pipeline_rte_table_action.c.o -c ../lib/librte_pipeline/rte_table_action.c
../lib/librte_pipeline/rte_table_action.c:3482:1: fatal error: opening dependency file lib/librte_pipeline.a.p/librte_pipeline_rte_table_action.c.o.d: No such file or directory
 }
 ^
compilation terminated.
ninja: build stopped


DPDK STV team

^ permalink raw reply	[flat|nested] only message in thread

only message in thread, other threads:[~2021-01-13  9:05 UTC | newest]

Thread overview: (only message) (download: mbox.gz / follow: Atom feed)
-- links below jump to the message on this page --
2021-01-13  9:05 [dpdk-test-report] |FAILURE| pw(86221) [v1, 2/2] net/mlx5: support new device global syntax sys_stv

automatic DPDK test reports

This inbox may be cloned and mirrored by anyone:

	git clone --mirror http://inbox.dpdk.org/test-report/0 test-report/git/0.git

	# If you have public-inbox 1.1+ installed, you may
	# initialize and index your mirror using the following commands:
	public-inbox-init -V2 test-report test-report/ http://inbox.dpdk.org/test-report \
		test-report@dpdk.org
	public-inbox-index test-report

Example config snippet for mirrors.
Newsgroup available over NNTP:
	nntp://inbox.dpdk.org/inbox.dpdk.test-report


AGPL code for this site: git clone https://public-inbox.org/public-inbox.git