automatic DPDK test reports
 help / color / mirror / Atom feed
* [dpdk-test-report] |FAILURE| pw(86472) [v3, 3/3] net/ice: enable ecpri tunnel port configure in dcf
@ 2021-01-13 14:26 sys_stv
  0 siblings, 0 replies; only message in thread
From: sys_stv @ 2021-01-13 14:26 UTC (permalink / raw)
  To: test-report

[-- Attachment #1: Type: text/plain, Size: 79162 bytes --]


Test-Label: Intel-compilation
Test-Status: FAILURE
http://dpdk.org/patch/86472

_Compilation issues_

Submitter: Jeff Guo <jia.guo@intel.com>
Date: 2021-01-13 14:05:18
Reply_mail: 20210113140518.64105-4-jia.guo@intel.com

DPDK git baseline: Repo:dpdk-next-net-intel, CommitID: 4e8caa32c07d5e3f7876e49725f9a5716d3badfa


Meson Build Summary: 22 Builds Done, 1 Successful, 21 Failures, 0 Blocked

+------------------+------------+--------------+------------+------------+-----------+----------+
| os               | gcc-static | clang-static | icc-static | gcc-shared | gcc-debug | document |
+------------------+------------+--------------+------------+------------+-----------+----------+
| UB2004-64        | FAIL       | FAIL         | FAIL       |            |           | FAIL     |
| RHEL83-64        | FAIL       |              |            |            |           |          |
| FC33-64          | FAIL       | FAIL         |            |            |           |          |
| CentOsStream8-64 | FAIL       |              |            |            |           |          |
| UB2010-64        | FAIL       |              |            |            |           |          |
| WIN10-64         |            | pass         |            |            |           |          |
| UB2004-32        | FAIL       |              |            |            |           |          |
| CENTOS83-64      | FAIL       | FAIL         | FAIL       | FAIL       | FAIL      |          |
| FreeBSD1201-64   | FAIL       | FAIL         |            | FAIL       | FAIL      |          |
| SUSE15-64        | FAIL       | FAIL         |            |            |           |          |
+------------------+------------+--------------+------------+------------+-----------+----------+
Test environment and configuration as below:


OS: UB2004-64
	Kernel Version: 5.6.0-050600-generic
	CPU info: Intel(R) Xeon(R) Platinum 8180 CPU @ 2.50GHz
	GCC Version: gcc (Ubuntu 10-20200416-0ubuntu1) 10.0.1 20200416 (experimental) [master revision 3c3f12e2a76:dcee354ce56:44b326839d864fc10c459916abcc97f35a9ac3de]
	Clang Version: 10.0.0-4ubuntu1
	x86_64-native-linuxapp-clang
	x86_64-native-linuxapp-gcc
	x86_64-native-linuxapp-icc
	x86_64-native-linuxapp-doc

OS: RHEL83-64
	Kernel Version: 4.18.0-240.el8.x86_64
	CPU info: Intel(R) Xeon(R) CPU E5-2699 v4 @ 2.20GHz
	GCC Version: gcc (GCC) 8.3.1 20191121 (Red Hat 8.3.1-5)
	Clang Version: 10.0.1 (Red Hat 10.0.1-1.module+el8.3.0+7459+90c24896)
	x86_64-native-linuxapp-gcc

OS: FC33-64
	Kernel Version: 5.8.16-300.fc33.x86_64
	CPU info: Intel(R) Xeon(R) CPU E5-2699 v4 @ 2.20GHz
	GCC Version: gcc (GCC) 10.2.1 20201005 (Red Hat 10.2.1-5)
	Clang Version: 11.0.0 (Fedora 11.0.0-1.fc33)
	x86_64-native-linuxapp-gcc
	x86_64-native-linuxapp-clang

OS: CentOsStream8-64
	Kernel Version: 4.18.0-257.el8.x86_64
	CPU info: Intel(R) Xeon(R) CPU E5-2699 v4 @ 2.20GHz
	GCC Version: gcc (GCC) 8.4.1 20200928 (Red Hat 8.4.1-1)
	Clang Version: 11.0.0 (Red Hat 11.0.0-0.2.rc2.module_el8.4.0+533+50191577)
	x86_64-native-linuxapp-gcc

OS: UB2010-64
	Kernel Version: 5.8.0-25-generic
	CPU info: Intel(R) Xeon(R) CPU E5-2699 v4 @ 2.20GHz
	GCC Version: gcc (Ubuntu 10.2.0-13ubuntu1) 10.2.0
	Clang Version: 11.0.0-2
	x86_64-native-linuxapp-gcc

OS: WIN10-64
	Kernel Version: N/A
	CPU info: N/A
	GCC Version: N/A
	Clang Version: Clang 8.0.0
	x86_64-windows-clang

OS: UB2004-32
	Kernel Version: 5.6.0-050600-generic
	CPU info: Intel(R) Xeon(R) Platinum 8180 CPU @ 2.50GHz
	GCC Version: gcc (Ubuntu 9.3.0-10ubuntu2) 9.3.0
	Clang Version: 10.0.0-4ubuntu1
	i686-native-linuxapp-gcc

OS: CENTOS83-64
	Kernel Version: 4.18.0-240.1.1.el8_3.x86_64
	CPU info: Intel(R) Xeon(R) Platinum 8180 CPU @ 2.50GHz
	GCC Version: gcc (GCC) 8.3.1 20191121 (Red Hat 8.3.1-5)
	Clang Version: 10.0.1 (Red Hat 10.0.1-1.module_el8.3.0+467+cb298d5b)
	x86_64-native-linuxapp-gcc
	x86_64-native-linuxapp-clang
	x86_64-native-linuxapp-icc
	x86_64-native-linuxapp-gcc+shared
	x86_64-native-linuxapp-gcc+debug

OS: FreeBSD1201-64
	Kernel Version: 12.1-RELEASE
	CPU info: Intel(R) Xeon(R) CPU E5-2699 v3 @ 2.30GHz (2294.74-MHz K8-class CPU)
	GCC Version: gcc (FreeBSD Ports Collection) 9.2.0
	Clang Version: 8.0.1 (tags/RELEASE_801/final 366581) (based on LLVM 8.0.1)
	x86_64-native-bsdapp-gcc
	x86_64-native-bsdapp-clang
	x86_64-native-bsdapp-gcc+shared
	x86_64-native-bsdapp-gcc+debug

OS: SUSE15-64
	Kernel Version: 5.3.18-lp152.57-default
	CPU info: Intel(R) Xeon(R) CPU E5-2699 v4 @ 2.20GHz
	GCC Version: gcc (SUSE Linux) 7.5.0
	Clang Version: 9.0.1
	x86_64-native-linuxapp-clang
	x86_64-native-linuxapp-gcc



*Build Failed #1:
OS: CENTOS83-64
Target: x86_64-native-linuxapp-gcc
FAILED: drivers/libtmp_rte_net_ice.a.p/net_ice_ice_dcf_ethdev.c.o 
gcc -Idrivers/libtmp_rte_net_ice.a.p -Idrivers -I../drivers -Idrivers/net/ice -I../drivers/net/ice -Idrivers/net/ice/base -I../drivers/net/ice/base -Idrivers/common/iavf -I../drivers/common/iavf -Ilib/librte_ethdev -I../lib/librte_ethdev -I. -I.. -Iconfig -I../config -Ilib/librte_eal/include -I../lib/librte_eal/include -Ilib/librte_eal/linux/include -I../lib/librte_eal/linux/include -Ilib/librte_eal/x86/include -I../lib/librte_eal/x86/include -Ilib/librte_eal/common -I../lib/librte_eal/common -Ilib/librte_eal -I../lib/librte_eal -Ilib/librte_kvargs -I../lib/librte_kvargs -Ilib/librte_metrics -I../lib/librte_metrics -Ilib/librte_telemetry -I../lib/librte_telemetry -Ilib/librte_net -I../lib/librte_net -Ilib/librte_mbuf -I../lib/librte_mbuf -Ilib/librte_mempool -I../lib/librte_mempool -Ilib/librte_ring -I../lib/librte_ring -Ilib/librte_meter -I../lib/librte_meter -Idrivers/bus/pci -I../drivers/bus/pci -I../drivers/bus/pci/linux -Ilib/librte_pci -I../lib/librte_pci -Idrivers/bus/vdev -I../drivers/bus/vdev -Ilib/librte_hash -I../lib/librte_hash -Ilib/librte_rcu -I../lib/librte_rcu -fdiagnostics-color=always -pipe -D_FILE_OFFSET_BITS=64 -Wall -Winvalid-pch -Werror -O3 -include rte_config.h -Wextra -Wcast-qual -Wdeprecated -Wformat -Wformat-nonliteral -Wformat-security -Wmissing-declarations -Wmissing-prototypes -Wnested-externs -Wold-style-definition -Wpointer-arith -Wsign-compare -Wstrict-prototypes -Wundef -Wwrite-strings -Wno-packed-not-aligned -Wno-missing-field-initializers -D_GNU_SOURCE -fPIC -march=native -DALLOW_EXPERIMENTAL_API -DALLOW_INTERNAL_API -Wno-format-truncation -DCC_AVX512_SUPPORT -MD -MQ drivers/libtmp_rte_net_ice.a.p/net_ice_ice_dcf_ethdev.c.o -MF drivers/libtmp_rte_net_ice.a.p/net_ice_ice_dcf_ethdev.c.o.d -o drivers/libtmp_rte_net_ice.a.p/net_ice_ice_dcf_ethdev.c.o -c ../drivers/net/ice/ice_dcf_ethdev.c
../drivers/net/ice/ice_dcf_ethdev.c: In function ‘ice_dcf_dev_udp_tunnel_port_add’:
../drivers/net/ice/ice_dcf_ethdev.c:898:7: error: ‘RTE_TUNNEL_TYPE_ECPRI’ undeclared (first use in this function); did you mean ‘RTE_TUNNEL_TYPE_NVGRE’?
  case RTE_TUNNEL_TYPE_ECPRI:
       ^~~~~~~~~~~~~~~~~~~~~
       RTE_TUNNEL_TYPE_NVGRE
../drivers/net/ice/ice_dcf_ethdev.c:898:7: note: each undeclared identifier is reported only once for each function it appears in
../drivers/net/ice/ice_dcf_ethdev.c: In function ‘ice_dcf_dev_udp_tunnel_port_del’:
../drivers/net/ice/ice_dcf_ethdev.c:926:7: error: ‘RTE_TUNNEL_TYPE_ECPRI’ undeclared (first use in this function); did you mean ‘RTE_TUNNEL_TYPE_NVGRE’?
  case RTE_TUNNEL_TYPE_ECPRI:
       ^~~~~~~~~~~~~~~~~~~~~
       RTE_TUNNEL_TYPE_NVGRE
[1363/2803] Compiling C object drivers/libtmp_rte_net_ice.a.p/net_ice_ice_dcf_parent.c.o
[1364/2803] Compiling C object drivers/net/igc/base/libigc_base.a.p/igc_api.c.o
[1365/2803] Compiling C object drivers/net/igc/base/libigc_base.a.p/igc_manage.c.o
[1366/2803] Compiling C object drivers/net/igc/base/libigc_base.a.p/igc_i225.c.o
[1367/2803] Compiling C object drivers/net/igc/base/libigc_base.a.p/igc_mac.c.o
[1368/2803] Compiling C object drivers/libtmp_rte_net_ice.a.p/net_ice_ice_dcf_vf_representor.c.o
[1369/2803] Compiling C object drivers/libtmp_rte_net_ice.a.p/net_ice_ice_rxtx_vec_avx2.c.o
[1370/2803] Compiling C object drivers/libtmp_rte_net_ice.a.p/net_ice_ice_dcf.c.o
[1371/2803] Compiling C object drivers/libtmp_rte_net_ice.a.p/net_ice_ice_rxtx_vec_sse.c.o
[1372/2803] Compiling C object drivers/libtmp_rte_net_ice.a.p/net_ice_ice_ethdev.c.o
[1373/2803] Compiling C object drivers/libtmp_rte_net_ice.a.p/net_ice_ice_rxtx.c.o
ninja: build stopped




*Build Failed #2:
OS: CENTOS83-64
Target: x86_64-native-linuxapp-clang
FAILED: drivers/libtmp_rte_net_ice.a.p/net_ice_ice_dcf_ethdev.c.o 
clang -Idrivers/libtmp_rte_net_ice.a.p -Idrivers -I../drivers -Idrivers/net/ice -I../drivers/net/ice -Idrivers/net/ice/base -I../drivers/net/ice/base -Idrivers/common/iavf -I../drivers/common/iavf -Ilib/librte_ethdev -I../lib/librte_ethdev -I. -I.. -Iconfig -I../config -Ilib/librte_eal/include -I../lib/librte_eal/include -Ilib/librte_eal/linux/include -I../lib/librte_eal/linux/include -Ilib/librte_eal/x86/include -I../lib/librte_eal/x86/include -Ilib/librte_eal/common -I../lib/librte_eal/common -Ilib/librte_eal -I../lib/librte_eal -Ilib/librte_kvargs -I../lib/librte_kvargs -Ilib/librte_metrics -I../lib/librte_metrics -Ilib/librte_telemetry -I../lib/librte_telemetry -Ilib/librte_net -I../lib/librte_net -Ilib/librte_mbuf -I../lib/librte_mbuf -Ilib/librte_mempool -I../lib/librte_mempool -Ilib/librte_ring -I../lib/librte_ring -Ilib/librte_meter -I../lib/librte_meter -Idrivers/bus/pci -I../drivers/bus/pci -I../drivers/bus/pci/linux -Ilib/librte_pci -I../lib/librte_pci -Idrivers/bus/vdev -I../drivers/bus/vdev -Ilib/librte_hash -I../lib/librte_hash -Ilib/librte_rcu -I../lib/librte_rcu -Xclang -fcolor-diagnostics -pipe -D_FILE_OFFSET_BITS=64 -Wall -Winvalid-pch -Werror -O3 -include rte_config.h -Wextra -Wcast-qual -Wdeprecated -Wformat -Wformat-nonliteral -Wformat-security -Wmissing-declarations -Wmissing-prototypes -Wnested-externs -Wold-style-definition -Wpointer-arith -Wsign-compare -Wstrict-prototypes -Wundef -Wwrite-strings -Wno-address-of-packed-member -Wno-missing-field-initializers -D_GNU_SOURCE -fPIC -march=native -DALLOW_EXPERIMENTAL_API -DALLOW_INTERNAL_API -DCC_AVX512_SUPPORT -MD -MQ drivers/libtmp_rte_net_ice.a.p/net_ice_ice_dcf_ethdev.c.o -MF drivers/libtmp_rte_net_ice.a.p/net_ice_ice_dcf_ethdev.c.o.d -o drivers/libtmp_rte_net_ice.a.p/net_ice_ice_dcf_ethdev.c.o -c ../drivers/net/ice/ice_dcf_ethdev.c
../drivers/net/ice/ice_dcf_ethdev.c:898:7: error: use of undeclared identifier 'RTE_TUNNEL_TYPE_ECPRI'; did you mean 'RTE_TUNNEL_TYPE_NVGRE'?
        case RTE_TUNNEL_TYPE_ECPRI:
             ^~~~~~~~~~~~~~~~~~~~~
             RTE_TUNNEL_TYPE_NVGRE
../lib/librte_ethdev/rte_ethdev.h:1218:2: note: 'RTE_TUNNEL_TYPE_NVGRE' declared here
        RTE_TUNNEL_TYPE_NVGRE,
        ^
../drivers/net/ice/ice_dcf_ethdev.c:926:7: error: use of undeclared identifier 'RTE_TUNNEL_TYPE_ECPRI'; did you mean 'RTE_TUNNEL_TYPE_NVGRE'?
        case RTE_TUNNEL_TYPE_ECPRI:
             ^~~~~~~~~~~~~~~~~~~~~
             RTE_TUNNEL_TYPE_NVGRE
../lib/librte_ethdev/rte_ethdev.h:1218:2: note: 'RTE_TUNNEL_TYPE_NVGRE' declared here
        RTE_TUNNEL_TYPE_NVGRE,
        ^
2 errors generated.
[1368/2806] Compiling C object drivers/libtmp_rte_net_ice.a.p/net_ice_ice_rxtx_vec_sse.c.o
[1369/2806] Compiling C object drivers/libtmp_rte_net_ice.a.p/net_ice_ice_rxtx_vec_avx2.c.o
[1370/2806] Compiling C object drivers/net/igc/base/libigc_base.a.p/igc_nvm.c.o
[1371/2806] Compiling C object drivers/libtmp_rte_net_ice.a.p/net_ice_ice_dcf_vf_representor.c.o
[1372/2806] Compiling C object drivers/net/igc/base/libigc_base.a.p/igc_osdep.c.o
[1373/2806] Compiling C object drivers/libtmp_rte_net_ice.a.p/net_ice_ice_dcf_parent.c.o
[1374/2806] Compiling C object drivers/libtmp_rte_net_ice.a.p/net_ice_ice_dcf.c.o
[1375/2806] Compiling C object drivers/net/igc/base/libigc_base.a.p/igc_api.c.o
[1376/2806] Compiling C object drivers/net/igc/base/libigc_base.a.p/igc_phy.c.o
ninja: build stopped




*Build Failed #3:
OS: CENTOS83-64
Target: x86_64-native-linuxapp-icc
FAILED: drivers/libtmp_rte_net_ice.a.p/net_ice_ice_dcf_ethdev.c.o 
icc -Idrivers/libtmp_rte_net_ice.a.p -Idrivers -I../drivers -Idrivers/net/ice -I../drivers/net/ice -Idrivers/net/ice/base -I../drivers/net/ice/base -Idrivers/common/iavf -I../drivers/common/iavf -Ilib/librte_ethdev -I../lib/librte_ethdev -I. -I.. -Iconfig -I../config -Ilib/librte_eal/include -I../lib/librte_eal/include -Ilib/librte_eal/linux/include -I../lib/librte_eal/linux/include -Ilib/librte_eal/x86/include -I../lib/librte_eal/x86/include -Ilib/librte_eal/common -I../lib/librte_eal/common -Ilib/librte_eal -I../lib/librte_eal -Ilib/librte_kvargs -I../lib/librte_kvargs -Ilib/librte_metrics -I../lib/librte_metrics -Ilib/librte_telemetry -I../lib/librte_telemetry -Ilib/librte_net -I../lib/librte_net -Ilib/librte_mbuf -I../lib/librte_mbuf -Ilib/librte_mempool -I../lib/librte_mempool -Ilib/librte_ring -I../lib/librte_ring -Ilib/librte_meter -I../lib/librte_meter -Idrivers/bus/pci -I../drivers/bus/pci -I../drivers/bus/pci/linux -Ilib/librte_pci -I../lib/librte_pci -Idrivers/bus/vdev -I../drivers/bus/vdev -Ilib/librte_hash -I../lib/librte_hash -Ilib/librte_rcu -I../lib/librte_rcu -pipe -D_FILE_OFFSET_BITS=64 -Wall -w3 -diag-disable:remark -Werror -O3 -include rte_config.h -Wextra -Wcast-qual -Wdeprecated -Wformat -Wformat-security -Wmissing-declarations -Wmissing-prototypes -Wold-style-definition -Wpointer-arith -Wsign-compare -Wstrict-prototypes -Wundef -Wwrite-strings -Wno-missing-field-initializers -diag-disable=181 -diag-disable=188 -diag-disable=2203 -diag-disable=2279 -diag-disable=2557 -diag-disable=3179 -diag-disable=3656 -D_GNU_SOURCE -fPIC -march=native -DALLOW_EXPERIMENTAL_API -DALLOW_INTERNAL_API -DCC_AVX512_SUPPORT -MD -MQ drivers/libtmp_rte_net_ice.a.p/net_ice_ice_dcf_ethdev.c.o -MF drivers/libtmp_rte_net_ice.a.p/net_ice_ice_dcf_ethdev.c.o.d -o drivers/libtmp_rte_net_ice.a.p/net_ice_ice_dcf_ethdev.c.o -c ../drivers/net/ice/ice_dcf_ethdev.c
../drivers/net/ice/ice_dcf_ethdev.c(898): error: identifier "RTE_TUNNEL_TYPE_ECPRI" is undefined
  	case RTE_TUNNEL_TYPE_ECPRI:
  	     ^

../drivers/net/ice/ice_dcf_ethdev.c(926): error: identifier "RTE_TUNNEL_TYPE_ECPRI" is undefined
  	case RTE_TUNNEL_TYPE_ECPRI:
  	     ^

compilation aborted for ../drivers/net/ice/ice_dcf_ethdev.c (code 2)
[1358/2806] Compiling C object drivers/net/ice/libice_avx512_lib.a.p/ice_rxtx_vec_avx512.c.o
icc: command line warning #10121: overriding '-march=native' with '-march=skylake-avx512'
[1359/2806] Linking target drivers/librte_net_hns3.so.21.1
[1360/2806] Compiling C object drivers/libtmp_rte_net_ice.a.p/net_ice_ice_dcf_parent.c.o
[1361/2806] Compiling C object drivers/libtmp_rte_net_ice.a.p/net_ice_ice_ethdev.c.o
[1362/2806] Compiling C object drivers/libtmp_rte_net_ice.a.p/net_ice_ice_dcf_vf_representor.c.o
[1363/2806] Linking target drivers/librte_net_iavf.so.21.1
[1364/2806] Compiling C object drivers/libtmp_rte_net_ice.a.p/net_ice_ice_dcf.c.o
[1365/2806] Compiling C object drivers/net/ice/base/libice_base.a.p/ice_fdir.c.o
[1366/2806] Compiling C object drivers/libtmp_rte_net_ice.a.p/net_ice_ice_rxtx.c.o
[1367/2806] Compiling C object drivers/libtmp_rte_net_ice.a.p/net_ice_ice_rxtx_vec_avx2.c.o
[1368/2806] Compiling C object drivers/libtmp_rte_net_ice.a.p/net_ice_ice_rxtx_vec_sse.c.o
ninja: build stopped




*Build Failed #4:
OS: CENTOS83-64
Target: x86_64-native-linuxapp-gcc+shared
FAILED: drivers/libtmp_rte_net_ice.a.p/net_ice_ice_dcf_ethdev.c.o 
gcc -Idrivers/libtmp_rte_net_ice.a.p -Idrivers -I../drivers -Idrivers/net/ice -I../drivers/net/ice -Idrivers/net/ice/base -I../drivers/net/ice/base -Idrivers/common/iavf -I../drivers/common/iavf -Ilib/librte_ethdev -I../lib/librte_ethdev -I. -I.. -Iconfig -I../config -Ilib/librte_eal/include -I../lib/librte_eal/include -Ilib/librte_eal/linux/include -I../lib/librte_eal/linux/include -Ilib/librte_eal/x86/include -I../lib/librte_eal/x86/include -Ilib/librte_eal/common -I../lib/librte_eal/common -Ilib/librte_eal -I../lib/librte_eal -Ilib/librte_kvargs -I../lib/librte_kvargs -Ilib/librte_metrics -I../lib/librte_metrics -Ilib/librte_telemetry -I../lib/librte_telemetry -Ilib/librte_net -I../lib/librte_net -Ilib/librte_mbuf -I../lib/librte_mbuf -Ilib/librte_mempool -I../lib/librte_mempool -Ilib/librte_ring -I../lib/librte_ring -Ilib/librte_meter -I../lib/librte_meter -Idrivers/bus/pci -I../drivers/bus/pci -I../drivers/bus/pci/linux -Ilib/librte_pci -I../lib/librte_pci -Idrivers/bus/vdev -I../drivers/bus/vdev -Ilib/librte_hash -I../lib/librte_hash -Ilib/librte_rcu -I../lib/librte_rcu -fdiagnostics-color=always -pipe -D_FILE_OFFSET_BITS=64 -Wall -Winvalid-pch -Werror -O3 -include rte_config.h -Wextra -Wcast-qual -Wdeprecated -Wformat -Wformat-nonliteral -Wformat-security -Wmissing-declarations -Wmissing-prototypes -Wnested-externs -Wold-style-definition -Wpointer-arith -Wsign-compare -Wstrict-prototypes -Wundef -Wwrite-strings -Wno-packed-not-aligned -Wno-missing-field-initializers -D_GNU_SOURCE -fPIC -march=native -DALLOW_EXPERIMENTAL_API -DALLOW_INTERNAL_API -Wno-format-truncation -DCC_AVX512_SUPPORT -MD -MQ drivers/libtmp_rte_net_ice.a.p/net_ice_ice_dcf_ethdev.c.o -MF drivers/libtmp_rte_net_ice.a.p/net_ice_ice_dcf_ethdev.c.o.d -o drivers/libtmp_rte_net_ice.a.p/net_ice_ice_dcf_ethdev.c.o -c ../drivers/net/ice/ice_dcf_ethdev.c
../drivers/net/ice/ice_dcf_ethdev.c: In function ‘ice_dcf_dev_udp_tunnel_port_add’:
../drivers/net/ice/ice_dcf_ethdev.c:898:7: error: ‘RTE_TUNNEL_TYPE_ECPRI’ undeclared (first use in this function); did you mean ‘RTE_TUNNEL_TYPE_NVGRE’?
  case RTE_TUNNEL_TYPE_ECPRI:
       ^~~~~~~~~~~~~~~~~~~~~
       RTE_TUNNEL_TYPE_NVGRE
../drivers/net/ice/ice_dcf_ethdev.c:898:7: note: each undeclared identifier is reported only once for each function it appears in
../drivers/net/ice/ice_dcf_ethdev.c: In function ‘ice_dcf_dev_udp_tunnel_port_del’:
../drivers/net/ice/ice_dcf_ethdev.c:926:7: error: ‘RTE_TUNNEL_TYPE_ECPRI’ undeclared (first use in this function); did you mean ‘RTE_TUNNEL_TYPE_NVGRE’?
  case RTE_TUNNEL_TYPE_ECPRI:
       ^~~~~~~~~~~~~~~~~~~~~
       RTE_TUNNEL_TYPE_NVGRE
[1376/2646] Compiling C object drivers/libtmp_rte_net_ice.a.p/net_ice_ice_dcf_vf_representor.c.o
[1377/2646] Compiling C object drivers/libtmp_rte_net_ice.a.p/net_ice_ice_ethdev.c.o
[1378/2646] Compiling C object drivers/net/igc/base/libigc_base.a.p/igc_i225.c.o
[1379/2646] Compiling C object drivers/libtmp_rte_net_ice.a.p/net_ice_ice_dcf_parent.c.o
[1380/2646] Compiling C object drivers/libtmp_rte_net_ice.a.p/net_ice_ice_dcf.c.o
[1381/2646] Compiling C object drivers/net/igc/base/libigc_base.a.p/igc_mac.c.o
[1382/2646] Compiling C object drivers/libtmp_rte_net_ice.a.p/net_ice_ice_rxtx.c.o
[1383/2646] Compiling C object drivers/libtmp_rte_net_ice.a.p/net_ice_ice_rxtx_vec_avx2.c.o
[1384/2646] Compiling C object drivers/libtmp_rte_net_ice.a.p/net_ice_ice_rxtx_vec_sse.c.o
ninja: build stopped




*Build Failed #5:
OS: CENTOS83-64
Target: x86_64-native-linuxapp-gcc+debug
FAILED: drivers/libtmp_rte_net_ice.a.p/net_ice_ice_dcf_ethdev.c.o 
gcc -Idrivers/libtmp_rte_net_ice.a.p -Idrivers -I../drivers -Idrivers/net/ice -I../drivers/net/ice -Idrivers/net/ice/base -I../drivers/net/ice/base -Idrivers/common/iavf -I../drivers/common/iavf -Ilib/librte_ethdev -I../lib/librte_ethdev -I. -I.. -Iconfig -I../config -Ilib/librte_eal/include -I../lib/librte_eal/include -Ilib/librte_eal/linux/include -I../lib/librte_eal/linux/include -Ilib/librte_eal/x86/include -I../lib/librte_eal/x86/include -Ilib/librte_eal/common -I../lib/librte_eal/common -Ilib/librte_eal -I../lib/librte_eal -Ilib/librte_kvargs -I../lib/librte_kvargs -Ilib/librte_metrics -I../lib/librte_metrics -Ilib/librte_telemetry -I../lib/librte_telemetry -Ilib/librte_net -I../lib/librte_net -Ilib/librte_mbuf -I../lib/librte_mbuf -Ilib/librte_mempool -I../lib/librte_mempool -Ilib/librte_ring -I../lib/librte_ring -Ilib/librte_meter -I../lib/librte_meter -Idrivers/bus/pci -I../drivers/bus/pci -I../drivers/bus/pci/linux -Ilib/librte_pci -I../lib/librte_pci -Idrivers/bus/vdev -I../drivers/bus/vdev -Ilib/librte_hash -I../lib/librte_hash -Ilib/librte_rcu -I../lib/librte_rcu -fdiagnostics-color=always -pipe -D_FILE_OFFSET_BITS=64 -Wall -Winvalid-pch -Werror -O2 -g -include rte_config.h -Wextra -Wcast-qual -Wdeprecated -Wformat -Wformat-nonliteral -Wformat-security -Wmissing-declarations -Wmissing-prototypes -Wnested-externs -Wold-style-definition -Wpointer-arith -Wsign-compare -Wstrict-prototypes -Wundef -Wwrite-strings -Wno-packed-not-aligned -Wno-missing-field-initializers -D_GNU_SOURCE -fPIC -march=native -DALLOW_EXPERIMENTAL_API -DALLOW_INTERNAL_API -Wno-format-truncation -DCC_AVX512_SUPPORT -MD -MQ drivers/libtmp_rte_net_ice.a.p/net_ice_ice_dcf_ethdev.c.o -MF drivers/libtmp_rte_net_ice.a.p/net_ice_ice_dcf_ethdev.c.o.d -o drivers/libtmp_rte_net_ice.a.p/net_ice_ice_dcf_ethdev.c.o -c ../drivers/net/ice/ice_dcf_ethdev.c
../drivers/net/ice/ice_dcf_ethdev.c: In function ‘ice_dcf_dev_udp_tunnel_port_add’:
../drivers/net/ice/ice_dcf_ethdev.c:898:7: error: ‘RTE_TUNNEL_TYPE_ECPRI’ undeclared (first use in this function); did you mean ‘RTE_TUNNEL_TYPE_NVGRE’?
  case RTE_TUNNEL_TYPE_ECPRI:
       ^~~~~~~~~~~~~~~~~~~~~
       RTE_TUNNEL_TYPE_NVGRE
../drivers/net/ice/ice_dcf_ethdev.c:898:7: note: each undeclared identifier is reported only once for each function it appears in
../drivers/net/ice/ice_dcf_ethdev.c: In function ‘ice_dcf_dev_udp_tunnel_port_del’:
../drivers/net/ice/ice_dcf_ethdev.c:926:7: error: ‘RTE_TUNNEL_TYPE_ECPRI’ undeclared (first use in this function); did you mean ‘RTE_TUNNEL_TYPE_NVGRE’?
  case RTE_TUNNEL_TYPE_ECPRI:
       ^~~~~~~~~~~~~~~~~~~~~
       RTE_TUNNEL_TYPE_NVGRE
[1366/2806] Compiling C object drivers/net/igc/base/libigc_base.a.p/igc_osdep.c.o
[1367/2806] Compiling C object drivers/net/igc/base/libigc_base.a.p/igc_base.c.o
[1368/2806] Compiling C object drivers/libtmp_rte_net_ice.a.p/net_ice_ice_dcf_vf_representor.c.o
[1369/2806] Compiling C object drivers/net/igc/base/libigc_base.a.p/igc_nvm.c.o
[1370/2806] Compiling C object drivers/net/igc/base/libigc_base.a.p/igc_api.c.o
[1371/2806] Compiling C object drivers/libtmp_rte_net_ice.a.p/net_ice_ice_dcf_parent.c.o
[1372/2806] Compiling C object drivers/libtmp_rte_net_ice.a.p/net_ice_ice_dcf.c.o
[1373/2806] Compiling C object drivers/libtmp_rte_net_ice.a.p/net_ice_ice_ethdev.c.o
[1374/2806] Compiling C object drivers/libtmp_rte_net_ice.a.p/net_ice_ice_rxtx_vec_sse.c.o
[1375/2806] Compiling C object drivers/libtmp_rte_net_ice.a.p/net_ice_ice_rxtx_vec_avx2.c.o
[1376/2806] Compiling C object drivers/libtmp_rte_net_ice.a.p/net_ice_ice_rxtx.c.o
ninja: build stopped




*Build Failed #6:
OS: FC33-64
Target: x86_64-native-linuxapp-gcc
FAILED: drivers/libtmp_rte_net_ice.a.p/net_ice_ice_dcf_ethdev.c.o 
gcc -Idrivers/libtmp_rte_net_ice.a.p -Idrivers -I../drivers -Idrivers/net/ice -I../drivers/net/ice -Idrivers/net/ice/base -I../drivers/net/ice/base -Idrivers/common/iavf -I../drivers/common/iavf -Ilib/librte_ethdev -I../lib/librte_ethdev -I. -I.. -Iconfig -I../config -Ilib/librte_eal/include -I../lib/librte_eal/include -Ilib/librte_eal/linux/include -I../lib/librte_eal/linux/include -Ilib/librte_eal/x86/include -I../lib/librte_eal/x86/include -Ilib/librte_eal/common -I../lib/librte_eal/common -Ilib/librte_eal -I../lib/librte_eal -Ilib/librte_kvargs -I../lib/librte_kvargs -Ilib/librte_metrics -I../lib/librte_metrics -Ilib/librte_telemetry -I../lib/librte_telemetry -Ilib/librte_net -I../lib/librte_net -Ilib/librte_mbuf -I../lib/librte_mbuf -Ilib/librte_mempool -I../lib/librte_mempool -Ilib/librte_ring -I../lib/librte_ring -Ilib/librte_meter -I../lib/librte_meter -Idrivers/bus/pci -I../drivers/bus/pci -I../drivers/bus/pci/linux -Ilib/librte_pci -I../lib/librte_pci -Idrivers/bus/vdev -I../drivers/bus/vdev -Ilib/librte_hash -I../lib/librte_hash -Ilib/librte_rcu -I../lib/librte_rcu -fdiagnostics-color=always -pipe -D_FILE_OFFSET_BITS=64 -Wall -Winvalid-pch -Werror -O3 -include rte_config.h -Wextra -Wcast-qual -Wdeprecated -Wformat -Wformat-nonliteral -Wformat-security -Wmissing-declarations -Wmissing-prototypes -Wnested-externs -Wold-style-definition -Wpointer-arith -Wsign-compare -Wstrict-prototypes -Wundef -Wwrite-strings -Wno-address-of-packed-member -Wno-packed-not-aligned -Wno-missing-field-initializers -Wno-zero-length-bounds -D_GNU_SOURCE -fPIC -march=native -DALLOW_EXPERIMENTAL_API -DALLOW_INTERNAL_API -Wno-format-truncation -DCC_AVX512_SUPPORT -MD -MQ drivers/libtmp_rte_net_ice.a.p/net_ice_ice_dcf_ethdev.c.o -MF drivers/libtmp_rte_net_ice.a.p/net_ice_ice_dcf_ethdev.c.o.d -o drivers/libtmp_rte_net_ice.a.p/net_ice_ice_dcf_ethdev.c.o -c ../drivers/net/ice/ice_dcf_ethdev.c
../drivers/net/ice/ice_dcf_ethdev.c: In function ‘ice_dcf_dev_udp_tunnel_port_add’:
../drivers/net/ice/ice_dcf_ethdev.c:898:7: error: ‘RTE_TUNNEL_TYPE_ECPRI’ undeclared (first use in this function); did you mean ‘RTE_TUNNEL_TYPE_NVGRE’?
  898 |  case RTE_TUNNEL_TYPE_ECPRI:
      |       ^~~~~~~~~~~~~~~~~~~~~
      |       RTE_TUNNEL_TYPE_NVGRE
../drivers/net/ice/ice_dcf_ethdev.c:898:7: note: each undeclared identifier is reported only once for each function it appears in
../drivers/net/ice/ice_dcf_ethdev.c: In function ‘ice_dcf_dev_udp_tunnel_port_del’:
../drivers/net/ice/ice_dcf_ethdev.c:926:7: error: ‘RTE_TUNNEL_TYPE_ECPRI’ undeclared (first use in this function); did you mean ‘RTE_TUNNEL_TYPE_NVGRE’?
  926 |  case RTE_TUNNEL_TYPE_ECPRI:
      |       ^~~~~~~~~~~~~~~~~~~~~
      |       RTE_TUNNEL_TYPE_NVGRE
[1357/2815] Generating rte_net_ice_def with a custom command
[1358/2815] Compiling C object drivers/net/ice/libice_avx512_lib.a.p/ice_rxtx_vec_avx512.c.o
[1359/2815] Compiling C object drivers/libtmp_rte_net_ice.a.p/net_ice_ice_dcf_vf_representor.c.o
[1360/2815] Compiling C object drivers/libtmp_rte_net_ice.a.p/net_ice_ice_acl_filter.c.o
[1361/2815] Compiling C object drivers/libtmp_rte_net_ice.a.p/net_ice_ice_dcf_parent.c.o
[1362/2815] Compiling C object drivers/net/igc/base/libigc_base.a.p/igc_mac.c.o
[1363/2815] Compiling C object drivers/libtmp_rte_net_ice.a.p/net_ice_ice_dcf.c.o
[1364/2815] Compiling C object drivers/libtmp_rte_net_ice.a.p/net_ice_ice_rxtx_vec_avx2.c.o
[1365/2815] Compiling C object drivers/libtmp_rte_net_ice.a.p/net_ice_ice_ethdev.c.o
[1366/2815] Compiling C object drivers/libtmp_rte_net_ice.a.p/net_ice_ice_rxtx.c.o
[1367/2815] Compiling C object drivers/libtmp_rte_net_ice.a.p/net_ice_ice_rxtx_vec_sse.c.o
ninja: build stopped




*Build Failed #7:
OS: FC33-64
Target: x86_64-native-linuxapp-clang
FAILED: drivers/libtmp_rte_net_ice.a.p/net_ice_ice_dcf_ethdev.c.o 
clang -Idrivers/libtmp_rte_net_ice.a.p -Idrivers -I../drivers -Idrivers/net/ice -I../drivers/net/ice -Idrivers/net/ice/base -I../drivers/net/ice/base -Idrivers/common/iavf -I../drivers/common/iavf -Ilib/librte_ethdev -I../lib/librte_ethdev -I. -I.. -Iconfig -I../config -Ilib/librte_eal/include -I../lib/librte_eal/include -Ilib/librte_eal/linux/include -I../lib/librte_eal/linux/include -Ilib/librte_eal/x86/include -I../lib/librte_eal/x86/include -Ilib/librte_eal/common -I../lib/librte_eal/common -Ilib/librte_eal -I../lib/librte_eal -Ilib/librte_kvargs -I../lib/librte_kvargs -Ilib/librte_metrics -I../lib/librte_metrics -Ilib/librte_telemetry -I../lib/librte_telemetry -Ilib/librte_net -I../lib/librte_net -Ilib/librte_mbuf -I../lib/librte_mbuf -Ilib/librte_mempool -I../lib/librte_mempool -Ilib/librte_ring -I../lib/librte_ring -Ilib/librte_meter -I../lib/librte_meter -Idrivers/bus/pci -I../drivers/bus/pci -I../drivers/bus/pci/linux -Ilib/librte_pci -I../lib/librte_pci -Idrivers/bus/vdev -I../drivers/bus/vdev -Ilib/librte_hash -I../lib/librte_hash -Ilib/librte_rcu -I../lib/librte_rcu -Xclang -fcolor-diagnostics -pipe -D_FILE_OFFSET_BITS=64 -Wall -Winvalid-pch -Werror -O3 -include rte_config.h -Wextra -Wcast-qual -Wdeprecated -Wformat -Wformat-nonliteral -Wformat-security -Wmissing-declarations -Wmissing-prototypes -Wnested-externs -Wold-style-definition -Wpointer-arith -Wsign-compare -Wstrict-prototypes -Wundef -Wwrite-strings -Wno-address-of-packed-member -Wno-missing-field-initializers -D_GNU_SOURCE -fPIC -march=native -DALLOW_EXPERIMENTAL_API -DALLOW_INTERNAL_API -DCC_AVX512_SUPPORT -MD -MQ drivers/libtmp_rte_net_ice.a.p/net_ice_ice_dcf_ethdev.c.o -MF drivers/libtmp_rte_net_ice.a.p/net_ice_ice_dcf_ethdev.c.o.d -o drivers/libtmp_rte_net_ice.a.p/net_ice_ice_dcf_ethdev.c.o -c ../drivers/net/ice/ice_dcf_ethdev.c
../drivers/net/ice/ice_dcf_ethdev.c:898:7: error: use of undeclared identifier 'RTE_TUNNEL_TYPE_ECPRI'; did you mean 'RTE_TUNNEL_TYPE_NVGRE'?
        case RTE_TUNNEL_TYPE_ECPRI:
             ^~~~~~~~~~~~~~~~~~~~~
             RTE_TUNNEL_TYPE_NVGRE
../lib/librte_ethdev/rte_ethdev.h:1218:2: note: 'RTE_TUNNEL_TYPE_NVGRE' declared here
        RTE_TUNNEL_TYPE_NVGRE,
        ^
../drivers/net/ice/ice_dcf_ethdev.c:926:7: error: use of undeclared identifier 'RTE_TUNNEL_TYPE_ECPRI'; did you mean 'RTE_TUNNEL_TYPE_NVGRE'?
        case RTE_TUNNEL_TYPE_ECPRI:
             ^~~~~~~~~~~~~~~~~~~~~
             RTE_TUNNEL_TYPE_NVGRE
../lib/librte_ethdev/rte_ethdev.h:1218:2: note: 'RTE_TUNNEL_TYPE_NVGRE' declared here
        RTE_TUNNEL_TYPE_NVGRE,
        ^
2 errors generated.
[1363/2815] Compiling C object drivers/net/igc/base/libigc_base.a.p/igc_base.c.o
[1364/2815] Compiling C object drivers/libtmp_rte_net_ice.a.p/net_ice_ice_rxtx.c.o
[1365/2815] Compiling C object drivers/net/igc/base/libigc_base.a.p/igc_i225.c.o
[1366/2815] Compiling C object drivers/libtmp_rte_net_ice.a.p/net_ice_ice_dcf.c.o
[1367/2815] Compiling C object drivers/net/igc/base/libigc_base.a.p/igc_manage.c.o
[1368/2815] Compiling C object drivers/libtmp_rte_net_ice.a.p/net_ice_ice_dcf_vf_representor.c.o
[1369/2815] Compiling C object drivers/libtmp_rte_net_ice.a.p/net_ice_ice_rxtx_vec_sse.c.o
[1370/2815] Compiling C object drivers/libtmp_rte_net_ice.a.p/net_ice_ice_dcf_parent.c.o
[1371/2815] Compiling C object drivers/libtmp_rte_net_ice.a.p/net_ice_ice_rxtx_vec_avx2.c.o
ninja: build stopped




*Build Failed #8:
OS: FreeBSD1201-64
Target: x86_64-native-bsdapp-gcc
FAILED: drivers/libtmp_rte_net_ice.a.p/net_ice_ice_dcf_ethdev.c.o 
gcc -Idrivers/libtmp_rte_net_ice.a.p -Idrivers -I../drivers -Idrivers/net/ice -I../drivers/net/ice -Idrivers/net/ice/base -I../drivers/net/ice/base -Idrivers/common/iavf -I../drivers/common/iavf -Ilib/librte_ethdev -I../lib/librte_ethdev -I. -I.. -Iconfig -I../config -Ilib/librte_eal/include -I../lib/librte_eal/include -Ilib/librte_eal/freebsd/include -I../lib/librte_eal/freebsd/include -Ilib/librte_eal/x86/include -I../lib/librte_eal/x86/include -Ilib/librte_eal/common -I../lib/librte_eal/common -Ilib/librte_eal -I../lib/librte_eal -Ilib/librte_kvargs -I../lib/librte_kvargs -Ilib/librte_metrics -I../lib/librte_metrics -Ilib/librte_telemetry -I../lib/librte_telemetry -Ilib/librte_net -I../lib/librte_net -Ilib/librte_mbuf -I../lib/librte_mbuf -Ilib/librte_mempool -I../lib/librte_mempool -Ilib/librte_ring -I../lib/librte_ring -Ilib/librte_meter -I../lib/librte_meter -Idrivers/bus/pci -I../drivers/bus/pci -I../drivers/bus/pci/bsd -Ilib/librte_pci -I../lib/librte_pci -Idrivers/bus/vdev -I../drivers/bus/vdev -Ilib/librte_hash -I../lib/librte_hash -Ilib/librte_rcu -I../lib/librte_rcu -fdiagnostics-color=always -pipe -D_FILE_OFFSET_BITS=64 -Wall -Winvalid-pch -Werror -O3 -include rte_config.h -Wextra -Wcast-qual -Wdeprecated -Wformat -Wformat-nonliteral -Wformat-security -Wmissing-declarations -Wmissing-prototypes -Wnested-externs -Wold-style-definition -Wpointer-arith -Wsign-compare -Wstrict-prototypes -Wundef -Wwrite-strings -Wno-address-of-packed-member -Wno-packed-not-aligned -Wno-missing-field-initializers -D_GNU_SOURCE -D__BSD_VISIBLE -fPIC -march=native -mno-avx512f -DALLOW_EXPERIMENTAL_API -DALLOW_INTERNAL_API -Wno-format-truncation -MD -MQ drivers/libtmp_rte_net_ice.a.p/net_ice_ice_dcf_ethdev.c.o -MF drivers/libtmp_rte_net_ice.a.p/net_ice_ice_dcf_ethdev.c.o.d -o drivers/libtmp_rte_net_ice.a.p/net_ice_ice_dcf_ethdev.c.o -c ../drivers/net/ice/ice_dcf_ethdev.c
../drivers/net/ice/ice_dcf_ethdev.c: In function 'ice_dcf_dev_udp_tunnel_port_add':
../drivers/net/ice/ice_dcf_ethdev.c:898:7: error: 'RTE_TUNNEL_TYPE_ECPRI' undeclared (first use in this function); did you mean 'RTE_TUNNEL_TYPE_NVGRE'?
  898 |  case RTE_TUNNEL_TYPE_ECPRI:
      |       ^~~~~~~~~~~~~~~~~~~~~
      |       RTE_TUNNEL_TYPE_NVGRE
../drivers/net/ice/ice_dcf_ethdev.c:898:7: note: each undeclared identifier is reported only once for each function it appears in
../drivers/net/ice/ice_dcf_ethdev.c: In function 'ice_dcf_dev_udp_tunnel_port_del':
../drivers/net/ice/ice_dcf_ethdev.c:926:7: error: 'RTE_TUNNEL_TYPE_ECPRI' undeclared (first use in this function); did you mean 'RTE_TUNNEL_TYPE_NVGRE'?
  926 |  case RTE_TUNNEL_TYPE_ECPRI:
      |       ^~~~~~~~~~~~~~~~~~~~~
      |       RTE_TUNNEL_TYPE_NVGRE
[1088/2028] Compiling C object drivers/libtmp_rte_net_ice.a.p/net_ice_ice_rxtx_vec_avx2.c.o
[1089/2028] Compiling C object drivers/net/igc/base/libigc_base.a.p/igc_i225.c.o
[1090/2028] Compiling C object drivers/net/igc/base/libigc_base.a.p/igc_manage.c.o
[1091/2028] Compiling C object drivers/libtmp_rte_net_ice.a.p/net_ice_ice_dcf_parent.c.o
[1092/2028] Compiling C object drivers/net/igc/base/libigc_base.a.p/igc_mac.c.o
ninja: build stopped




*Build Failed #9:
OS: FreeBSD1201-64
Target: x86_64-native-bsdapp-clang
FAILED: drivers/libtmp_rte_net_ice.a.p/net_ice_ice_dcf_ethdev.c.o 
clang -Idrivers/libtmp_rte_net_ice.a.p -Idrivers -I../drivers -Idrivers/net/ice -I../drivers/net/ice -Idrivers/net/ice/base -I../drivers/net/ice/base -Idrivers/common/iavf -I../drivers/common/iavf -Ilib/librte_ethdev -I../lib/librte_ethdev -I. -I.. -Iconfig -I../config -Ilib/librte_eal/include -I../lib/librte_eal/include -Ilib/librte_eal/freebsd/include -I../lib/librte_eal/freebsd/include -Ilib/librte_eal/x86/include -I../lib/librte_eal/x86/include -Ilib/librte_eal/common -I../lib/librte_eal/common -Ilib/librte_eal -I../lib/librte_eal -Ilib/librte_kvargs -I../lib/librte_kvargs -Ilib/librte_metrics -I../lib/librte_metrics -Ilib/librte_telemetry -I../lib/librte_telemetry -Ilib/librte_net -I../lib/librte_net -Ilib/librte_mbuf -I../lib/librte_mbuf -Ilib/librte_mempool -I../lib/librte_mempool -Ilib/librte_ring -I../lib/librte_ring -Ilib/librte_meter -I../lib/librte_meter -Idrivers/bus/pci -I../drivers/bus/pci -I../drivers/bus/pci/bsd -Ilib/librte_pci -I../lib/librte_pci -Idrivers/bus/vdev -I../drivers/bus/vdev -Ilib/librte_hash -I../lib/librte_hash -Ilib/librte_rcu -I../lib/librte_rcu -Xclang -fcolor-diagnostics -pipe -D_FILE_OFFSET_BITS=64 -Wall -Winvalid-pch -Werror -O3 -include rte_config.h -Wextra -Wcast-qual -Wdeprecated -Wformat -Wformat-nonliteral -Wformat-security -Wmissing-declarations -Wmissing-prototypes -Wnested-externs -Wold-style-definition -Wpointer-arith -Wsign-compare -Wstrict-prototypes -Wundef -Wwrite-strings -Wno-address-of-packed-member -Wno-missing-field-initializers -D_GNU_SOURCE -D__BSD_VISIBLE -fPIC -march=native -mno-avx512f -DALLOW_EXPERIMENTAL_API -DALLOW_INTERNAL_API -MD -MQ drivers/libtmp_rte_net_ice.a.p/net_ice_ice_dcf_ethdev.c.o -MF drivers/libtmp_rte_net_ice.a.p/net_ice_ice_dcf_ethdev.c.o.d -o drivers/libtmp_rte_net_ice.a.p/net_ice_ice_dcf_ethdev.c.o -c ../drivers/net/ice/ice_dcf_ethdev.c
../drivers/net/ice/ice_dcf_ethdev.c:898:7: error: use of undeclared identifier 'RTE_TUNNEL_TYPE_ECPRI'; did you mean 'RTE_TUNNEL_TYPE_NVGRE'?
        case RTE_TUNNEL_TYPE_ECPRI:
             ^~~~~~~~~~~~~~~~~~~~~
             RTE_TUNNEL_TYPE_NVGRE
../lib/librte_ethdev/rte_ethdev.h:1218:2: note: 'RTE_TUNNEL_TYPE_NVGRE' declared here
        RTE_TUNNEL_TYPE_NVGRE,
        ^
../drivers/net/ice/ice_dcf_ethdev.c:926:7: error: use of undeclared identifier 'RTE_TUNNEL_TYPE_ECPRI'; did you mean 'RTE_TUNNEL_TYPE_NVGRE'?
        case RTE_TUNNEL_TYPE_ECPRI:
             ^~~~~~~~~~~~~~~~~~~~~
             RTE_TUNNEL_TYPE_NVGRE
../lib/librte_ethdev/rte_ethdev.h:1218:2: note: 'RTE_TUNNEL_TYPE_NVGRE' declared here
        RTE_TUNNEL_TYPE_NVGRE,
        ^
2 errors generated.
[1101/2028] Compiling C object drivers/libtmp_rte_net_ionic.a.p/net_ionic_ionic_mac_api.c.o
[1102/2028] Compiling C object drivers/libtmp_rte_net_igc.a.p/net_igc_igc_flow.c.o
[1103/2028] Compiling C object drivers/libtmp_rte_net_igc.a.p/net_igc_igc_ethdev.c.o
[1104/2028] Compiling C object drivers/libtmp_rte_net_ionic.a.p/net_ionic_ionic_rx_filter.c.o
[1105/2028] Compiling C object drivers/libtmp_rte_net_igc.a.p/net_igc_igc_txrx.c.o
ninja: build stopped




*Build Failed #10:
OS: FreeBSD1201-64
Target: x86_64-native-bsdapp-gcc+shared
FAILED: drivers/libtmp_rte_net_ice.a.p/net_ice_ice_dcf_ethdev.c.o 
gcc -Idrivers/libtmp_rte_net_ice.a.p -Idrivers -I../drivers -Idrivers/net/ice -I../drivers/net/ice -Idrivers/net/ice/base -I../drivers/net/ice/base -Idrivers/common/iavf -I../drivers/common/iavf -Ilib/librte_ethdev -I../lib/librte_ethdev -I. -I.. -Iconfig -I../config -Ilib/librte_eal/include -I../lib/librte_eal/include -Ilib/librte_eal/freebsd/include -I../lib/librte_eal/freebsd/include -Ilib/librte_eal/x86/include -I../lib/librte_eal/x86/include -Ilib/librte_eal/common -I../lib/librte_eal/common -Ilib/librte_eal -I../lib/librte_eal -Ilib/librte_kvargs -I../lib/librte_kvargs -Ilib/librte_metrics -I../lib/librte_metrics -Ilib/librte_telemetry -I../lib/librte_telemetry -Ilib/librte_net -I../lib/librte_net -Ilib/librte_mbuf -I../lib/librte_mbuf -Ilib/librte_mempool -I../lib/librte_mempool -Ilib/librte_ring -I../lib/librte_ring -Ilib/librte_meter -I../lib/librte_meter -Idrivers/bus/pci -I../drivers/bus/pci -I../drivers/bus/pci/bsd -Ilib/librte_pci -I../lib/librte_pci -Idrivers/bus/vdev -I../drivers/bus/vdev -Ilib/librte_hash -I../lib/librte_hash -Ilib/librte_rcu -I../lib/librte_rcu -fdiagnostics-color=always -pipe -D_FILE_OFFSET_BITS=64 -Wall -Winvalid-pch -Werror -O3 -include rte_config.h -Wextra -Wcast-qual -Wdeprecated -Wformat -Wformat-nonliteral -Wformat-security -Wmissing-declarations -Wmissing-prototypes -Wnested-externs -Wold-style-definition -Wpointer-arith -Wsign-compare -Wstrict-prototypes -Wundef -Wwrite-strings -Wno-address-of-packed-member -Wno-packed-not-aligned -Wno-missing-field-initializers -D_GNU_SOURCE -D__BSD_VISIBLE -fPIC -march=native -mno-avx512f -DALLOW_EXPERIMENTAL_API -DALLOW_INTERNAL_API -Wno-format-truncation -MD -MQ drivers/libtmp_rte_net_ice.a.p/net_ice_ice_dcf_ethdev.c.o -MF drivers/libtmp_rte_net_ice.a.p/net_ice_ice_dcf_ethdev.c.o.d -o drivers/libtmp_rte_net_ice.a.p/net_ice_ice_dcf_ethdev.c.o -c ../drivers/net/ice/ice_dcf_ethdev.c
../drivers/net/ice/ice_dcf_ethdev.c: In function 'ice_dcf_dev_udp_tunnel_port_add':
../drivers/net/ice/ice_dcf_ethdev.c:898:7: error: 'RTE_TUNNEL_TYPE_ECPRI' undeclared (first use in this function); did you mean 'RTE_TUNNEL_TYPE_NVGRE'?
  898 |  case RTE_TUNNEL_TYPE_ECPRI:
      |       ^~~~~~~~~~~~~~~~~~~~~
      |       RTE_TUNNEL_TYPE_NVGRE
../drivers/net/ice/ice_dcf_ethdev.c:898:7: note: each undeclared identifier is reported only once for each function it appears in
../drivers/net/ice/ice_dcf_ethdev.c: In function 'ice_dcf_dev_udp_tunnel_port_del':
../drivers/net/ice/ice_dcf_ethdev.c:926:7: error: 'RTE_TUNNEL_TYPE_ECPRI' undeclared (first use in this function); did you mean 'RTE_TUNNEL_TYPE_NVGRE'?
  926 |  case RTE_TUNNEL_TYPE_ECPRI:
      |       ^~~~~~~~~~~~~~~~~~~~~
      |       RTE_TUNNEL_TYPE_NVGRE
[1106/1910] Generating rte_net_ice_mingw with a custom command
[1107/1910] Compiling C object drivers/libtmp_rte_net_ice.a.p/net_ice_ice_ethdev.c.o
[1108/1910] Compiling C object drivers/net/igc/base/libigc_base.a.p/igc_api.c.o
[1109/1910] Compiling C object drivers/libtmp_rte_net_ice.a.p/net_ice_ice_rxtx_vec_sse.c.o
[1110/1910] Compiling C object drivers/libtmp_rte_net_ice.a.p/net_ice_ice_dcf_parent.c.o
ninja: build stopped




*Build Failed #11:
OS: FreeBSD1201-64
Target: x86_64-native-bsdapp-gcc+debug
FAILED: drivers/libtmp_rte_net_ice.a.p/net_ice_ice_dcf_ethdev.c.o 
gcc -Idrivers/libtmp_rte_net_ice.a.p -Idrivers -I../drivers -Idrivers/net/ice -I../drivers/net/ice -Idrivers/net/ice/base -I../drivers/net/ice/base -Idrivers/common/iavf -I../drivers/common/iavf -Ilib/librte_ethdev -I../lib/librte_ethdev -I. -I.. -Iconfig -I../config -Ilib/librte_eal/include -I../lib/librte_eal/include -Ilib/librte_eal/freebsd/include -I../lib/librte_eal/freebsd/include -Ilib/librte_eal/x86/include -I../lib/librte_eal/x86/include -Ilib/librte_eal/common -I../lib/librte_eal/common -Ilib/librte_eal -I../lib/librte_eal -Ilib/librte_kvargs -I../lib/librte_kvargs -Ilib/librte_metrics -I../lib/librte_metrics -Ilib/librte_telemetry -I../lib/librte_telemetry -Ilib/librte_net -I../lib/librte_net -Ilib/librte_mbuf -I../lib/librte_mbuf -Ilib/librte_mempool -I../lib/librte_mempool -Ilib/librte_ring -I../lib/librte_ring -Ilib/librte_meter -I../lib/librte_meter -Idrivers/bus/pci -I../drivers/bus/pci -I../drivers/bus/pci/bsd -Ilib/librte_pci -I../lib/librte_pci -Idrivers/bus/vdev -I../drivers/bus/vdev -Ilib/librte_hash -I../lib/librte_hash -Ilib/librte_rcu -I../lib/librte_rcu -fdiagnostics-color=always -pipe -D_FILE_OFFSET_BITS=64 -Wall -Winvalid-pch -Werror -O2 -g -include rte_config.h -Wextra -Wcast-qual -Wdeprecated -Wformat -Wformat-nonliteral -Wformat-security -Wmissing-declarations -Wmissing-prototypes -Wnested-externs -Wold-style-definition -Wpointer-arith -Wsign-compare -Wstrict-prototypes -Wundef -Wwrite-strings -Wno-address-of-packed-member -Wno-packed-not-aligned -Wno-missing-field-initializers -D_GNU_SOURCE -D__BSD_VISIBLE -fPIC -march=native -mno-avx512f -DALLOW_EXPERIMENTAL_API -DALLOW_INTERNAL_API -Wno-format-truncation -MD -MQ drivers/libtmp_rte_net_ice.a.p/net_ice_ice_dcf_ethdev.c.o -MF drivers/libtmp_rte_net_ice.a.p/net_ice_ice_dcf_ethdev.c.o.d -o drivers/libtmp_rte_net_ice.a.p/net_ice_ice_dcf_ethdev.c.o -c ../drivers/net/ice/ice_dcf_ethdev.c
../drivers/net/ice/ice_dcf_ethdev.c: In function 'ice_dcf_dev_udp_tunnel_port_add':
../drivers/net/ice/ice_dcf_ethdev.c:898:7: error: 'RTE_TUNNEL_TYPE_ECPRI' undeclared (first use in this function); did you mean 'RTE_TUNNEL_TYPE_NVGRE'?
  898 |  case RTE_TUNNEL_TYPE_ECPRI:
      |       ^~~~~~~~~~~~~~~~~~~~~
      |       RTE_TUNNEL_TYPE_NVGRE
../drivers/net/ice/ice_dcf_ethdev.c:898:7: note: each undeclared identifier is reported only once for each function it appears in
../drivers/net/ice/ice_dcf_ethdev.c: In function 'ice_dcf_dev_udp_tunnel_port_del':
../drivers/net/ice/ice_dcf_ethdev.c:926:7: error: 'RTE_TUNNEL_TYPE_ECPRI' undeclared (first use in this function); did you mean 'RTE_TUNNEL_TYPE_NVGRE'?
  926 |  case RTE_TUNNEL_TYPE_ECPRI:
      |       ^~~~~~~~~~~~~~~~~~~~~
      |       RTE_TUNNEL_TYPE_NVGRE
[1081/2028] Compiling C object drivers/libtmp_rte_net_ice.a.p/net_ice_ice_dcf_parent.c.o
[1082/2028] Compiling C object drivers/libtmp_rte_net_ice.a.p/net_ice_ice_dcf.c.o
[1083/2028] Compiling C object drivers/libtmp_rte_net_ice.a.p/net_ice_ice_rxtx.c.o
[1084/2028] Compiling C object drivers/libtmp_rte_net_ice.a.p/net_ice_ice_rxtx_vec_avx2.c.o
[1085/2028] Compiling C object drivers/libtmp_rte_net_ice.a.p/net_ice_ice_rxtx_vec_sse.c.o
ninja: build stopped




*Build Failed #12:
OS: RHEL83-64
Target: x86_64-native-linuxapp-gcc
FAILED: drivers/libtmp_rte_net_ice.a.p/net_ice_ice_dcf_ethdev.c.o 
gcc -Idrivers/libtmp_rte_net_ice.a.p -Idrivers -I../drivers -Idrivers/net/ice -I../drivers/net/ice -Idrivers/net/ice/base -I../drivers/net/ice/base -Idrivers/common/iavf -I../drivers/common/iavf -Ilib/librte_ethdev -I../lib/librte_ethdev -I. -I.. -Iconfig -I../config -Ilib/librte_eal/include -I../lib/librte_eal/include -Ilib/librte_eal/linux/include -I../lib/librte_eal/linux/include -Ilib/librte_eal/x86/include -I../lib/librte_eal/x86/include -Ilib/librte_eal/common -I../lib/librte_eal/common -Ilib/librte_eal -I../lib/librte_eal -Ilib/librte_kvargs -I../lib/librte_kvargs -Ilib/librte_metrics -I../lib/librte_metrics -Ilib/librte_telemetry -I../lib/librte_telemetry -Ilib/librte_net -I../lib/librte_net -Ilib/librte_mbuf -I../lib/librte_mbuf -Ilib/librte_mempool -I../lib/librte_mempool -Ilib/librte_ring -I../lib/librte_ring -Ilib/librte_meter -I../lib/librte_meter -Idrivers/bus/pci -I../drivers/bus/pci -I../drivers/bus/pci/linux -Ilib/librte_pci -I../lib/librte_pci -Idrivers/bus/vdev -I../drivers/bus/vdev -Ilib/librte_hash -I../lib/librte_hash -Ilib/librte_rcu -I../lib/librte_rcu -fdiagnostics-color=always -pipe -D_FILE_OFFSET_BITS=64 -Wall -Winvalid-pch -Werror -O3 -include rte_config.h -Wextra -Wcast-qual -Wdeprecated -Wformat -Wformat-nonliteral -Wformat-security -Wmissing-declarations -Wmissing-prototypes -Wnested-externs -Wold-style-definition -Wpointer-arith -Wsign-compare -Wstrict-prototypes -Wundef -Wwrite-strings -Wno-packed-not-aligned -Wno-missing-field-initializers -D_GNU_SOURCE -fPIC -march=native -DALLOW_EXPERIMENTAL_API -DALLOW_INTERNAL_API -Wno-format-truncation -DCC_AVX512_SUPPORT -MD -MQ drivers/libtmp_rte_net_ice.a.p/net_ice_ice_dcf_ethdev.c.o -MF drivers/libtmp_rte_net_ice.a.p/net_ice_ice_dcf_ethdev.c.o.d -o drivers/libtmp_rte_net_ice.a.p/net_ice_ice_dcf_ethdev.c.o -c ../drivers/net/ice/ice_dcf_ethdev.c
../drivers/net/ice/ice_dcf_ethdev.c: In function ‘ice_dcf_dev_udp_tunnel_port_add’:
../drivers/net/ice/ice_dcf_ethdev.c:898:7: error: ‘RTE_TUNNEL_TYPE_ECPRI’ undeclared (first use in this function); did you mean ‘RTE_TUNNEL_TYPE_NVGRE’?
  case RTE_TUNNEL_TYPE_ECPRI:
       ^~~~~~~~~~~~~~~~~~~~~
       RTE_TUNNEL_TYPE_NVGRE
../drivers/net/ice/ice_dcf_ethdev.c:898:7: note: each undeclared identifier is reported only once for each function it appears in
../drivers/net/ice/ice_dcf_ethdev.c: In function ‘ice_dcf_dev_udp_tunnel_port_del’:
../drivers/net/ice/ice_dcf_ethdev.c:926:7: error: ‘RTE_TUNNEL_TYPE_ECPRI’ undeclared (first use in this function); did you mean ‘RTE_TUNNEL_TYPE_NVGRE’?
  case RTE_TUNNEL_TYPE_ECPRI:
       ^~~~~~~~~~~~~~~~~~~~~
       RTE_TUNNEL_TYPE_NVGRE
[1364/2806] Compiling C object drivers/net/igc/base/libigc_base.a.p/igc_mac.c.o
[1365/2806] Compiling C object drivers/net/igc/base/libigc_base.a.p/igc_base.c.o
[1366/2806] Compiling C object drivers/net/igc/base/libigc_base.a.p/igc_i225.c.o
[1367/2806] Compiling C object drivers/net/igc/base/libigc_base.a.p/igc_manage.c.o
[1368/2806] Compiling C object drivers/net/igc/base/libigc_base.a.p/igc_api.c.o
[1369/2806] Compiling C object drivers/libtmp_rte_net_ice.a.p/net_ice_ice_rxtx.c.o
[1370/2806] Compiling C object drivers/net/igc/base/libigc_base.a.p/igc_nvm.c.o
[1371/2806] Compiling C object drivers/libtmp_rte_net_ice.a.p/net_ice_ice_rxtx_vec_avx2.c.o
[1372/2806] Compiling C object drivers/libtmp_rte_net_ice.a.p/net_ice_ice_rxtx_vec_sse.c.o
ninja: build stopped




*Build Failed #13:
OS: SUSE15-64
Target: x86_64-native-linuxapp-clang
FAILED: drivers/libtmp_rte_net_ice.a.p/net_ice_ice_dcf_ethdev.c.o 
clang -Idrivers/libtmp_rte_net_ice.a.p -Idrivers -I../drivers -Idrivers/net/ice -I../drivers/net/ice -Idrivers/net/ice/base -I../drivers/net/ice/base -Idrivers/common/iavf -I../drivers/common/iavf -Ilib/librte_ethdev -I../lib/librte_ethdev -I. -I.. -Iconfig -I../config -Ilib/librte_eal/include -I../lib/librte_eal/include -Ilib/librte_eal/linux/include -I../lib/librte_eal/linux/include -Ilib/librte_eal/x86/include -I../lib/librte_eal/x86/include -Ilib/librte_eal/common -I../lib/librte_eal/common -Ilib/librte_eal -I../lib/librte_eal -Ilib/librte_kvargs -I../lib/librte_kvargs -Ilib/librte_metrics -I../lib/librte_metrics -Ilib/librte_telemetry -I../lib/librte_telemetry -Ilib/librte_net -I../lib/librte_net -Ilib/librte_mbuf -I../lib/librte_mbuf -Ilib/librte_mempool -I../lib/librte_mempool -Ilib/librte_ring -I../lib/librte_ring -Ilib/librte_meter -I../lib/librte_meter -Idrivers/bus/pci -I../drivers/bus/pci -I../drivers/bus/pci/linux -Ilib/librte_pci -I../lib/librte_pci -Idrivers/bus/vdev -I../drivers/bus/vdev -Ilib/librte_hash -I../lib/librte_hash -Ilib/librte_rcu -I../lib/librte_rcu -Xclang -fcolor-diagnostics -pipe -D_FILE_OFFSET_BITS=64 -Wall -Winvalid-pch -Werror -O3 -include rte_config.h -Wextra -Wcast-qual -Wdeprecated -Wformat -Wformat-nonliteral -Wformat-security -Wmissing-declarations -Wmissing-prototypes -Wnested-externs -Wold-style-definition -Wpointer-arith -Wsign-compare -Wstrict-prototypes -Wundef -Wwrite-strings -Wno-address-of-packed-member -Wno-missing-field-initializers -D_GNU_SOURCE -fPIC -march=native -DALLOW_EXPERIMENTAL_API -DALLOW_INTERNAL_API -DCC_AVX512_SUPPORT -MD -MQ drivers/libtmp_rte_net_ice.a.p/net_ice_ice_dcf_ethdev.c.o -MF drivers/libtmp_rte_net_ice.a.p/net_ice_ice_dcf_ethdev.c.o.d -o drivers/libtmp_rte_net_ice.a.p/net_ice_ice_dcf_ethdev.c.o -c ../drivers/net/ice/ice_dcf_ethdev.c
../drivers/net/ice/ice_dcf_ethdev.c:898:7: error: use of undeclared identifier 'RTE_TUNNEL_TYPE_ECPRI'; did you mean 'RTE_TUNNEL_TYPE_NVGRE'?
        case RTE_TUNNEL_TYPE_ECPRI:
             ^~~~~~~~~~~~~~~~~~~~~
             RTE_TUNNEL_TYPE_NVGRE
../lib/librte_ethdev/rte_ethdev.h:1218:2: note: 'RTE_TUNNEL_TYPE_NVGRE' declared here
        RTE_TUNNEL_TYPE_NVGRE,
        ^
../drivers/net/ice/ice_dcf_ethdev.c:926:7: error: use of undeclared identifier 'RTE_TUNNEL_TYPE_ECPRI'; did you mean 'RTE_TUNNEL_TYPE_NVGRE'?
        case RTE_TUNNEL_TYPE_ECPRI:
             ^~~~~~~~~~~~~~~~~~~~~
             RTE_TUNNEL_TYPE_NVGRE
../lib/librte_ethdev/rte_ethdev.h:1218:2: note: 'RTE_TUNNEL_TYPE_NVGRE' declared here
        RTE_TUNNEL_TYPE_NVGRE,
        ^
2 errors generated.
[1349/2709] Compiling C object drivers/libtmp_rte_net_ice.a.p/net_ice_ice_hash.c.o
[1350/2709] Compiling C object drivers/libtmp_rte_net_ice.a.p/net_ice_ice_rxtx.c.o
[1351/2709] Compiling C object drivers/libtmp_rte_net_ice.a.p/net_ice_ice_rxtx_vec_avx2.c.o
[1352/2709] Compiling C object drivers/libtmp_rte_net_ice.a.p/net_ice_ice_rxtx_vec_sse.c.o
[1353/2709] Compiling C object drivers/libtmp_rte_net_ice.a.p/net_ice_ice_dcf_vf_representor.c.o
[1354/2709] Compiling C object drivers/libtmp_rte_net_ice.a.p/net_ice_ice_switch_filter.c.o
[1355/2709] Compiling C object drivers/libtmp_rte_net_ice.a.p/net_ice_ice_dcf_parent.c.o
[1356/2709] Compiling C object drivers/libtmp_rte_net_ice.a.p/net_ice_ice_dcf.c.o
[1357/2709] Compiling C object drivers/libtmp_rte_net_ice.a.p/net_ice_ice_ethdev.c.o
ninja: build stopped




*Build Failed #14:
OS: SUSE15-64
Target: x86_64-native-linuxapp-gcc
FAILED: drivers/libtmp_rte_net_ice.a.p/net_ice_ice_dcf_ethdev.c.o 
gcc -Idrivers/libtmp_rte_net_ice.a.p -Idrivers -I../drivers -Idrivers/net/ice -I../drivers/net/ice -Idrivers/net/ice/base -I../drivers/net/ice/base -Idrivers/common/iavf -I../drivers/common/iavf -Ilib/librte_ethdev -I../lib/librte_ethdev -I. -I.. -Iconfig -I../config -Ilib/librte_eal/include -I../lib/librte_eal/include -Ilib/librte_eal/linux/include -I../lib/librte_eal/linux/include -Ilib/librte_eal/x86/include -I../lib/librte_eal/x86/include -Ilib/librte_eal/common -I../lib/librte_eal/common -Ilib/librte_eal -I../lib/librte_eal -Ilib/librte_kvargs -I../lib/librte_kvargs -Ilib/librte_metrics -I../lib/librte_metrics -Ilib/librte_telemetry -I../lib/librte_telemetry -Ilib/librte_net -I../lib/librte_net -Ilib/librte_mbuf -I../lib/librte_mbuf -Ilib/librte_mempool -I../lib/librte_mempool -Ilib/librte_ring -I../lib/librte_ring -Ilib/librte_meter -I../lib/librte_meter -Idrivers/bus/pci -I../drivers/bus/pci -I../drivers/bus/pci/linux -Ilib/librte_pci -I../lib/librte_pci -Idrivers/bus/vdev -I../drivers/bus/vdev -Ilib/librte_hash -I../lib/librte_hash -Ilib/librte_rcu -I../lib/librte_rcu -fdiagnostics-color=always -pipe -D_FILE_OFFSET_BITS=64 -Wall -Winvalid-pch -Werror -O3 -include rte_config.h -Wextra -Wcast-qual -Wdeprecated -Wformat -Wformat-nonliteral -Wformat-security -Wmissing-declarations -Wmissing-prototypes -Wnested-externs -Wold-style-definition -Wpointer-arith -Wsign-compare -Wstrict-prototypes -Wundef -Wwrite-strings -Wno-missing-field-initializers -D_GNU_SOURCE -fPIC -march=native -DALLOW_EXPERIMENTAL_API -DALLOW_INTERNAL_API -Wno-format-truncation -DCC_AVX512_SUPPORT -MD -MQ drivers/libtmp_rte_net_ice.a.p/net_ice_ice_dcf_ethdev.c.o -MF drivers/libtmp_rte_net_ice.a.p/net_ice_ice_dcf_ethdev.c.o.d -o drivers/libtmp_rte_net_ice.a.p/net_ice_ice_dcf_ethdev.c.o -c ../drivers/net/ice/ice_dcf_ethdev.c
../drivers/net/ice/ice_dcf_ethdev.c: In function ‘ice_dcf_dev_udp_tunnel_port_add’:
../drivers/net/ice/ice_dcf_ethdev.c:898:7: error: ‘RTE_TUNNEL_TYPE_ECPRI’ undeclared (first use in this function); did you mean ‘RTE_TUNNEL_TYPE_NVGRE’?
  case RTE_TUNNEL_TYPE_ECPRI:
       ^~~~~~~~~~~~~~~~~~~~~
       RTE_TUNNEL_TYPE_NVGRE
../drivers/net/ice/ice_dcf_ethdev.c:898:7: note: each undeclared identifier is reported only once for each function it appears in
../drivers/net/ice/ice_dcf_ethdev.c: In function ‘ice_dcf_dev_udp_tunnel_port_del’:
../drivers/net/ice/ice_dcf_ethdev.c:926:7: error: ‘RTE_TUNNEL_TYPE_ECPRI’ undeclared (first use in this function); did you mean ‘RTE_TUNNEL_TYPE_NVGRE’?
  case RTE_TUNNEL_TYPE_ECPRI:
       ^~~~~~~~~~~~~~~~~~~~~
       RTE_TUNNEL_TYPE_NVGRE
[1349/2707] Compiling C object drivers/libtmp_rte_net_ice.a.p/net_ice_ice_acl_filter.c.o
[1350/2707] Compiling C object drivers/libtmp_rte_net_ice.a.p/net_ice_ice_dcf_vf_representor.c.o
[1351/2707] Compiling C object drivers/libtmp_rte_net_ice.a.p/net_ice_ice_rxtx.c.o
[1352/2707] Compiling C object drivers/libtmp_rte_net_ice.a.p/net_ice_ice_dcf.c.o
[1353/2707] Compiling C object drivers/libtmp_rte_net_ice.a.p/net_ice_ice_rxtx_vec_avx2.c.o
[1354/2707] Compiling C object drivers/libtmp_rte_net_ice.a.p/net_ice_ice_ethdev.c.o
[1355/2707] Compiling C object drivers/libtmp_rte_net_ice.a.p/net_ice_ice_rxtx_vec_sse.c.o
ninja: build stopped




*Build Failed #15:
OS: CentOsStream8-64
Target: x86_64-native-linuxapp-gcc
FAILED: drivers/libtmp_rte_net_ice.a.p/net_ice_ice_dcf_ethdev.c.o 
gcc -Idrivers/libtmp_rte_net_ice.a.p -Idrivers -I../drivers -Idrivers/net/ice -I../drivers/net/ice -Idrivers/net/ice/base -I../drivers/net/ice/base -Idrivers/common/iavf -I../drivers/common/iavf -Ilib/librte_ethdev -I../lib/librte_ethdev -I. -I.. -Iconfig -I../config -Ilib/librte_eal/include -I../lib/librte_eal/include -Ilib/librte_eal/linux/include -I../lib/librte_eal/linux/include -Ilib/librte_eal/x86/include -I../lib/librte_eal/x86/include -Ilib/librte_eal/common -I../lib/librte_eal/common -Ilib/librte_eal -I../lib/librte_eal -Ilib/librte_kvargs -I../lib/librte_kvargs -Ilib/librte_metrics -I../lib/librte_metrics -Ilib/librte_telemetry -I../lib/librte_telemetry -Ilib/librte_net -I../lib/librte_net -Ilib/librte_mbuf -I../lib/librte_mbuf -Ilib/librte_mempool -I../lib/librte_mempool -Ilib/librte_ring -I../lib/librte_ring -Ilib/librte_meter -I../lib/librte_meter -Idrivers/bus/pci -I../drivers/bus/pci -I../drivers/bus/pci/linux -Ilib/librte_pci -I../lib/librte_pci -Idrivers/bus/vdev -I../drivers/bus/vdev -Ilib/librte_hash -I../lib/librte_hash -Ilib/librte_rcu -I../lib/librte_rcu -fdiagnostics-color=always -pipe -D_FILE_OFFSET_BITS=64 -Wall -Winvalid-pch -Werror -O3 -include rte_config.h -Wextra -Wcast-qual -Wdeprecated -Wformat -Wformat-nonliteral -Wformat-security -Wmissing-declarations -Wmissing-prototypes -Wnested-externs -Wold-style-definition -Wpointer-arith -Wsign-compare -Wstrict-prototypes -Wundef -Wwrite-strings -Wno-packed-not-aligned -Wno-missing-field-initializers -D_GNU_SOURCE -fPIC -march=native -DALLOW_EXPERIMENTAL_API -DALLOW_INTERNAL_API -Wno-format-truncation -DCC_AVX512_SUPPORT -MD -MQ drivers/libtmp_rte_net_ice.a.p/net_ice_ice_dcf_ethdev.c.o -MF drivers/libtmp_rte_net_ice.a.p/net_ice_ice_dcf_ethdev.c.o.d -o drivers/libtmp_rte_net_ice.a.p/net_ice_ice_dcf_ethdev.c.o -c ../drivers/net/ice/ice_dcf_ethdev.c
../drivers/net/ice/ice_dcf_ethdev.c: In function ‘ice_dcf_dev_udp_tunnel_port_add’:
../drivers/net/ice/ice_dcf_ethdev.c:898:7: error: ‘RTE_TUNNEL_TYPE_ECPRI’ undeclared (first use in this function); did you mean ‘RTE_TUNNEL_TYPE_NVGRE’?
  case RTE_TUNNEL_TYPE_ECPRI:
       ^~~~~~~~~~~~~~~~~~~~~
       RTE_TUNNEL_TYPE_NVGRE
../drivers/net/ice/ice_dcf_ethdev.c:898:7: note: each undeclared identifier is reported only once for each function it appears in
../drivers/net/ice/ice_dcf_ethdev.c: In function ‘ice_dcf_dev_udp_tunnel_port_del’:
../drivers/net/ice/ice_dcf_ethdev.c:926:7: error: ‘RTE_TUNNEL_TYPE_ECPRI’ undeclared (first use in this function); did you mean ‘RTE_TUNNEL_TYPE_NVGRE’?
  case RTE_TUNNEL_TYPE_ECPRI:
       ^~~~~~~~~~~~~~~~~~~~~
       RTE_TUNNEL_TYPE_NVGRE
[1363/2806] Compiling C object drivers/net/igc/base/libigc_base.a.p/igc_manage.c.o
[1364/2806] Compiling C object drivers/net/igc/base/libigc_base.a.p/igc_nvm.c.o
[1365/2806] Compiling C object drivers/net/igc/base/libigc_base.a.p/igc_base.c.o
[1366/2806] Compiling C object drivers/libtmp_rte_net_ice.a.p/net_ice_ice_dcf_vf_representor.c.o
[1367/2806] Compiling C object drivers/libtmp_rte_net_ice.a.p/net_ice_ice_dcf_parent.c.o
[1368/2806] Compiling C object drivers/net/igc/base/libigc_base.a.p/igc_mac.c.o
[1369/2806] Compiling C object drivers/libtmp_rte_net_ice.a.p/net_ice_ice_dcf.c.o
[1370/2806] Compiling C object drivers/libtmp_rte_net_ice.a.p/net_ice_ice_ethdev.c.o
[1371/2806] Compiling C object drivers/libtmp_rte_net_ice.a.p/net_ice_ice_rxtx_vec_avx2.c.o
[1372/2806] Compiling C object drivers/libtmp_rte_net_ice.a.p/net_ice_ice_rxtx.c.o
[1373/2806] Compiling C object drivers/libtmp_rte_net_ice.a.p/net_ice_ice_rxtx_vec_sse.c.o
ninja: build stopped




*Build Failed #16:
OS: UB2004-32
Target: i686-native-linuxapp-gcc
FAILED: drivers/libtmp_rte_net_ice.a.p/net_ice_ice_dcf_ethdev.c.o 
gcc -Idrivers/libtmp_rte_net_ice.a.p -Idrivers -I../drivers -Idrivers/net/ice -I../drivers/net/ice -Idrivers/net/ice/base -I../drivers/net/ice/base -Idrivers/common/iavf -I../drivers/common/iavf -Ilib/librte_ethdev -I../lib/librte_ethdev -I. -I.. -Iconfig -I../config -Ilib/librte_eal/include -I../lib/librte_eal/include -Ilib/librte_eal/linux/include -I../lib/librte_eal/linux/include -Ilib/librte_eal/x86/include -I../lib/librte_eal/x86/include -Ilib/librte_eal/common -I../lib/librte_eal/common -Ilib/librte_eal -I../lib/librte_eal -Ilib/librte_kvargs -I../lib/librte_kvargs -Ilib/librte_metrics -I../lib/librte_metrics -Ilib/librte_telemetry -I../lib/librte_telemetry -Ilib/librte_net -I../lib/librte_net -Ilib/librte_mbuf -I../lib/librte_mbuf -Ilib/librte_mempool -I../lib/librte_mempool -Ilib/librte_ring -I../lib/librte_ring -Ilib/librte_meter -I../lib/librte_meter -Idrivers/bus/pci -I../drivers/bus/pci -I../drivers/bus/pci/linux -Ilib/librte_pci -I../lib/librte_pci -Idrivers/bus/vdev -I../drivers/bus/vdev -Ilib/librte_hash -I../lib/librte_hash -Ilib/librte_rcu -I../lib/librte_rcu -fdiagnostics-color=always -pipe -D_FILE_OFFSET_BITS=64 -Wall -Winvalid-pch -Werror -O3 -include rte_config.h -Wextra -Wcast-qual -Wdeprecated -Wformat -Wformat-nonliteral -Wformat-security -Wmissing-declarations -Wmissing-prototypes -Wnested-externs -Wold-style-definition -Wpointer-arith -Wsign-compare -Wstrict-prototypes -Wundef -Wwrite-strings -Wno-address-of-packed-member -Wno-packed-not-aligned -Wno-missing-field-initializers -Wno-pointer-to-int-cast -D_GNU_SOURCE -m32 -fPIC -march=native -DALLOW_EXPERIMENTAL_API -DALLOW_INTERNAL_API -Wno-format-truncation -DCC_AVX512_SUPPORT -MD -MQ drivers/libtmp_rte_net_ice.a.p/net_ice_ice_dcf_ethdev.c.o -MF drivers/libtmp_rte_net_ice.a.p/net_ice_ice_dcf_ethdev.c.o.d -o drivers/libtmp_rte_net_ice.a.p/net_ice_ice_dcf_ethdev.c.o -c ../drivers/net/ice/ice_dcf_ethdev.c
../drivers/net/ice/ice_dcf_ethdev.c: In function ‘ice_dcf_dev_udp_tunnel_port_add’:
../drivers/net/ice/ice_dcf_ethdev.c:898:7: error: ‘RTE_TUNNEL_TYPE_ECPRI’ undeclared (first use in this function); did you mean ‘RTE_TUNNEL_TYPE_NVGRE’?
  898 |  case RTE_TUNNEL_TYPE_ECPRI:
      |       ^~~~~~~~~~~~~~~~~~~~~
      |       RTE_TUNNEL_TYPE_NVGRE
../drivers/net/ice/ice_dcf_ethdev.c:898:7: note: each undeclared identifier is reported only once for each function it appears in
../drivers/net/ice/ice_dcf_ethdev.c: In function ‘ice_dcf_dev_udp_tunnel_port_del’:
../drivers/net/ice/ice_dcf_ethdev.c:926:7: error: ‘RTE_TUNNEL_TYPE_ECPRI’ undeclared (first use in this function); did you mean ‘RTE_TUNNEL_TYPE_NVGRE’?
  926 |  case RTE_TUNNEL_TYPE_ECPRI:
      |       ^~~~~~~~~~~~~~~~~~~~~
      |       RTE_TUNNEL_TYPE_NVGRE
[1195/2362] Generating rte_net_ice_def with a custom command
[1196/2362] Compiling C object drivers/libtmp_rte_net_ice.a.p/net_ice_ice_dcf_vf_representor.c.o
[1197/2362] Compiling C object drivers/net/ice/base/libice_base.a.p/ice_switch.c.o
[1198/2362] Compiling C object drivers/libtmp_rte_net_ice.a.p/net_ice_ice_dcf.c.o
[1199/2362] Compiling C object drivers/libtmp_rte_net_ice.a.p/net_ice_ice_ethdev.c.o
[1200/2362] Compiling C object drivers/libtmp_rte_net_ice.a.p/net_ice_ice_dcf_parent.c.o
[1201/2362] Compiling C object drivers/libtmp_rte_net_ice.a.p/net_ice_ice_rxtx.c.o
[1202/2362] Compiling C object drivers/libtmp_rte_net_ice.a.p/net_ice_ice_rxtx_vec_avx2.c.o
[1203/2362] Compiling C object drivers/libtmp_rte_net_ice.a.p/net_ice_ice_rxtx_vec_sse.c.o
ninja: build stopped




*Build Failed #17:
OS: UB2004-64
Target: x86_64-native-linuxapp-clang
FAILED: drivers/libtmp_rte_net_ice.a.p/net_ice_ice_dcf_ethdev.c.o 
clang -Idrivers/libtmp_rte_net_ice.a.p -Idrivers -I../drivers -Idrivers/net/ice -I../drivers/net/ice -Idrivers/net/ice/base -I../drivers/net/ice/base -Idrivers/common/iavf -I../drivers/common/iavf -Ilib/librte_ethdev -I../lib/librte_ethdev -I. -I.. -Iconfig -I../config -Ilib/librte_eal/include -I../lib/librte_eal/include -Ilib/librte_eal/linux/include -I../lib/librte_eal/linux/include -Ilib/librte_eal/x86/include -I../lib/librte_eal/x86/include -Ilib/librte_eal/common -I../lib/librte_eal/common -Ilib/librte_eal -I../lib/librte_eal -Ilib/librte_kvargs -I../lib/librte_kvargs -Ilib/librte_metrics -I../lib/librte_metrics -Ilib/librte_telemetry -I../lib/librte_telemetry -Ilib/librte_net -I../lib/librte_net -Ilib/librte_mbuf -I../lib/librte_mbuf -Ilib/librte_mempool -I../lib/librte_mempool -Ilib/librte_ring -I../lib/librte_ring -Ilib/librte_meter -I../lib/librte_meter -Idrivers/bus/pci -I../drivers/bus/pci -I../drivers/bus/pci/linux -Ilib/librte_pci -I../lib/librte_pci -Idrivers/bus/vdev -I../drivers/bus/vdev -Ilib/librte_hash -I../lib/librte_hash -Ilib/librte_rcu -I../lib/librte_rcu -Xclang -fcolor-diagnostics -pipe -D_FILE_OFFSET_BITS=64 -Wall -Winvalid-pch -Werror -O3 -include rte_config.h -Wextra -Wcast-qual -Wdeprecated -Wformat -Wformat-nonliteral -Wformat-security -Wmissing-declarations -Wmissing-prototypes -Wnested-externs -Wold-style-definition -Wpointer-arith -Wsign-compare -Wstrict-prototypes -Wundef -Wwrite-strings -Wno-address-of-packed-member -Wno-missing-field-initializers -D_GNU_SOURCE -fPIC -march=native -DALLOW_EXPERIMENTAL_API -DALLOW_INTERNAL_API -DCC_AVX512_SUPPORT -MD -MQ drivers/libtmp_rte_net_ice.a.p/net_ice_ice_dcf_ethdev.c.o -MF drivers/libtmp_rte_net_ice.a.p/net_ice_ice_dcf_ethdev.c.o.d -o drivers/libtmp_rte_net_ice.a.p/net_ice_ice_dcf_ethdev.c.o -c ../drivers/net/ice/ice_dcf_ethdev.c
../drivers/net/ice/ice_dcf_ethdev.c:898:7: error: use of undeclared identifier 'RTE_TUNNEL_TYPE_ECPRI'; did you mean 'RTE_TUNNEL_TYPE_NVGRE'?
        case RTE_TUNNEL_TYPE_ECPRI:
             ^~~~~~~~~~~~~~~~~~~~~
             RTE_TUNNEL_TYPE_NVGRE
../lib/librte_ethdev/rte_ethdev.h:1218:2: note: 'RTE_TUNNEL_TYPE_NVGRE' declared here
        RTE_TUNNEL_TYPE_NVGRE,
        ^
../drivers/net/ice/ice_dcf_ethdev.c:926:7: error: use of undeclared identifier 'RTE_TUNNEL_TYPE_ECPRI'; did you mean 'RTE_TUNNEL_TYPE_NVGRE'?
        case RTE_TUNNEL_TYPE_ECPRI:
             ^~~~~~~~~~~~~~~~~~~~~
             RTE_TUNNEL_TYPE_NVGRE
../lib/librte_ethdev/rte_ethdev.h:1218:2: note: 'RTE_TUNNEL_TYPE_NVGRE' declared here
        RTE_TUNNEL_TYPE_NVGRE,
        ^
2 errors generated.
[1361/2802] Compiling C object drivers/net/igc/base/libigc_base.a.p/igc_mac.c.o
[1362/2802] Compiling C object drivers/libtmp_rte_net_ice.a.p/net_ice_ice_dcf_vf_representor.c.o
[1363/2802] Compiling C object drivers/net/igc/base/libigc_base.a.p/igc_i225.c.o
[1364/2802] Compiling C object drivers/libtmp_rte_net_ice.a.p/net_ice_ice_ethdev.c.o
[1365/2802] Compiling C object drivers/libtmp_rte_net_ice.a.p/net_ice_ice_dcf.c.o
[1366/2802] Compiling C object drivers/net/igc/base/libigc_base.a.p/igc_nvm.c.o
[1367/2802] Compiling C object drivers/libtmp_rte_net_ice.a.p/net_ice_ice_dcf_parent.c.o
[1368/2802] Compiling C object drivers/libtmp_rte_net_ice.a.p/net_ice_ice_rxtx_vec_avx2.c.o
[1369/2802] Compiling C object drivers/libtmp_rte_net_ice.a.p/net_ice_ice_rxtx_vec_sse.c.o
ninja: build stopped




*Build Failed #18:
OS: UB2004-64
Target: x86_64-native-linuxapp-gcc
FAILED: drivers/libtmp_rte_net_ice.a.p/net_ice_ice_dcf_ethdev.c.o 
gcc -Idrivers/libtmp_rte_net_ice.a.p -Idrivers -I../drivers -Idrivers/net/ice -I../drivers/net/ice -Idrivers/net/ice/base -I../drivers/net/ice/base -Idrivers/common/iavf -I../drivers/common/iavf -Ilib/librte_ethdev -I../lib/librte_ethdev -I. -I.. -Iconfig -I../config -Ilib/librte_eal/include -I../lib/librte_eal/include -Ilib/librte_eal/linux/include -I../lib/librte_eal/linux/include -Ilib/librte_eal/x86/include -I../lib/librte_eal/x86/include -Ilib/librte_eal/common -I../lib/librte_eal/common -Ilib/librte_eal -I../lib/librte_eal -Ilib/librte_kvargs -I../lib/librte_kvargs -Ilib/librte_metrics -I../lib/librte_metrics -Ilib/librte_telemetry -I../lib/librte_telemetry -Ilib/librte_net -I../lib/librte_net -Ilib/librte_mbuf -I../lib/librte_mbuf -Ilib/librte_mempool -I../lib/librte_mempool -Ilib/librte_ring -I../lib/librte_ring -Ilib/librte_meter -I../lib/librte_meter -Idrivers/bus/pci -I../drivers/bus/pci -I../drivers/bus/pci/linux -Ilib/librte_pci -I../lib/librte_pci -Idrivers/bus/vdev -I../drivers/bus/vdev -Ilib/librte_hash -I../lib/librte_hash -Ilib/librte_rcu -I../lib/librte_rcu -fdiagnostics-color=always -pipe -D_FILE_OFFSET_BITS=64 -Wall -Winvalid-pch -Werror -O3 -include rte_config.h -Wextra -Wcast-qual -Wdeprecated -Wformat -Wformat-nonliteral -Wformat-security -Wmissing-declarations -Wmissing-prototypes -Wnested-externs -Wold-style-definition -Wpointer-arith -Wsign-compare -Wstrict-prototypes -Wundef -Wwrite-strings -Wno-address-of-packed-member -Wno-packed-not-aligned -Wno-missing-field-initializers -Wno-zero-length-bounds -D_GNU_SOURCE -fPIC -march=native -DALLOW_EXPERIMENTAL_API -DALLOW_INTERNAL_API -Wno-format-truncation -DCC_AVX512_SUPPORT -MD -MQ drivers/libtmp_rte_net_ice.a.p/net_ice_ice_dcf_ethdev.c.o -MF drivers/libtmp_rte_net_ice.a.p/net_ice_ice_dcf_ethdev.c.o.d -o drivers/libtmp_rte_net_ice.a.p/net_ice_ice_dcf_ethdev.c.o -c ../drivers/net/ice/ice_dcf_ethdev.c
../drivers/net/ice/ice_dcf_ethdev.c: In function ‘ice_dcf_dev_udp_tunnel_port_add’:
../drivers/net/ice/ice_dcf_ethdev.c:898:7: error: ‘RTE_TUNNEL_TYPE_ECPRI’ undeclared (first use in this function); did you mean ‘RTE_TUNNEL_TYPE_NVGRE’?
  898 |  case RTE_TUNNEL_TYPE_ECPRI:
      |       ^~~~~~~~~~~~~~~~~~~~~
      |       RTE_TUNNEL_TYPE_NVGRE
../drivers/net/ice/ice_dcf_ethdev.c:898:7: note: each undeclared identifier is reported only once for each function it appears in
../drivers/net/ice/ice_dcf_ethdev.c: In function ‘ice_dcf_dev_udp_tunnel_port_del’:
../drivers/net/ice/ice_dcf_ethdev.c:926:7: error: ‘RTE_TUNNEL_TYPE_ECPRI’ undeclared (first use in this function); did you mean ‘RTE_TUNNEL_TYPE_NVGRE’?
  926 |  case RTE_TUNNEL_TYPE_ECPRI:
      |       ^~~~~~~~~~~~~~~~~~~~~
      |       RTE_TUNNEL_TYPE_NVGRE
[1361/2802] Compiling C object drivers/net/igc/base/libigc_base.a.p/igc_mac.c.o
[1362/2802] Compiling C object drivers/net/igc/base/libigc_base.a.p/igc_i225.c.o
[1363/2802] Compiling C object drivers/libtmp_rte_net_ice.a.p/net_ice_ice_dcf_parent.c.o
[1364/2802] Compiling C object drivers/libtmp_rte_net_ice.a.p/net_ice_ice_rxtx.c.o
[1365/2802] Compiling C object drivers/libtmp_rte_net_ice.a.p/net_ice_ice_rxtx_vec_avx2.c.o
[1366/2802] Compiling C object drivers/net/igc/base/libigc_base.a.p/igc_nvm.c.o
[1367/2802] Compiling C object drivers/libtmp_rte_net_ice.a.p/net_ice_ice_dcf.c.o
[1368/2802] Compiling C object drivers/libtmp_rte_net_ice.a.p/net_ice_ice_ethdev.c.o
[1369/2802] Compiling C object drivers/libtmp_rte_net_ice.a.p/net_ice_ice_rxtx_vec_sse.c.o
ninja: build stopped




*Build Failed #19:
OS: UB2004-64
Target: x86_64-native-linuxapp-icc
FAILED: drivers/libtmp_rte_net_ice.a.p/net_ice_ice_dcf_ethdev.c.o 
icc -Idrivers/libtmp_rte_net_ice.a.p -Idrivers -I../drivers -Idrivers/net/ice -I../drivers/net/ice -Idrivers/net/ice/base -I../drivers/net/ice/base -Idrivers/common/iavf -I../drivers/common/iavf -Ilib/librte_ethdev -I../lib/librte_ethdev -I. -I.. -Iconfig -I../config -Ilib/librte_eal/include -I../lib/librte_eal/include -Ilib/librte_eal/linux/include -I../lib/librte_eal/linux/include -Ilib/librte_eal/x86/include -I../lib/librte_eal/x86/include -Ilib/librte_eal/common -I../lib/librte_eal/common -Ilib/librte_eal -I../lib/librte_eal -Ilib/librte_kvargs -I../lib/librte_kvargs -Ilib/librte_metrics -I../lib/librte_metrics -Ilib/librte_telemetry -I../lib/librte_telemetry -Ilib/librte_net -I../lib/librte_net -Ilib/librte_mbuf -I../lib/librte_mbuf -Ilib/librte_mempool -I../lib/librte_mempool -Ilib/librte_ring -I../lib/librte_ring -Ilib/librte_meter -I../lib/librte_meter -Idrivers/bus/pci -I../drivers/bus/pci -I../drivers/bus/pci/linux -Ilib/librte_pci -I../lib/librte_pci -Idrivers/bus/vdev -I../drivers/bus/vdev -Ilib/librte_hash -I../lib/librte_hash -Ilib/librte_rcu -I../lib/librte_rcu -pipe -D_FILE_OFFSET_BITS=64 -Wall -w3 -diag-disable:remark -Werror -O3 -include rte_config.h -Wextra -Wcast-qual -Wdeprecated -Wformat -Wformat-security -Wmissing-declarations -Wmissing-prototypes -Wold-style-definition -Wpointer-arith -Wsign-compare -Wstrict-prototypes -Wundef -Wwrite-strings -Wno-missing-field-initializers -diag-disable=181 -diag-disable=188 -diag-disable=2203 -diag-disable=2279 -diag-disable=2557 -diag-disable=3179 -diag-disable=3656 -D_GNU_SOURCE -fPIC -march=native -DALLOW_EXPERIMENTAL_API -DALLOW_INTERNAL_API -DCC_AVX512_SUPPORT -MD -MQ drivers/libtmp_rte_net_ice.a.p/net_ice_ice_dcf_ethdev.c.o -MF drivers/libtmp_rte_net_ice.a.p/net_ice_ice_dcf_ethdev.c.o.d -o drivers/libtmp_rte_net_ice.a.p/net_ice_ice_dcf_ethdev.c.o -c ../drivers/net/ice/ice_dcf_ethdev.c
../drivers/net/ice/ice_dcf_ethdev.c(898): error: identifier "RTE_TUNNEL_TYPE_ECPRI" is undefined
  	case RTE_TUNNEL_TYPE_ECPRI:
  	     ^

../drivers/net/ice/ice_dcf_ethdev.c(926): error: identifier "RTE_TUNNEL_TYPE_ECPRI" is undefined
  	case RTE_TUNNEL_TYPE_ECPRI:
  	     ^

compilation aborted for ../drivers/net/ice/ice_dcf_ethdev.c (code 2)
[1349/2756] Compiling C object drivers/net/ice/base/libice_base.a.p/ice_fdir.c.o
[1350/2756] Compiling C object drivers/libtmp_rte_net_ice.a.p/net_ice_ice_fdir_filter.c.o
[1351/2756] Compiling C object drivers/net/ice/libice_avx512_lib.a.p/ice_rxtx_vec_avx512.c.o
[1352/2756] Compiling C object drivers/libtmp_rte_net_ice.a.p/net_ice_ice_dcf.c.o
[1353/2756] Compiling C object drivers/libtmp_rte_net_ice.a.p/net_ice_ice_dcf_vf_representor.c.o
[1354/2756] Compiling C object drivers/libtmp_rte_net_ice.a.p/net_ice_ice_dcf_parent.c.o
[1355/2756] Compiling C object drivers/libtmp_rte_net_ice.a.p/net_ice_ice_rxtx.c.o
[1356/2756] Compiling C object drivers/libtmp_rte_net_ice.a.p/net_ice_ice_rxtx_vec_avx2.c.o
[1357/2756] Compiling C object drivers/libtmp_rte_net_ice.a.p/net_ice_ice_rxtx_vec_sse.c.o
ninja: build stopped




*Build Failed #20:
OS: UB2004-64
Target: x86_64-native-linuxapp-doc
FAILED: drivers/libtmp_rte_net_ice.a.p/net_ice_ice_dcf_ethdev.c.o 
gcc -Idrivers/libtmp_rte_net_ice.a.p -Idrivers -I../drivers -Idrivers/net/ice -I../drivers/net/ice -Idrivers/net/ice/base -I../drivers/net/ice/base -Idrivers/common/iavf -I../drivers/common/iavf -Ilib/librte_ethdev -I../lib/librte_ethdev -I. -I.. -Iconfig -I../config -Ilib/librte_eal/include -I../lib/librte_eal/include -Ilib/librte_eal/linux/include -I../lib/librte_eal/linux/include -Ilib/librte_eal/x86/include -I../lib/librte_eal/x86/include -Ilib/librte_eal/common -I../lib/librte_eal/common -Ilib/librte_eal -I../lib/librte_eal -Ilib/librte_kvargs -I../lib/librte_kvargs -Ilib/librte_metrics -I../lib/librte_metrics -Ilib/librte_telemetry -I../lib/librte_telemetry -Ilib/librte_net -I../lib/librte_net -Ilib/librte_mbuf -I../lib/librte_mbuf -Ilib/librte_mempool -I../lib/librte_mempool -Ilib/librte_ring -I../lib/librte_ring -Ilib/librte_meter -I../lib/librte_meter -Idrivers/bus/pci -I../drivers/bus/pci -I../drivers/bus/pci/linux -Ilib/librte_pci -I../lib/librte_pci -Idrivers/bus/vdev -I../drivers/bus/vdev -Ilib/librte_hash -I../lib/librte_hash -Ilib/librte_rcu -I../lib/librte_rcu -fdiagnostics-color=always -pipe -D_FILE_OFFSET_BITS=64 -Wall -Winvalid-pch -Werror -O3 -include rte_config.h -Wextra -Wcast-qual -Wdeprecated -Wformat -Wformat-nonliteral -Wformat-security -Wmissing-declarations -Wmissing-prototypes -Wnested-externs -Wold-style-definition -Wpointer-arith -Wsign-compare -Wstrict-prototypes -Wundef -Wwrite-strings -Wno-address-of-packed-member -Wno-packed-not-aligned -Wno-missing-field-initializers -D_GNU_SOURCE -fPIC -march=native -DALLOW_EXPERIMENTAL_API -DALLOW_INTERNAL_API -Wno-format-truncation -DCC_AVX512_SUPPORT -MD -MQ drivers/libtmp_rte_net_ice.a.p/net_ice_ice_dcf_ethdev.c.o -MF drivers/libtmp_rte_net_ice.a.p/net_ice_ice_dcf_ethdev.c.o.d -o drivers/libtmp_rte_net_ice.a.p/net_ice_ice_dcf_ethdev.c.o -c ../drivers/net/ice/ice_dcf_ethdev.c
../drivers/net/ice/ice_dcf_ethdev.c: In function ‘ice_dcf_dev_udp_tunnel_port_add’:
../drivers/net/ice/ice_dcf_ethdev.c:898:7: error: ‘RTE_TUNNEL_TYPE_ECPRI’ undeclared (first use in this function); did you mean ‘RTE_TUNNEL_TYPE_NVGRE’?
  898 |  case RTE_TUNNEL_TYPE_ECPRI:
      |       ^~~~~~~~~~~~~~~~~~~~~
      |       RTE_TUNNEL_TYPE_NVGRE
../drivers/net/ice/ice_dcf_ethdev.c:898:7: note: each undeclared identifier is reported only once for each function it appears in
../drivers/net/ice/ice_dcf_ethdev.c: In function ‘ice_dcf_dev_udp_tunnel_port_del’:
../drivers/net/ice/ice_dcf_ethdev.c:926:7: error: ‘RTE_TUNNEL_TYPE_ECPRI’ undeclared (first use in this function); did you mean ‘RTE_TUNNEL_TYPE_NVGRE’?
  926 |  case RTE_TUNNEL_TYPE_ECPRI:
      |       ^~~~~~~~~~~~~~~~~~~~~
      |       RTE_TUNNEL_TYPE_NVGRE
[1358/2612] Compiling C object drivers/libtmp_rte_net_ice.a.p/net_ice_ice_dcf_vf_representor.c.o
[1359/2612] Compiling C object drivers/libtmp_rte_net_ice.a.p/net_ice_ice_acl_filter.c.o
[1360/2612] Compiling C object drivers/net/igc/base/libigc_base.a.p/igc_mac.c.o
[1361/2612] Compiling C object drivers/libtmp_rte_net_ice.a.p/net_ice_ice_dcf_parent.c.o
[1362/2612] Compiling C object drivers/libtmp_rte_net_ice.a.p/net_ice_ice_dcf.c.o
[1363/2612] Compiling C object drivers/libtmp_rte_net_ice.a.p/net_ice_ice_ethdev.c.o
[1364/2612] Compiling C object drivers/libtmp_rte_net_ice.a.p/net_ice_ice_rxtx.c.o
[1365/2612] Compiling C object drivers/libtmp_rte_net_ice.a.p/net_ice_ice_rxtx_vec_avx2.c.o
[1366/2612] Compiling C object drivers/libtmp_rte_net_ice.a.p/net_ice_ice_rxtx_vec_sse.c.o
ninja: build stopped




*Build Failed #21:
OS: UB2010-64
Target: x86_64-native-linuxapp-gcc
FAILED: drivers/a715181@@tmp_rte_net_ice@sta/net_ice_ice_dcf_ethdev.c.o 
gcc -Idrivers/a715181@@tmp_rte_net_ice@sta -Idrivers -I../drivers -Idrivers/net/ice -I../drivers/net/ice -Idrivers/net/ice/base -I../drivers/net/ice/base -Idrivers/net/ice/../../common/iavf -I../drivers/net/ice/../../common/iavf -Ilib/librte_ethdev -I../lib/librte_ethdev -I. -I../ -Iconfig -I../config -Ilib/librte_eal/include -I../lib/librte_eal/include -Ilib/librte_eal/linux/include -I../lib/librte_eal/linux/include -Ilib/librte_eal/x86/include -I../lib/librte_eal/x86/include -Ilib/librte_eal/common -I../lib/librte_eal/common -Ilib/librte_eal -I../lib/librte_eal -Ilib/librte_kvargs -I../lib/librte_kvargs -Ilib/librte_telemetry/../librte_metrics -I../lib/librte_telemetry/../librte_metrics -Ilib/librte_telemetry -I../lib/librte_telemetry -Ilib/librte_net -I../lib/librte_net -Ilib/librte_mbuf -I../lib/librte_mbuf -Ilib/librte_mempool -I../lib/librte_mempool -Ilib/librte_ring -I../lib/librte_ring -Ilib/librte_meter -I../lib/librte_meter -Idrivers/bus/pci -I../drivers/bus/pci -I../drivers/bus/pci/linux -Ilib/librte_pci -I../lib/librte_pci -Idrivers/bus/vdev -I../drivers/bus/vdev -Ilib/librte_hash -I../lib/librte_hash -Ilib/librte_rcu -I../lib/librte_rcu -Idrivers/common/iavf -I../drivers/common/iavf -fdiagnostics-color=always -pipe -D_FILE_OFFSET_BITS=64 -Wall -Winvalid-pch -Werror -O3 -include rte_config.h -Wextra -Wcast-qual -Wdeprecated -Wformat -Wformat-nonliteral -Wformat-security -Wmissing-declarations -Wmissing-prototypes -Wnested-externs -Wold-style-definition -Wpointer-arith -Wsign-compare -Wstrict-prototypes -Wundef -Wwrite-strings -Wno-address-of-packed-member -Wno-packed-not-aligned -Wno-missing-field-initializers -Wno-zero-length-bounds -D_GNU_SOURCE -fPIC -march=native -DALLOW_EXPERIMENTAL_API -DALLOW_INTERNAL_API -Wno-format-truncation -DCC_AVX512_SUPPORT -MD -MQ 'drivers/a715181@@tmp_rte_net_ice@sta/net_ice_ice_dcf_ethdev.c.o' -MF 'drivers/a715181@@tmp_rte_net_ice@sta/net_ice_ice_dcf_ethdev.c.o.d' -o 'drivers/a715181@@tmp_rte_net_ice@sta/net_ice_ice_dcf_ethdev.c.o' -c ../drivers/net/ice/ice_dcf_ethdev.c
../drivers/net/ice/ice_dcf_ethdev.c: In function ‘ice_dcf_dev_udp_tunnel_port_add’:
../drivers/net/ice/ice_dcf_ethdev.c:898:7: error: ‘RTE_TUNNEL_TYPE_ECPRI’ undeclared (first use in this function); did you mean ‘RTE_TUNNEL_TYPE_NVGRE’?
  898 |  case RTE_TUNNEL_TYPE_ECPRI:
      |       ^~~~~~~~~~~~~~~~~~~~~
      |       RTE_TUNNEL_TYPE_NVGRE
../drivers/net/ice/ice_dcf_ethdev.c:898:7: note: each undeclared identifier is reported only once for each function it appears in
../drivers/net/ice/ice_dcf_ethdev.c: In function ‘ice_dcf_dev_udp_tunnel_port_del’:
../drivers/net/ice/ice_dcf_ethdev.c:926:7: error: ‘RTE_TUNNEL_TYPE_ECPRI’ undeclared (first use in this function); did you mean ‘RTE_TUNNEL_TYPE_NVGRE’?
  926 |  case RTE_TUNNEL_TYPE_ECPRI:
      |       ^~~~~~~~~~~~~~~~~~~~~
      |       RTE_TUNNEL_TYPE_NVGRE
[1360/2805] Generating rte_net_ice_mingw with a custom command.
[1361/2805] Compiling C object 'drivers/a715181@@tmp_rte_net_ice@sta/net_ice_ice_switch_filter.c.o'.
[1362/2805] Compiling C object 'drivers/a715181@@tmp_rte_net_ice@sta/net_ice_ice_dcf.c.o'.
[1363/2805] Compiling C object 'drivers/a715181@@tmp_rte_net_ice@sta/net_ice_ice_dcf_vf_representor.c.o'.
[1364/2805] Compiling C object 'drivers/a715181@@tmp_rte_net_ice@sta/net_ice_ice_dcf_parent.c.o'.
[1365/2805] Compiling C object 'drivers/a715181@@tmp_rte_net_ice@sta/net_ice_ice_rxtx_vec_avx2.c.o'.
[1366/2805] Compiling C object 'drivers/a715181@@tmp_rte_net_ice@sta/net_ice_ice_rxtx.c.o'.
[1367/2805] Compiling C object 'drivers/a715181@@tmp_rte_net_ice@sta/net_ice_ice_ethdev.c.o'.
[1368/2805] Compiling C object 'drivers/a715181@@tmp_rte_net_ice@sta/net_ice_ice_rxtx_vec_sse.c.o'.
ninja: build stopped


DPDK STV team

^ permalink raw reply	[flat|nested] only message in thread

only message in thread, other threads:[~2021-01-13 14:26 UTC | newest]

Thread overview: (only message) (download: mbox.gz / follow: Atom feed)
-- links below jump to the message on this page --
2021-01-13 14:26 [dpdk-test-report] |FAILURE| pw(86472) [v3, 3/3] net/ice: enable ecpri tunnel port configure in dcf sys_stv

automatic DPDK test reports

This inbox may be cloned and mirrored by anyone:

	git clone --mirror http://inbox.dpdk.org/test-report/0 test-report/git/0.git

	# If you have public-inbox 1.1+ installed, you may
	# initialize and index your mirror using the following commands:
	public-inbox-init -V2 test-report test-report/ http://inbox.dpdk.org/test-report \
		test-report@dpdk.org
	public-inbox-index test-report

Example config snippet for mirrors.
Newsgroup available over NNTP:
	nntp://inbox.dpdk.org/inbox.dpdk.test-report


AGPL code for this site: git clone https://public-inbox.org/public-inbox.git