automatic DPDK test reports
 help / color / mirror / Atom feed
* compilation|FAILURE| pw(152725) sid(34964) job(PER_PATCH_BUILD15362)[v4, 4/4] net/macb: add necessary docs and update related files
@ 2025-04-02  7:43 sys_stv
  0 siblings, 0 replies; only message in thread
From: sys_stv @ 2025-04-02  7:43 UTC (permalink / raw)
  To: test-report, liwencheng

[-- Attachment #1: Type: text/plain, Size: 8742 bytes --]


Test-Label: Intel-compilation
Test-Status: FAILURE
http://dpdk.org/patch/152725

_Compilation issues_

Submitter: liwencheng <liwencheng@phytium.com.cn>
Date: 2025-04-02 07:11:11
Reply_mail: <1743577871-120091-1-git-send-email-liwencheng@phytium.com.cn>

DPDK git baseline: Repo:dpdk, CommitID: edd3f4b1265e6da707c46ca9b6c39d332647baea


Meson Build Summary: 23 Builds Done, 22 Successful, 1 Failures, 0 Blocked

+------------------+------------+--------------+------------+------------+-----------+----------+------------+
| os               | gcc-static | clang-static | icc-static | gcc-shared | gcc-debug | document | gcc-16byte |
+------------------+------------+--------------+------------+------------+-----------+----------+------------+
| OpenAnolis8.9-64 | pass       |              |            |            |           |          |            |
| FreeBSD14-64     | pass       | pass         |            | pass       | pass      |          |            |
| RHEL94-64        | pass       | pass         |            | pass       | pass      |          |            |
| SUSE15-64        | pass       | pass         |            |            |           |          |            |
| AzureLinux3.0-64 | pass       |              |            |            |           |          |            |
| UB2404-32        | fail       |              |            |            |           |          |            |
| RHEL10-64        | pass       |              |            |            |           |          |            |
| UB2404-64        | pass       | pass         |            |            |           | pass     | pass       |
| RHEL95-64Rt      | pass       |              |            |            |           |          |            |
| UB2410-64        | pass       |              |            |            |           |          |            |
| FC41-64          | pass       | pass         |            |            |           |          |            |
| UB2404-64Rt      | pass       |              |            |            |           |          |            |
+------------------+------------+--------------+------------+------------+-----------+----------+------------+

Comments: 
Because of DPDK bug (https://bugs.dpdk.org/show_bug.cgi?id=928),
All the dpdk-next-* branch add `Ddisable_drivers=event/cnxk` option when build with ICC complier. 
 
Test environment and configuration as below:


OS: OpenAnolis8.9-64
	Kernel Version: 5.10.134-16.2.an8.x86_64
	GCC Version: gcc (GCC) 8.5.0 20210514 (Anolis 8.5.0-22.0.1)
	Clang Version: 15.0.7 (Anolis 15.0.7-1.0.3.module+an8.8.0+11135+e398acfc)
	x86_64-native-linuxapp-gcc

OS: FreeBSD14-64
	Kernel Version: 14.2-RELEASE
	GCC Version: gcc (FreeBSD Ports Collection) 13.3.0
	Clang Version: 18.1.6 (https://github.com/llvm/llvm-project.git llvmorg-18.1.6-0-g1118c2e05e67)
	x86_64-native-bsdapp-gcc
	x86_64-native-bsdapp-clang
	x86_64-native-bsdapp-gcc+shared
	x86_64-native-bsdapp-gcc+debug

OS: RHEL94-64
	Kernel Version: 5.14.0-427.13.1.el9_4.x86_64
	GCC Version: gcc (GCC) 11.4.1 20231218 (Red Hat 11.4.1-3)
	Clang Version: 17.0.6 (Red Hat, Inc. 17.0.6-5.el9)
	x86_64-native-linuxapp-gcc
	x86_64-native-linuxapp-clang
	x86_64-native-linuxapp-gcc+shared
	x86_64-native-linuxapp-gcc+debug

OS: SUSE15-64
	Kernel Version: 6.4.0-150600.21-default
	GCC Version: gcc (SUSE Linux) 7.5.0
	Clang Version: 17.0.6
	x86_64-native-linuxapp-clang
	x86_64-native-linuxapp-gcc

OS: AzureLinux3.0-64
	Kernel Version: 6.6.47.1-1.azl3
	GCC Version: gcc (GCC) 13.2.0
	Clang Version: 18.1.2
	x86_64-native-linuxapp-gcc

OS: UB2404-32
	Kernel Version: 6.8.0-41-generic
	GCC Version: gcc (Ubuntu 13.2.0-23ubuntu4) 13.2.0
	Clang Version: NA
	i686-native-linuxapp-gcc

OS: RHEL10-64
	Kernel Version: 6.11.0-0.rc5.23.el10.x86_64
	GCC Version: gcc (GCC) 14.2.1 20240801 (Red Hat 14.2.1-1)
	Clang Version: 18.1.8 (Red Hat, Inc. 18.1.8-1.el10)
	x86_64-native-linuxapp-gcc

OS: UB2404-64
	Kernel Version: 6.8.0-41-generic
	GCC Version: gcc (Ubuntu 13.2.0-23ubuntu4) 13.2.0
	Clang Version: NA
	x86_64-native-linuxapp-gcc+16byte
	x86_64-native-linuxapp-gcc
	x86_64-native-linuxapp-clang
	x86_64-native-linuxapp-doc

OS: RHEL95-64Rt
	Kernel Version: 5.14.0-503.11.1.el9_5.x86_64+rt
	GCC Version: gcc (GCC) 11.5.0 20240719 (Red Hat 11.5.0-2)
	Clang Version: 18.1.8 (Red Hat, Inc. 18.1.8-3.el9)
	x86_64-native-linuxapp-gcc

OS: UB2410-64
	Kernel Version: 6.11.0-8-generic
	GCC Version: gcc (Ubuntu 14.2.0-4ubuntu2) 14.2.0
	Clang Version: 19.1.1 (1ubuntu1)
	x86_64-native-linuxapp-gcc

OS: FC41-64
	Kernel Version: 6.11.4-301.fc41.x86_64
	GCC Version: gcc (GCC) 14.2.1 20240912 (Red Hat 14.2.1-3)
	Clang Version: 19.1.5 (Fedora 19.1.5-1.fc41)
	x86_64-native-linuxapp-gcc
	x86_64-native-linuxapp-clang

OS: UB2404-64Rt
	Kernel Version: 6.8.0-rt8
	GCC Version: gcc (Ubuntu 13.2.0-23ubuntu4) 13.2.0
	Clang Version: NA
	x86_64-native-linuxapp-gcc



*Build Failed #1:
OS: UB2404-32
Target: i686-native-linuxapp-gcc
FAILED: drivers/net/macb/base/libmacb_base.a.p/macb_uio.c.o 
gcc -Idrivers/net/macb/base/libmacb_base.a.p -Idrivers/net/macb/base -I../drivers/net/macb/base -I. -I.. -Iconfig -I../config -Ilib/eal/include -I../lib/eal/include -Ilib/eal/linux/include -I../lib/eal/linux/include -Ilib/eal/x86/include -I../lib/eal/x86/include -I../kernel/linux -Ilib/eal/common -I../lib/eal/common -Ilib/eal -I../lib/eal -Ilib/kvargs -I../lib/kvargs -Ilib/log -I../lib/log -Ilib/metrics -I../lib/metrics -Ilib/telemetry -I../lib/telemetry -fdiagnostics-color=always -D_FILE_OFFSET_BITS=64 -Wall -Winvalid-pch -Wextra -Werror -std=c11 -O3 -include rte_config.h -Wvla -Wcast-qual -Wdeprecated -Wformat -Wformat-nonliteral -Wformat-security -Wmissing-declarations -Wmissing-prototypes -Wnested-externs -Wold-style-definition -Wpointer-arith -Wsign-compare -Wstrict-prototypes -Wundef -Wwrite-strings -Wno-packed-not-aligned -Wno-missing-field-initializers -Wno-pointer-to-int-cast -D_GNU_SOURCE -m32 -fPIC -march=native -mrtm -DALLOW_EXPERIMENTAL_API -DALLOW_INTERNAL_API -Wno-format-truncation -Wno-address-of-packed-member -Wno-unused-value -Wno-unused-but-set-variable -Wno-unused-variable -Wno-unused-parameter -MD -MQ drivers/net/macb/base/libmacb_base.a.p/macb_uio.c.o -MF drivers/net/macb/base/libmacb_base.a.p/macb_uio.c.o.d -o drivers/net/macb/base/libmacb_base.a.p/macb_uio.c.o -c ../drivers/net/macb/base/macb_uio.c
../drivers/net/macb/base/macb_uio.c: In function ‘uio_get_map_size’:
../drivers/net/macb/base/macb_uio.c:92:28: error: format ‘%llx’ expects argument of type ‘long long unsigned int *’, but argument 3 has type ‘long unsigned int *’ [-Werror=format=]
   92 |         ret = fscanf(file, "0x%" PRIx64, map_size);
      |                            ^~~~~         ~~~~~~~~
      |                                          |
      |                                          long unsigned int *
In file included from ../drivers/net/macb/base/macb_type.h:9,
                 from ../drivers/net/macb/base/macb_common.h:35,
                 from ../drivers/net/macb/base/macb_uio.h:4,
                 from ../drivers/net/macb/base/macb_uio.c:6:
/usr/include/inttypes.h:121:41: note: format string is defined here
  121 | # define PRIx64         __PRI64_PREFIX "x"
../drivers/net/macb/base/macb_uio.c: In function ‘uio_get_map_addr’:
../drivers/net/macb/base/macb_uio.c:113:28: error: format ‘%llx’ expects argument of type ‘long long unsigned int *’, but argument 3 has type ‘long unsigned int *’ [-Werror=format=]
  113 |         ret = fscanf(file, "0x%" PRIx64, map_addr);
      |                            ^~~~~         ~~~~~~~~
      |                                          |
      |                                          long unsigned int *
/usr/include/inttypes.h:121:41: note: format string is defined here
  121 | # define PRIx64         __PRI64_PREFIX "x"
cc1: all warnings being treated as errors
[1380/2423] Compiling C object drivers/libtmp_rte_net_ixgbe.a.p/net_intel_ixgbe_ixgbe_rxtx.c.o
[1381/2423] Compiling C object drivers/libtmp_rte_net_ionic.a.p/net_ionic_ionic_rxtx_sg.c.o
[1382/2423] Compiling C object drivers/libtmp_rte_net_ionic.a.p/net_ionic_ionic_rxtx_simple.c.o
[1383/2423] Compiling C object drivers/libtmp_rte_net_macb.a.p/net_macb_macb_ethdev.c.o
[1384/2423] Compiling C object drivers/libtmp_rte_net_netvsc.a.p/net_netvsc_hn_nvs.c.o
[1385/2423] Compiling C object drivers/libtmp_rte_net_memif.a.p/net_memif_memif_socket.c.o
[1386/2423] Compiling C object drivers/libtmp_rte_net_netvsc.a.p/net_netvsc_hn_ethdev.c.o
[1387/2423] Compiling C object drivers/libtmp_rte_net_macb.a.p/net_macb_macb_rxtx.c.o
[1388/2423] Compiling C object drivers/libtmp_rte_net_memif.a.p/net_memif_rte_eth_memif.c.o
ninja: build stopped


DPDK STV team

^ permalink raw reply	[flat|nested] only message in thread

only message in thread, other threads:[~2025-04-02  7:43 UTC | newest]

Thread overview: (only message) (download: mbox.gz / follow: Atom feed)
-- links below jump to the message on this page --
2025-04-02  7:43 compilation|FAILURE| pw(152725) sid(34964) job(PER_PATCH_BUILD15362)[v4, 4/4] net/macb: add necessary docs and update related files sys_stv

This is a public inbox, see mirroring instructions
for how to clone and mirror all data and code used for this inbox;
as well as URLs for NNTP newsgroup(s).