automatic DPDK test reports
 help / color / mirror / Atom feed
* [dpdk-test-report] |FAILURE| pw18212 [PATCH v3 12/25] app/testpmd: add flow validate/create commands
@ 2016-12-20  0:34 sys_stv
  0 siblings, 0 replies; only message in thread
From: sys_stv @ 2016-12-20  0:34 UTC (permalink / raw)
  To: test-report; +Cc: adrien.mazarguil

[-- Attachment #1: Type: text/plain, Size: 3057 bytes --]

Test-Label: Intel compilation
Test-Status: FAILURE
http://dpdk.org/patch/18212

_apply patch file failure_

Submitter: Adrien Mazarguil <adrien.mazarguil@6wind.com>
Date: Mon, 19 Dec 2016 18:49:02 +0100
DPDK git baseline: Repo:dpdk-next-crypto, Branch:master, CommitID:ee103f0ee24a8f2f2243f128796608028fc8ef4d
                   Repo:dpdk-next-net, Branch:master, CommitID:0d37eee987c981c0027ad9396e71bdbf162bae14
                   Repo:dpdk-next-virtio, Branch:master, CommitID:584b07eea17fbd5977df4301baae114494855d64
                   Repo:dpdk, Branch:master, CommitID:069b8171ca99c3d3f965213ec336ecae08731e43
                   
Apply patch file failed:
Repo: dpdk-next-crypto
18212:
patching file app/test-pmd/cmdline.c
Hunk #1 FAILED at 811.
1 out of 1 hunk FAILED -- saving rejects to file app/test-pmd/cmdline.c.rej
can't find file to patch at input line 70
Perhaps you used the wrong -p or --strip option?
The text leading up to this was:
--------------------------
|diff --git a/app/test-pmd/cmdline_flow.c b/app/test-pmd/cmdline_flow.c
|index 786b718..2fd3a5d 100644
|--- a/app/test-pmd/cmdline_flow.c
|+++ b/app/test-pmd/cmdline_flow.c
--------------------------
File to patch: 
Skip this patch? [y] 
Skipping patch.
18 out of 18 hunks ignored

Repo: dpdk-next-net
18212:
patching file app/test-pmd/cmdline.c
Hunk #1 FAILED at 811.
1 out of 1 hunk FAILED -- saving rejects to file app/test-pmd/cmdline.c.rej
can't find file to patch at input line 70
Perhaps you used the wrong -p or --strip option?
The text leading up to this was:
--------------------------
|diff --git a/app/test-pmd/cmdline_flow.c b/app/test-pmd/cmdline_flow.c
|index 786b718..2fd3a5d 100644
|--- a/app/test-pmd/cmdline_flow.c
|+++ b/app/test-pmd/cmdline_flow.c
--------------------------
File to patch: 
Skip this patch? [y] 
Skipping patch.
18 out of 18 hunks ignored

Repo: dpdk-next-virtio
18212:
patching file app/test-pmd/cmdline.c
Hunk #1 FAILED at 811.
1 out of 1 hunk FAILED -- saving rejects to file app/test-pmd/cmdline.c.rej
can't find file to patch at input line 70
Perhaps you used the wrong -p or --strip option?
The text leading up to this was:
--------------------------
|diff --git a/app/test-pmd/cmdline_flow.c b/app/test-pmd/cmdline_flow.c
|index 786b718..2fd3a5d 100644
|--- a/app/test-pmd/cmdline_flow.c
|+++ b/app/test-pmd/cmdline_flow.c
--------------------------
File to patch: 
Skip this patch? [y] 
Skipping patch.
18 out of 18 hunks ignored

Repo: dpdk
18212:
patching file app/test-pmd/cmdline.c
Hunk #1 FAILED at 811.
1 out of 1 hunk FAILED -- saving rejects to file app/test-pmd/cmdline.c.rej
can't find file to patch at input line 70
Perhaps you used the wrong -p or --strip option?
The text leading up to this was:
--------------------------
|diff --git a/app/test-pmd/cmdline_flow.c b/app/test-pmd/cmdline_flow.c
|index 786b718..2fd3a5d 100644
|--- a/app/test-pmd/cmdline_flow.c
|+++ b/app/test-pmd/cmdline_flow.c
--------------------------
File to patch: 
Skip this patch? [y] 
Skipping patch.
18 out of 18 hunks ignored


DPDK STV team

^ permalink raw reply	[flat|nested] only message in thread

only message in thread, other threads:[~2016-12-20  0:34 UTC | newest]

Thread overview: (only message) (download: mbox.gz / follow: Atom feed)
-- links below jump to the message on this page --
2016-12-20  0:34 [dpdk-test-report] |FAILURE| pw18212 [PATCH v3 12/25] app/testpmd: add flow validate/create commands sys_stv

This is a public inbox, see mirroring instructions
for how to clone and mirror all data and code used for this inbox;
as well as URLs for NNTP newsgroup(s).