automatic DPDK test reports
 help / color / mirror / Atom feed
From: sys_stv@intel.com
To: test-report@dpdk.org, thomas@monjalon.net
Cc: dpdk_sw_eng@intel.com, npg.sw.core.tools.prc@intel.com
Subject: [dpdk-test-report] |FAILURE| dpdk daily Intel builds
Date: 22 Mar 2021 15:07:58 -0700
Message-ID: <9f8053$deud0o@orsmga001-auth.jf.intel.com> (raw)

[-- Attachment #1: Type: text/plain, Size: 7416 bytes --]


Test-Label: Intel-compilation
Test-Status: FAILURE
_Compilation issues_


commit 41e026c1b3fd07ee6520e3d5d4ec0787d0dac300
Author: Thomas Monjalon <thomas@monjalon.net>
Date:   Tue Mar 16 23:09:38 2021 +0100

    bus/pci: fix Windows kernel driver categories

DPDK git Repo: dpdk 


Meson Build Summary: 24 Builds Done, 23 Successful, 1 Failures, 0 Blocked

+------------------+------------+--------------+------------+------------+-----------+----------+
| os               | gcc-static | clang-static | icc-static | gcc-shared | gcc-debug | document |
+------------------+------------+--------------+------------+------------+-----------+----------+
| UB2004-64        | pass       | pass         | pass       |            |           | pass     |
| RHEL83-64        | pass       |              |            |            |           |          |
| FC33-64          | pass       | pass         |            |            |           |          |
| CentOsStream8-64 | pass       |              |            |            |           |          |
| UB2010-64        | pass       |              |            |            |           |          |
| WIN10-64         |            | pass         |            |            |           |          |
| UB2004-32        | pass       |              |            |            |           |          |
| CENTOS83-64      | pass       | pass         | pass       | FAIL       | pass      |          |
| FreeBSD1201-64   | pass       | pass         |            | pass       | pass      |          |
| SUSE15-64        | pass       | pass         |            |            |           |          |
| UB2004-64N       | pass       |              |            | pass       |           |          |
+------------------+------------+--------------+------------+------------+-----------+----------+
Test environment and configuration as below:


OS: UB2004-64
	Kernel Version: 5.6.0-050600-generic
	GCC Version: gcc (Ubuntu 10-20200416-0ubuntu1) 10.0.1 20200416 (experimental) [master revision 3c3f12e2a76:dcee354ce56:44b326839d864fc10c459916abcc97f35a9ac3de]
	Clang Version: 10.0.0-4ubuntu1
	x86_64-native-linuxapp-clang
	x86_64-native-linuxapp-gcc
	x86_64-native-linuxapp-icc
	x86_64-native-linuxapp-doc

OS: RHEL83-64
	Kernel Version: 4.18.0-240.el8.x86_64
	GCC Version: gcc (GCC) 8.3.1 20191121 (Red Hat 8.3.1-5)
	Clang Version: 10.0.1 (Red Hat 10.0.1-1.module+el8.3.0+7459+90c24896)
	x86_64-native-linuxapp-gcc

OS: FC33-64
	Kernel Version: 5.8.16-300.fc33.x86_64
	GCC Version: gcc (GCC) 10.2.1 20201005 (Red Hat 10.2.1-5)
	Clang Version: 11.0.0 (Fedora 11.0.0-1.fc33)
	x86_64-native-linuxapp-gcc
	x86_64-native-linuxapp-clang

OS: CentOsStream8-64
	Kernel Version: 4.18.0-257.el8.x86_64
	GCC Version: gcc (GCC) 8.4.1 20200928 (Red Hat 8.4.1-1)
	Clang Version: 11.0.0 (Red Hat 11.0.0-0.2.rc2.module_el8.4.0+533+50191577)
	x86_64-native-linuxapp-gcc

OS: UB2010-64
	Kernel Version: 5.8.0-25-generic
	GCC Version: gcc (Ubuntu 10.2.0-13ubuntu1) 10.2.0
	Clang Version: 11.0.0-2
	x86_64-native-linuxapp-gcc

OS: WIN10-64
	Kernel Version: N/A
	GCC Version: N/A
	Clang Version: Clang 8.0.0
	x86_64-windows-clang

OS: UB2004-32
	Kernel Version: 5.6.0-050600-generic
	GCC Version: gcc (Ubuntu 9.3.0-10ubuntu2) 9.3.0
	Clang Version: 10.0.0-4ubuntu1
	i686-native-linuxapp-gcc

OS: CENTOS83-64
	Kernel Version: 4.18.0-240.1.1.el8_3.x86_64
	GCC Version: gcc (GCC) 8.3.1 20191121 (Red Hat 8.3.1-5)
	Clang Version: 10.0.1 (Red Hat 10.0.1-1.module_el8.3.0+467+cb298d5b)
	x86_64-native-linuxapp-gcc
	x86_64-native-linuxapp-clang
	x86_64-native-linuxapp-icc
	x86_64-native-linuxapp-gcc+shared
	x86_64-native-linuxapp-gcc+debug

OS: FreeBSD1201-64
	Kernel Version: 12.1-RELEASE
	GCC Version: gcc (FreeBSD Ports Collection) 9.2.0
	Clang Version: 8.0.1 (tags/RELEASE_801/final 366581) (based on LLVM 8.0.1)
	x86_64-native-bsdapp-gcc
	x86_64-native-bsdapp-clang
	x86_64-native-bsdapp-gcc+shared
	x86_64-native-bsdapp-gcc+debug

OS: SUSE15-64
	Kernel Version: 5.3.18-lp152.57-default
	GCC Version: gcc (SUSE Linux) 7.5.0
	Clang Version: 9.0.1
	x86_64-native-linuxapp-clang
	x86_64-native-linuxapp-gcc

OS: UB2004-64N
	Kernel Version: 5.10.0-051000-generic
	GCC Version: gcc (Ubuntu 9.3.0-10ubuntu2) 9.3.0
	Clang Version: 10.0.0-4ubuntu1
	x86_64-native-linuxapp-gcc
	x86_64-native-linuxapp-gcc+shared



*Build Failed #1:
OS: CENTOS83-64
Target: x86_64-native-linuxapp-gcc+shared
FAILED: drivers/libtmp_rte_event_octeontx2.a.p/event_octeontx2_otx2_worker.c.o 
gcc -Idrivers/libtmp_rte_event_octeontx2.a.p -Idrivers -I../drivers -Idrivers/event/octeontx2 -I../drivers/event/octeontx2 -Idrivers/crypto/octeontx2 -I../drivers/crypto/octeontx2 -Idrivers/common/cpt -I../drivers/common/cpt -Ilib/librte_eventdev -I../lib/librte_eventdev -I. -I.. -Iconfig -I../config -Ilib/librte_eal/include -I../lib/librte_eal/include -Ilib/librte_eal/linux/include -I../lib/librte_eal/linux/include -Ilib/librte_eal/x86/include -I../lib/librte_eal/x86/include -Ilib/librte_eal/common -I../lib/librte_eal/common -Ilib/librte_eal -I../lib/librte_eal -Ilib/librte_kvargs -I../lib/librte_kvargs -Ilib/librte_metrics -I../lib/librte_metrics -Ilib/librte_telemetry -I../lib/librte_telemetry -Ilib/librte_ring -I../lib/librte_ring -Ilib/librte_ethdev -I../lib/librte_ethdev -Ilib/librte_net -I../lib/librte_net -Ilib/librte_mbuf -I../lib/librte_mbuf -Ilib/librte_mempool -I../lib/librte_mempool -Ilib/librte_meter -I../lib/librte_meter -Ilib/librte_hash -I../lib/librte_hash -Ilib/librte_rcu -I../lib/librte_rcu -Ilib/librte_timer -I../lib/librte_timer -Ilib/librte_cryptodev -I../lib/librte_cryptodev -Idrivers/bus/pci -I../drivers/bus/pci -I../drivers/bus/pci/linux -Ilib/librte_pci -I../lib/librte_pci -Idrivers/common/octeontx2 -I../drivers/common/octeontx2 -Idrivers/mempool/octeontx2 -I../drivers/mempool/octeontx2 -Idrivers/net/octeontx2 -I../drivers/net/octeontx2 -Idrivers/crypto/octeontx -I../drivers/crypto/octeontx -Ilib/librte_security -I../lib/librte_security -Idrivers/bus/vdev -I../drivers/bus/vdev -fdiagnostics-color=always -pipe -D_FILE_OFFSET_BITS=64 -Wall -Winvalid-pch -Werror -O3 -include rte_config.h -Wextra -Wcast-qual -Wdeprecated -Wformat -Wformat-nonliteral -Wformat-security -Wmissing-declarations -Wmissing-prototypes -Wnested-externs -Wold-style-definition -Wpointer-arith -Wsign-compare -Wstrict-prototypes -Wundef -Wwrite-strings -Wno-packed-not-aligned -Wno-missing-field-initializers -D_GNU_SOURCE -fPIC -march=native -DALLOW_EXPERIMENTAL_API -DALLOW_INTERNAL_API -Wno-format-truncation -MD -MQ drivers/libtmp_rte_event_octeontx2.a.p/event_octeontx2_otx2_worker.c.o -MF drivers/libtmp_rte_event_octeontx2.a.p/event_octeontx2_otx2_worker.c.o.d -o drivers/libtmp_rte_event_octeontx2.a.p/event_octeontx2_otx2_worker.c.o -c ../drivers/event/octeontx2/otx2_worker.c
{standard input}: Assembler messages:
{standard input}:233423: Warning: end of file not at end of a line; newline inserted
{standard input}:233424: Error: number of operands mismatch for `add'
{standard input}: Error: open CFI at the end of file; missing .cfi_endproc directive
gcc: internal compiler error: Segmentation fault signal terminated program cc1
Please submit a full bug report,
with preprocessed source if appropriate.
See <http://bugzilla.redhat.com/bugzilla> for instructions.
[2671/2678] Compiling C object drivers/libtmp_rte_event_octeontx2.a.p/event_octeontx2_otx2_worker_dual.c.o
ninja: build stopped


DPDK STV team

             reply	other threads:[~2021-03-22 22:08 UTC|newest]

Thread overview: 17+ messages / expand[flat|nested]  mbox.gz  Atom feed  top
2021-03-22 22:07 sys_stv [this message]
  -- strict thread matches above, loose matches on Subject: below --
2022-01-21  7:59 sys_stv
2022-01-21  7:55 sys_stv
2021-12-18 21:50 sys_stv
2021-10-22 22:14 sys_stv
2021-10-14  3:03 sys_stv
2021-08-15 22:10 sys_stv
2021-06-29 15:39 sys_stv
2021-05-27 22:08 sys_stv
2021-05-07  1:05 sys_stv
2021-01-28 22:07 sys_stv
2021-01-27 22:07 sys_stv
2021-01-26 22:08 sys_stv
2021-01-26  6:13 sys_stv
2020-11-05 22:08 sys_stv
2020-11-03 22:07 sys_stv
2020-10-20  5:41 sys_stv

Reply instructions:

You may reply publicly to this message via plain-text email
using any one of the following methods:

* Save the following mbox file, import it into your mail client,
  and reply-to-all from there: mbox

  Avoid top-posting and favor interleaved quoting:
  https://en.wikipedia.org/wiki/Posting_style#Interleaved_style

* Reply using the --to, --cc, and --in-reply-to
  switches of git-send-email(1):

  git send-email \
    --in-reply-to='9f8053$deud0o@orsmga001-auth.jf.intel.com' \
    --to=sys_stv@intel.com \
    --cc=dpdk_sw_eng@intel.com \
    --cc=npg.sw.core.tools.prc@intel.com \
    --cc=test-report@dpdk.org \
    --cc=thomas@monjalon.net \
    /path/to/YOUR_REPLY

  https://kernel.org/pub/software/scm/git/docs/git-send-email.html

* If your mail client supports setting the In-Reply-To header
  via mailto: links, try the mailto: link

automatic DPDK test reports

This inbox may be cloned and mirrored by anyone:

	git clone --mirror http://inbox.dpdk.org/test-report/0 test-report/git/0.git

	# If you have public-inbox 1.1+ installed, you may
	# initialize and index your mirror using the following commands:
	public-inbox-init -V2 test-report test-report/ http://inbox.dpdk.org/test-report \
		test-report@dpdk.org
	public-inbox-index test-report

Example config snippet for mirrors.
Newsgroup available over NNTP:
	nntp://inbox.dpdk.org/inbox.dpdk.test-report


AGPL code for this site: git clone https://public-inbox.org/public-inbox.git