automatic DPDK test reports
 help / color / mirror / Atom feed
From: sys_stv@intel.com
To: test-report@dpdk.org, thomas@monjalon.net
Cc: dpdk_sw_eng@intel.com, npg.sw.core.tools.prc@intel.com
Subject: [dpdk-test-report] |FAILURE| dpdk daily Intel builds
Date: 27 May 2021 15:08:31 -0700
Message-ID: <e179b7$d761a4@orsmga008-auth.jf.intel.com> (raw)

[-- Attachment #1: Type: text/plain, Size: 15297 bytes --]


Test-Label: Intel-compilation
Test-Status: FAILURE
_Compilation issues_


commit 66b3a54b9feab193a5cf8ad54606d745078587cc
Author: David Marchand <david.marchand@redhat.com>
Date:   Fri May 21 18:45:21 2021 +0200

    version: 21.08-rc0

DPDK git Repo: dpdk 


Meson Build Summary: 24 Builds Done, 23 Successful, 1 Failures, 0 Blocked

+------------------+------------+--------------+------------+------------+-----------+----------+
| os               | gcc-static | clang-static | icc-static | gcc-shared | gcc-debug | document |
+------------------+------------+--------------+------------+------------+-----------+----------+
| UB2004-64        | pass       | pass         | pass       |            |           | pass     |
| RHEL83-64        | pass       |              |            |            |           |          |
| FC34-64          | pass       | fail         |            |            |           |          |
| CentOsStream8-64 | pass       |              |            |            |           |          |
| UB2104-64        | pass       |              |            |            |           |          |
| WIN10-64         |            | pass         |            |            |           |          |
| UB2004-32        | pass       |              |            |            |           |          |
| CENTOS83-64      | pass       | pass         | pass       | pass       | pass      |          |
| FreeBSD1201-64   | pass       | pass         |            | pass       | pass      |          |
| SUSE15-64        | pass       | pass         |            |            |           |          |
| UB2004-64N       | pass       |              |            | pass       |           |          |
+------------------+------------+--------------+------------+------------+-----------+----------+
Test environment and configuration as below:


OS: UB2004-64
	Kernel Version: 5.8.0-48-generic
	GCC Version: gcc (Ubuntu 10.2.0-5ubuntu1~20.04) 10.2.0
	Clang Version: 10.0.0-4ubuntu1
	x86_64-native-linuxapp-clang
	x86_64-native-linuxapp-gcc
	x86_64-native-linuxapp-icc
	x86_64-native-linuxapp-doc

OS: RHEL83-64
	Kernel Version: 4.18.0-240.el8.x86_64
	GCC Version: gcc (GCC) 8.3.1 20191121 (Red Hat 8.3.1-5)
	Clang Version: 10.0.1 (Red Hat 10.0.1-1.module+el8.3.0+7459+90c24896)
	x86_64-native-linuxapp-gcc

OS: FC34-64
	Kernel Version: 5.11.15-300.fc34.x86_64
	GCC Version: gcc (GCC) 11.0.1 20210324 (Red Hat 11.0.1-0)
	Clang Version: 12.0.0 (Fedora 12.0.0-0.3.rc1.fc34)
	x86_64-native-linuxapp-gcc
	x86_64-native-linuxapp-clang

OS: CentOsStream8-64
	Kernel Version: 4.18.0-257.el8.x86_64
	GCC Version: gcc (GCC) 8.4.1 20200928 (Red Hat 8.4.1-1)
	Clang Version: 11.0.0 (Red Hat 11.0.0-0.2.rc2.module_el8.4.0+533+50191577)
	x86_64-native-linuxapp-gcc

OS: UB2104-64
	Kernel Version: 5.11.0-16-generic
	GCC Version: gcc (Ubuntu 10.3.0-1ubuntu1) 10.3.0
	Clang Version: 12.0.0-1ubuntu1
	x86_64-native-linuxapp-gcc

OS: WIN10-64
	Kernel Version: N/A
	GCC Version: N/A
	Clang Version: Clang 8.0.0
	x86_64-windows-clang

OS: UB2004-32
	Kernel Version: 5.8.0-48-generic
	GCC Version: gcc (Ubuntu 10.2.0-5ubuntu1~20.04) 10.2.0
	Clang Version: 10.0.0-4ubuntu1
	i686-native-linuxapp-gcc

OS: CENTOS83-64
	Kernel Version: 4.18.0-240.1.1.el8_3.x86_64
	GCC Version: gcc (GCC) 8.3.1 20191121 (Red Hat 8.3.1-5)
	Clang Version: 10.0.1 (Red Hat 10.0.1-1.module_el8.3.0+467+cb298d5b)
	x86_64-native-linuxapp-gcc
	x86_64-native-linuxapp-clang
	x86_64-native-linuxapp-icc
	x86_64-native-linuxapp-gcc+shared
	x86_64-native-linuxapp-gcc+debug

OS: FreeBSD1201-64
	Kernel Version: 12.1-RELEASE
	GCC Version: gcc (FreeBSD Ports Collection) 9.2.0
	Clang Version: 8.0.1 (tags/RELEASE_801/final 366581) (based on LLVM 8.0.1)
	x86_64-native-bsdapp-gcc
	x86_64-native-bsdapp-clang
	x86_64-native-bsdapp-gcc+shared
	x86_64-native-bsdapp-gcc+debug

OS: SUSE15-64
	Kernel Version: 5.3.18-lp152.57-default
	GCC Version: gcc (SUSE Linux) 7.5.0
	Clang Version: 9.0.1
	x86_64-native-linuxapp-clang
	x86_64-native-linuxapp-gcc

OS: UB2004-64N
	Kernel Version: 5.11.0-051100-generic
	GCC Version: gcc (GCC) 10.3.0
	Clang Version: 10.0.0-4ubuntu1
	x86_64-native-linuxapp-gcc
	x86_64-native-linuxapp-gcc+shared



*Build Failed #1:
OS: FC34-64
Target: x86_64-native-linuxapp-clang
FAILED: app/test/dpdk-test.p/test_ring.c.o 
clang -Iapp/test/dpdk-test.p -Iapp/test -I../app/test -Ilib/acl -I../lib/acl -I. -I.. -Iconfig -I../config -Ilib/eal/include -I../lib/eal/include -Ilib/eal/linux/include -I../lib/eal/linux/include -Ilib/eal/x86/include -I../lib/eal/x86/include -Ilib/eal/common -I../lib/eal/common -Ilib/eal -I../lib/eal -Ilib/kvargs -I../lib/kvargs -Ilib/metrics -I../lib/metrics -Ilib/telemetry -I../lib/telemetry -Idrivers/bus/pci -I../drivers/bus/pci -I../drivers/bus/pci/linux -Ilib/pci -I../lib/pci -Idrivers/bus/vdev -I../drivers/bus/vdev -Ilib/bitratestats -I../lib/bitratestats -Ilib/ethdev -I../lib/ethdev -Ilib/net -I../lib/net -Ilib/mbuf -I../lib/mbuf -Ilib/mempool -I../lib/mempool -Ilib/ring -I../lib/ring -Ilib/meter -I../lib/meter -Ilib/bpf -I../lib/bpf -Ilib/cfgfile -I../lib/cfgfile -Ilib/cmdline -I../lib/cmdline -Ilib/cryptodev -I../lib/cryptodev -Ilib/rcu -I../lib/rcu -Ilib/distributor -I../lib/distributor -Ilib/efd -I../lib/efd -Ilib/hash -I../lib/hash -Ilib/eventdev -I../lib/eventdev -Ilib/timer -I../lib/timer -Ilib/fib -I../lib/fib -Ilib/rib -I../lib/rib -Ilib/flow_classify -I../lib/flow_classify -Ilib/table -I../lib/table -Ilib/port -I../lib/port -Ilib/sched -I../lib/sched -Ilib/ip_frag -I../lib/ip_frag -Ilib/kni -I../lib/kni -Ilib/lpm -I../lib/lpm -Ilib/graph -I../lib/graph -Ilib/ipsec -I../lib/ipsec -Ilib/security -I../lib/security -Ilib/latencystats -I../lib/latencystats -Ilib/member -I../lib/member -Ilib/node -I../lib/node -Ilib/pipeline -I../lib/pipeline -Ilib/rawdev -I../lib/rawdev -Ilib/reorder -I../lib/reorder -Ilib/stack -I../lib/stack -Idrivers/mempool/ring -I../drivers/mempool/ring -Idrivers/mempool/stack -I../drivers/mempool/stack -Idrivers/event/skeleton -I../drivers/event/skeleton -Idrivers/net/bonding -I../drivers/net/bonding -Idrivers/net/ring -I../drivers/net/ring -Ilib/power -I../lib/power -Ilib/pdump -I../lib/pdump -Ilib/compressdev -I../lib/compressdev -Idrivers/crypto/scheduler -I../drivers/crypto/scheduler -Xclang -fcolor-diagnostics -pipe -D_FILE_OFFSET_BITS=64 -Wall -Winvalid-pch -Werror -O3 -include rte_config.h -Wextra -Wcast-qual -Wdeprecated -Wformat -Wformat-nonliteral -Wformat-security -Wmissing-declarations -Wmissing-prototypes -Wnested-externs -Wold-style-definition -Wpointer-arith -Wsign-compare -Wstrict-prototypes -Wundef -Wwrite-strings -Wno-address-of-packed-member -Wno-missing-field-initializers -D_GNU_SOURCE -march=native -DALLOW_EXPERIMENTAL_API -fno-strict-aliasing -DALLOW_INTERNAL_API -MD -MQ app/test/dpdk-test.p/test_ring.c.o -MF app/test/dpdk-test.p/test_ring.c.o.d -o app/test/dpdk-test.p/test_ring.c.o -c ../app/test/test_ring.c
PLEASE submit a bug report to https://bugs.llvm.org/ and include the crash backtrace, preprocessed source, and associated run script.
Stack dump:
0.	Program arguments: clang -Iapp/test/dpdk-test.p -Iapp/test -I../app/test -Ilib/acl -I../lib/acl -I. -I.. -Iconfig -I../config -Ilib/eal/include -I../lib/eal/include -Ilib/eal/linux/include -I../lib/eal/linux/include -Ilib/eal/x86/include -I../lib/eal/x86/include -Ilib/eal/common -I../lib/eal/common -Ilib/eal -I../lib/eal -Ilib/kvargs -I../lib/kvargs -Ilib/metrics -I../lib/metrics -Ilib/telemetry -I../lib/telemetry -Idrivers/bus/pci -I../drivers/bus/pci -I../drivers/bus/pci/linux -Ilib/pci -I../lib/pci -Idrivers/bus/vdev -I../drivers/bus/vdev -Ilib/bitratestats -I../lib/bitratestats -Ilib/ethdev -I../lib/ethdev -Ilib/net -I../lib/net -Ilib/mbuf -I../lib/mbuf -Ilib/mempool -I../lib/mempool -Ilib/ring -I../lib/ring -Ilib/meter -I../lib/meter -Ilib/bpf -I../lib/bpf -Ilib/cfgfile -I../lib/cfgfile -Ilib/cmdline -I../lib/cmdline -Ilib/cryptodev -I../lib/cryptodev -Ilib/rcu -I../lib/rcu -Ilib/distributor -I../lib/distributor -Ilib/efd -I../lib/efd -Ilib/hash -I../lib/hash -Ilib/eventdev -I../lib/eventdev -Ilib/timer -I../lib/timer -Ilib/fib -I../lib/fib -Ilib/rib -I../lib/rib -Ilib/flow_classify -I../lib/flow_classify -Ilib/table -I../lib/table -Ilib/port -I../lib/port -Ilib/sched -I../lib/sched -Ilib/ip_frag -I../lib/ip_frag -Ilib/kni -I../lib/kni -Ilib/lpm -I../lib/lpm -Ilib/graph -I../lib/graph -Ilib/ipsec -I../lib/ipsec -Ilib/security -I../lib/security -Ilib/latencystats -I../lib/latencystats -Ilib/member -I../lib/member -Ilib/node -I../lib/node -Ilib/pipeline -I../lib/pipeline -Ilib/rawdev -I../lib/rawdev -Ilib/reorder -I../lib/reorder -Ilib/stack -I../lib/stack -Idrivers/mempool/ring -I../drivers/mempool/ring -Idrivers/mempool/stack -I../drivers/mempool/stack -Idrivers/event/skeleton -I../drivers/event/skeleton -Idrivers/net/bonding -I../drivers/net/bonding -Idrivers/net/ring -I../drivers/net/ring -Ilib/power -I../lib/power -Ilib/pdump -I../lib/pdump -Ilib/compressdev -I../lib/compressdev -Idrivers/crypto/scheduler -I../drivers/crypto/scheduler -Xclang -fcolor-diagnostics -pipe -D_FILE_OFFSET_BITS=64 -Wall -Winvalid-pch -Werror -O3 -include rte_config.h -Wextra -Wcast-qual -Wdeprecated -Wformat -Wformat-nonliteral -Wformat-security -Wmissing-declarations -Wmissing-prototypes -Wnested-externs -Wold-style-definition -Wpointer-arith -Wsign-compare -Wstrict-prototypes -Wundef -Wwrite-strings -Wno-address-of-packed-member -Wno-missing-field-initializers -D_GNU_SOURCE -march=native -DALLOW_EXPERIMENTAL_API -fno-strict-aliasing -DALLOW_INTERNAL_API -MD -MQ app/test/dpdk-test.p/test_ring.c.o -MF app/test/dpdk-test.p/test_ring.c.o.d -o app/test/dpdk-test.p/test_ring.c.o -c ../app/test/test_ring.c
1.	<eof> parser at end of file
2.	Code generation
3.	Running pass 'Function Pass Manager' on module '../app/test/test_ring.c'.
4.	Running pass 'X86 DAG->DAG Instruction Selection' on function '@rte_ring_enqueue_burst_elem'
Stack dump without symbol names (ensure you have llvm-symbolizer in your PATH or set the environment var `LLVM_SYMBOLIZER_PATH` to point to it):
/lib64/libLLVM-12.so(_ZN4llvm3sys15PrintStackTraceERNS_11raw_ostreamEi+0x36)[0x7fafa485ebf6]
/lib64/libLLVM-12.so(_ZN4llvm3sys17RunSignalHandlersEv+0x34)[0x7fafa485cae4]
/lib64/libLLVM-12.so(+0xb45008)[0x7fafa479c008]
/lib64/libc.so.6(+0x3d310)[0x7fafa38a6310]
/lib64/libLLVM-12.so(+0x12ec108)[0x7fafa4f43108]
/lib64/libLLVM-12.so(_ZN4llvm16SelectionDAGISel17CodeGenAndEmitDAGEv+0x318)[0x7fafa4feaac8]
/lib64/libLLVM-12.so(_ZN4llvm16SelectionDAGISel20SelectAllBasicBlocksERKNS_8FunctionE+0x15b1)[0x7fafa4fee701]
/lib64/libLLVM-12.so(_ZN4llvm16SelectionDAGISel20runOnMachineFunctionERNS_15MachineFunctionE+0x5bc)[0x7fafa4fefe2c]
/lib64/libLLVM-12.so(+0x32d84bd)[0x7fafa6f2f4bd]
/lib64/libLLVM-12.so(+0xf48437)[0x7fafa4b9f437]
/lib64/libLLVM-12.so(_ZN4llvm13FPPassManager13runOnFunctionERNS_8FunctionE+0x2bd)[0x7fafa49852ad]
/lib64/libLLVM-12.so(_ZN4llvm13FPPassManager11runOnModuleERNS_6ModuleE+0x3b)[0x7fafa498573b]
/lib64/libLLVM-12.so(_ZN4llvm6legacy15PassManagerImpl3runERNS_6ModuleE+0x332)[0x7fafa4984d02]
/lib64/libclang-cpp.so.12(+0x17d3c62)[0x7fafaafe0c62]
/lib64/libclang-cpp.so.12(_ZN5clang17EmitBackendOutputERNS_17DiagnosticsEngineERKNS_19HeaderSearchOptionsERKNS_14CodeGenOptionsERKNS_13TargetOptionsERKNS_11LangOptionsERKN4llvm10DataLayoutEPNSE_6ModuleENS_13BackendActionESt10unique_ptrINSE_17raw_pwrite_streamESt14default_deleteISM_EE+0x34a)[0x7fafaafe24aa]
/lib64/libclang-cpp.so.12(+0x1ad42dc)[0x7fafab2e12dc]
/lib64/libclang-cpp.so.12(_ZN5clang8ParseASTERNS_4SemaEbb+0x439)[0x7fafaa21dda9]
/lib64/libclang-cpp.so.12(_ZN5clang14FrontendAction7ExecuteEv+0xc9)[0x7fafab96afa9]
/lib64/libclang-cpp.so.12(_ZN5clang16CompilerInstance13ExecuteActionERNS_14FrontendActionE+0x20b)[0x7fafab91113b]
/lib64/libclang-cpp.so.12(_ZN5clang25ExecuteCompilerInvocationEPNS_16CompilerInstanceE+0x5ab)[0x7fafab9d925b]
clang(_Z8cc1_mainN4llvm8ArrayRefIPKcEES2_Pv+0xcfc)[0x560126ffa7cc]
clang(+0x1380a)[0x560126ff780a]
/lib64/libclang-cpp.so.12(+0x1e386c9)[0x7fafab6456c9]
/lib64/libLLVM-12.so(_ZN4llvm20CrashRecoveryContext9RunSafelyENS_12function_refIFvvEEE+0x27)[0x7fafa479c0d7]
/lib64/libclang-cpp.so.12(+0x1e39406)[0x7fafab646406]
/lib64/libclang-cpp.so.12(_ZNK5clang6driver11Compilation14ExecuteCommandERKNS0_7CommandERPS3_+0x9b)[0x7fafab61c44b]
/lib64/libclang-cpp.so.12(_ZNK5clang6driver11Compilation11ExecuteJobsERKNS0_7JobListERN4llvm15SmallVectorImplISt4pairIiPKNS0_7CommandEEEE+0x8e)[0x7fafab61cc0e]
/lib64/libclang-cpp.so.12(_ZN5clang6driver6Driver18ExecuteCompilationERNS0_11CompilationERN4llvm15SmallVectorImplISt4pairIiPKNS0_7CommandEEEE+0x122)[0x7fafab626912]
clang(main+0x1cf7)[0x560126ff5417]
/lib64/libc.so.6(__libc_start_main+0xd5)[0x7fafa3890b75]
clang(_start+0x2e)[0x560126ff6c1e]
clang-12: error: clang frontend command failed with exit code 139 (use -v to see invocation)
clang version 12.0.0 (Fedora 12.0.0-0.3.rc1.fc34)
Target: x86_64-unknown-linux-gnu
Thread model: posix
InstalledDir: /usr/bin
clang-12: note: diagnostic msg: 
********************

PLEASE ATTACH THE FOLLOWING FILES TO THE BUG REPORT:
Preprocessed source(s) and associated run script(s) are located at:
clang-12: note: diagnostic msg: /tmp/test_ring-c8efc4.c
clang-12: note: diagnostic msg: /tmp/test_ring-c8efc4.sh
clang-12: note: diagnostic msg: 

********************
[2674/2751] Compiling C object examples/dpdk-vmdq.p/vmdq_main.c.o
[2675/2751] Generating rte_kni with a custom command
make: Entering directory '/usr/src/kernels/5.11.15-300.fc34.x86_64'
  CC [M]  /root/FC34-64_K5.11.15_Clang12.0.0/x86_64-native-linuxapp-clang/30da463a39e34e9895b7e72394acdb23/dpdk/x86_64-native-linuxapp-clang/kernel/linux/kni/kni_misc.o
  CC [M]  /root/FC34-64_K5.11.15_Clang12.0.0/x86_64-native-linuxapp-clang/30da463a39e34e9895b7e72394acdb23/dpdk/x86_64-native-linuxapp-clang/kernel/linux/kni/kni_net.o
  LD [M]  /root/FC34-64_K5.11.15_Clang12.0.0/x86_64-native-linuxapp-clang/30da463a39e34e9895b7e72394acdb23/dpdk/x86_64-native-linuxapp-clang/kernel/linux/kni/rte_kni.o
  MODPOST /root/FC34-64_K5.11.15_Clang12.0.0/x86_64-native-linuxapp-clang/30da463a39e34e9895b7e72394acdb23/dpdk/x86_64-native-linuxapp-clang/kernel/linux/kni/Module.symvers
  CC [M]  /root/FC34-64_K5.11.15_Clang12.0.0/x86_64-native-linuxapp-clang/30da463a39e34e9895b7e72394acdb23/dpdk/x86_64-native-linuxapp-clang/kernel/linux/kni/rte_kni.mod.o
  LD [M]  /root/FC34-64_K5.11.15_Clang12.0.0/x86_64-native-linuxapp-clang/30da463a39e34e9895b7e72394acdb23/dpdk/x86_64-native-linuxapp-clang/kernel/linux/kni/rte_kni.ko
  BTF [M] /root/FC34-64_K5.11.15_Clang12.0.0/x86_64-native-linuxapp-clang/30da463a39e34e9895b7e72394acdb23/dpdk/x86_64-native-linuxapp-clang/kernel/linux/kni/rte_kni.ko
Skipping BTF generation for /root/FC34-64_K5.11.15_Clang12.0.0/x86_64-native-linuxapp-clang/30da463a39e34e9895b7e72394acdb23/dpdk/x86_64-native-linuxapp-clang/kernel/linux/kni/rte_kni.ko due to unavailability of vmlinux
make: Leaving directory '/usr/src/kernels/5.11.15-300.fc34.x86_64'
[2676/2751] Compiling C object drivers/libtmp_rte_event_octeontx2.a.p/event_octeontx2_otx2_worker.c.o
[2677/2751] Compiling C object app/test/dpdk-test.p/test_ring_perf.c.o
[2678/2751] Compiling C object drivers/libtmp_rte_event_octeontx2.a.p/event_octeontx2_otx2_worker_dual.c.o
ninja: build stopped


DPDK STV team

             reply	other threads:[~2021-05-27 22:08 UTC|newest]

Thread overview: 14+ messages / expand[flat|nested]  mbox.gz  Atom feed  top
2021-05-27 22:08 sys_stv [this message]
  -- strict thread matches above, loose matches on Subject: below --
2021-10-22 22:14 sys_stv
2021-10-14  3:03 sys_stv
2021-08-15 22:10 sys_stv
2021-06-29 15:39 sys_stv
2021-05-07  1:05 sys_stv
2021-03-22 22:07 sys_stv
2021-01-28 22:07 sys_stv
2021-01-27 22:07 sys_stv
2021-01-26 22:08 sys_stv
2021-01-26  6:13 sys_stv
2020-11-05 22:08 sys_stv
2020-11-03 22:07 sys_stv
2020-10-20  5:41 sys_stv

Reply instructions:

You may reply publicly to this message via plain-text email
using any one of the following methods:

* Save the following mbox file, import it into your mail client,
  and reply-to-all from there: mbox

  Avoid top-posting and favor interleaved quoting:
  https://en.wikipedia.org/wiki/Posting_style#Interleaved_style

* Reply using the --to, --cc, and --in-reply-to
  switches of git-send-email(1):

  git send-email \
    --in-reply-to='e179b7$d761a4@orsmga008-auth.jf.intel.com' \
    --to=sys_stv@intel.com \
    --cc=dpdk_sw_eng@intel.com \
    --cc=npg.sw.core.tools.prc@intel.com \
    --cc=test-report@dpdk.org \
    --cc=thomas@monjalon.net \
    /path/to/YOUR_REPLY

  https://kernel.org/pub/software/scm/git/docs/git-send-email.html

* If your mail client supports setting the In-Reply-To header
  via mailto: links, try the mailto: link

automatic DPDK test reports

This inbox may be cloned and mirrored by anyone:

	git clone --mirror http://inbox.dpdk.org/test-report/0 test-report/git/0.git

	# If you have public-inbox 1.1+ installed, you may
	# initialize and index your mirror using the following commands:
	public-inbox-init -V2 test-report test-report/ http://inbox.dpdk.org/test-report \
		test-report@dpdk.org
	public-inbox-index test-report

Example config snippet for mirrors.
Newsgroup available over NNTP:
	nntp://inbox.dpdk.org/inbox.dpdk.test-report


AGPL code for this site: git clone https://public-inbox.org/public-inbox.git