Test-Label: Intel-compilation Test-Status: FAILURE http://dpdk.org/patch/26590 _apply patch file failure_ Submitter: Gaetan Rivet Date: Fri, 7 Jul 2017 02:09:13 +0200 DPDK git baseline: Repo:dpdk-next-eventdev, Branch:master, CommitID:76ee670f6a91f27eed7e06d2272db68f527c2a8b Repo:dpdk-next-crypto, Branch:master, CommitID:324377c6f82a9274a489f3a31e1d1feef9a29aed Repo:dpdk-next-net, Branch:master, CommitID:6cb559d67b83045e99c3c6d7de423960076ce207 Repo:dpdk-next-virtio, Branch:master, CommitID:96b1a3ad514de2a5d3fc8a12e11b9002764c1e9f Repo:dpdk, Branch:master, CommitID:ce8af1a4398da8d2404a35fd8a5b5ab1dc05f41d Apply patch file failed: Repo: dpdk-next-virtio 26590: patching file lib/librte_eal/common/eal_common_dev.c Hunk #1 FAILED at 177. Hunk #2 FAILED at 185. Hunk #3 FAILED at 193. Hunk #4 FAILED at 230. 4 out of 4 hunks FAILED -- saving rejects to file lib/librte_eal/common/eal_common_dev.c.rej DPDK STV team