* [dpdk-test-report] |ERROR| pw 8401 [dpdk-dev, 4/4, v4] add RX and TX selection function for FVL
@ 2015-10-31 18:30 sys_stv
0 siblings, 0 replies; only message in thread
From: sys_stv @ 2015-10-31 18:30 UTC (permalink / raw)
To: test-report, zhe.tao
[-- Attachment #1: Type: text/plain, Size: 1551 bytes --]
Test-Status: Malformed patch
Submitter: Zhe Tao <zhe.tao@intel.com>
Date: Fri, 30 Oct 2015 22:16:38 +0800
DPDK git baseline: affc455438f4cbd3b14e2d9a24fbc154e22d68d3
Malformed PatchworkID:
http://www.dpdk.org/dev/patchwork/patch/8401/
Error: patching file doc/guides/rel_notes/release_2_2.rst
patching file drivers/net/i40e/i40e_ethdev.c
patching file drivers/net/i40e/i40e_ethdev.h
patching file drivers/net/i40e/i40e_ethdev_vf.c
patching file drivers/net/i40e/i40e_rxtx.c
Hunk #1 succeeded at 2108 (offset 3 lines).
Hunk #2 succeeded at 2218 (offset 3 lines).
Hunk #3 succeeded at 2231 (offset 3 lines).
Hunk #4 succeeded at 2493 (offset 3 lines).
Hunk #5 succeeded at 2562 (offset 3 lines).
Hunk #8 FAILED at 3063.
Hunk #9 FAILED at 3088.
Hunk #10 succeeded at 3062 with fuzz 2 (offset -39 lines).
2 out of 10 hunks FAILED -- saving rejects to file drivers/net/i40e/i40e_rxtx.c.rej
patching file drivers/net/i40e/i40e_rxtx.h
Hunk #1 succeeded at 113 (offset -19 lines).
Hunk #2 FAILED at 235.
1 out of 2 hunks FAILED -- saving rejects to file drivers/net/i40e/i40e_rxtx.h.rej
can't find file to patch at input line 456
Perhaps you used the wrong -p or --strip option?
The text leading up to this was:
--------------------------
|diff --git a/drivers/net/i40e/i40e_rxtx_vec.c b/drivers/net/i40e/i40e_rxtx_vec.c
|index f746209..047aff5 100644
|--- a/drivers/net/i40e/i40e_rxtx_vec.c
|+++ b/drivers/net/i40e/i40e_rxtx_vec.c
--------------------------
File to patch:
Skip this patch? [y]
Skipping patch.
1 out of 1 hunk ignored
DPDK STV team
^ permalink raw reply [flat|nested] only message in thread
only message in thread, other threads:[~2015-10-31 18:30 UTC | newest]
Thread overview: (only message) (download: mbox.gz / follow: Atom feed)
-- links below jump to the message on this page --
2015-10-31 18:30 [dpdk-test-report] |ERROR| pw 8401 [dpdk-dev, 4/4, v4] add RX and TX selection function for FVL sys_stv
This is a public inbox, see mirroring instructions
for how to clone and mirror all data and code used for this inbox;
as well as URLs for NNTP newsgroup(s).