automatic DPDK test reports
 help / color / Atom feed
* [dpdk-test-report]  |FAILURE| pw57611[v3, 1/2] ethdev: expose basic xstats for driver use
@ 2019-08-11 16:36 sys_stv
  0 siblings, 0 replies; only message in thread
From: sys_stv @ 2019-08-11 16:36 UTC (permalink / raw)
  To: test-report

[-- Attachment #1: Type: text/plain, Size: 68508 bytes --]

Test-Label: Intel-compilation
Test-Status: FAILURE
http://dpdk.org/patch/57611

_Compilation issues_

Submitter: Stephen Hemminger <stephen@networkplumber.org>
Date: 2019-08-11 16:06:06
Reply_mail: 20190811160607.16441-2-stephen@networkplumber.org
DPDK git baseline: Repo:dpdk-next-net, CommitID: 0bbc72e599ed8b2593efccfae5692f1c6a15d2e8

Makefile build Summary: 22 Builds Done, 0 Successful, 22 Failures

Meson build Summary: 8 Builds Done, 2 Successful, 6 Failures

               +==============================================+===========+==========+
               |                   Makefile                   |   Meson   | Document |
+--------------+------+-------+------+------------+-----------+-----------+----------+
| os           | gcc  | clang | icc  | gcc+shared | gcc+debug | gcc/clang | pdf/html |
+--------------+------+-------+------+------------+-----------+-----------+----------+
| RHEL76-64    | FAIL |       |      |            |           |           |          |
| CENTOS76-64  | FAIL |       |      |            |           |           |          |
| UB1804-64    | FAIL | FAIL  | FAIL |            |           | FAIL      | pass     |
| UB1604-32    | FAIL |       |      |            |           | FAIL      |          |
| UB1904-64    | FAIL |       |      |            |           |           |          |
| UB1604-64    | FAIL | FAIL  |      |            |           |           |          |
| FC30-64      | FAIL | FAIL  |      |            |           | FAIL      |          |
| WIN10-64     |      |       |      |            |           | pass      |          |
| FreeBSD12-64 | FAIL | FAIL  |      | FAIL       | FAIL      | FAIL      |          |
| RHEL80-64    | FAIL | FAIL  | FAIL | FAIL       | FAIL      | FAIL      |          |
| SUSE15-64    | FAIL | FAIL  |      |            |           | FAIL      |          |
+--------------+------+-------+------+------------+-----------+-----------+----------+

Test environment and configuration as below:

** Makefile build **


OS: RHEL76-64
	Kernel Version: 3.10.0-957.el7.x86_64
	CPU info: Intel(R) Xeon(R) CPU E5-2699 v4 @ 2.20GHz
	GCC Version: gcc (GCC) 4.8.5 20150623 (Red Hat 4.8.5-36)
	Clang Version: NA
	x86_64-native-linuxapp-gcc


OS: CENTOS76-64
	Kernel Version: 3.10.0-957.10.1.el7.x86_64
	CPU info: Intel(R) Xeon(R) CPU E5-2699 v4 @ 2.20GHz
	GCC Version: gcc (GCC) 4.8.5 20150623 (Red Hat 4.8.5-36)
	Clang Version: 3.4.2 (tags/RELEASE_34/dot2-final)
	x86_64-native-linuxapp-gcc


OS: UB1804-64
	Kernel Version: 4.15.0-20-generic
	CPU info: Intel(R) Xeon(R) CPU E5-2699 v3 @ 2.30GHz
	GCC Version: gcc (Ubuntu 7.3.0-27ubuntu1~18.04) 7.3.0
	Clang Version: 6.0.0-1ubuntu2 (tags/RELEASE_600/final)
	x86_64-native-linuxapp-icc
	x86_64-native-linuxapp-clang
	x86_64-native-linuxapp-gcc


OS: UB1904-64
	Kernel Version: 5.0.0-13-generic
	CPU info: Intel(R) Xeon(R) CPU E5-2699 v3 @ 2.30GHz
	GCC Version: gcc (Ubuntu 8.3.0-6ubuntu1) 8.3.0
	Clang Version: 8.0.0-3 (tags/RELEASE_800/final)
	x86_64-native-linuxapp-gcc


OS: UB1604-32
	Kernel Version: 4.4.0-131-generic
	CPU info: Intel(R) Xeon(R) CPU E5-2699 v3 @ 2.30GHz
	GCC Version: gcc (Ubuntu 5.4.0-6ubuntu1~16.04.11) 5.4.0 20160609
	Clang Version: 3.8.0-2ubuntu4 (tags/RELEASE_380/final)
	i686-native-linuxapp-gcc


OS: UB1604-64
	Kernel Version: 4.4.0-47-generic
	CPU info: Intel(R) Xeon(R) CPU E5-2699 v3 @ 2.30GHz
	GCC Version: gcc (Ubuntu 5.4.0-6ubuntu1~16.04.10) 5.4.0 20160609
	Clang Version: 3.8.0-2ubuntu4 (tags/RELEASE_380/final)
	x86_64-native-linuxapp-clang
	x86_64-native-linuxapp-gcc


OS: FC30-64
	Kernel Version: 5.1.7-300.fc30.x86_64
	CPU info: Intel(R) Xeon(R) CPU E5-2699 v4 @ 2.20GHz
	GCC Version: gcc (GCC) 9.1.1 20190503 (Red Hat 9.1.1-1)
	Clang Version: 8.0.0 (Fedora 8.0.0-1.fc30)
	x86_64-native-linuxapp-gcc
	x86_64-native-linuxapp-clang


OS: FreeBSD12-64
	Kernel Version: 12.0-RC3
	CPU info: Intel(R) Xeon(R) CPU E5-2699 v4 @ 2.20GHz (2194.97-MHz K8-class CPU)
	GCC Version: gcc (FreeBSD Ports Collection) 7.3.0
	Clang Version: 6.0.1 (tags/RELEASE_601/final 335540) (based on LLVM 6.0.1)
	x86_64-native-bsdapp-gcc
	x86_64-native-bsdapp-gcc+shared
	x86_64-native-bsdapp-gcc+debug
	x86_64-native-bsdapp-clang


OS: RHEL80-64
	Kernel Version: 4.18.0-80.el8.x86_64
	CPU info: Intel(R) Xeon(R) CPU E5-2699 v4 @ 2.20GHz
	GCC Version: gcc (GCC) 8.2.1 20180905 (Red Hat 8.2.1-3)
	Clang Version: NA
	x86_64-native-linuxapp-icc
	x86_64-native-linuxapp-gcc+debug
	x86_64-native-linuxapp-clang
	x86_64-native-linuxapp-gcc+shared
	x86_64-native-linuxapp-gcc


OS: SUSE15-64
	Kernel Version: 4.12.14-lp150.11-default
	CPU info: Intel(R) Xeon(R) CPU E5-2699 v4 @ 2.20GHz
	GCC Version: gcc (SUSE Linux) 7.3.1 20180323 [gcc-7-branch revision 258812]
	Clang Version: 5.0.1 (tags/RELEASE_501/final 312548)
	x86_64-native-linuxapp-gcc
	x86_64-native-linuxapp-clang


** Meson build **


OS: UB1804-64
	Kernel Version: 4.15.0-20-generic
	CPU info: Intel(R) Xeon(R) CPU E5-2699 v4 @ 2.20GHz
	GCC Version: gcc (Ubuntu 7.3.0-27ubuntu1~18.04) 7.3.0
	Clang Version: 6.0.0-1ubuntu2 (tags/RELEASE_600/final)
	x86_64-native-linuxapp-doc
	build-gcc-static
	build-gcc-shared
	build-clang-static
	build-clang-shared
	build-x86-default


OS: UB1604-32
	Kernel Version: 4.4.0-131-generic
	CPU info: Intel(R) Xeon(R) CPU E5-2699 v4 @ 2.20GHz
	GCC Version: gcc (Ubuntu 5.4.0-6ubuntu1~16.04.11) 5.4.0 20160609
	Clang Version: 3.8.0-2ubuntu4 (tags/RELEASE_380/final)
	build-gcc-static
	build-gcc-shared
	build-clang-static
	build-clang-shared
	build-x86-default


OS: FC30-64
	Kernel Version: 5.0.9-301.fc30.x86_64
	CPU info: Intel(R) Xeon(R) CPU E5-2699 v4 @ 2.20GHz
	GCC Version: gcc (GCC) 9.1.1 20190503 (Red Hat 9.1.1-1)
	Clang Version: 8.0.0 (Fedora 8.0.0-1.fc30)
	build-gcc-static
	build-gcc-shared
	build-clang-static
	build-clang-shared
	build-x86-default


OS: WIN10-64
	Kernel Version: N/A
	CPU info: N/A
	GCC Version: N/A
	Clang Version: Clang 8.0.0
	x86_64-windows-clang


OS: FreeBSD12-64
	Kernel Version: 12.0-RC3
	CPU info: Intel(R) Xeon(R) CPU E5-2699 v4 @ 2.20GHz (2194.99-MHz K8-class CPU)
	GCC Version: gcc (FreeBSD Ports Collection) 7.3.0
	Clang Version: 6.0.1 (tags/RELEASE_601/final 335540) (based on LLVM 6.0.1)
	build-gcc-static
	build-gcc-shared
	build-clang-static
	build-clang-shared
	build-x86-default


OS: RHEL80-64
	Kernel Version: 4.18.0-80.el8.x86_64
	CPU info: Intel(R) Xeon(R) CPU E5-2699 v4 @ 2.20GHz
	GCC Version: gcc (GCC) 8.2.1 20180905 (Red Hat 8.2.1-3)
	Clang Version: NA
	build-gcc-static
	build-gcc-shared
	build-x86-default


OS: SUSE15-64
	Kernel Version: 4.12.14-lp150.11-default
	CPU info: Intel(R) Xeon(R) CPU E5-2699 v4 @ 2.20GHz
	GCC Version: gcc (SUSE Linux) 7.3.1 20180323 [gcc-7-branch revision 258812]
	Clang Version: 5.0.1 (tags/RELEASE_501/final 312548)
	build-gcc-static
	build-gcc-shared
	build-clang-static
	build-clang-shared
	build-x86-default


*Make Build Failed #1:
OS: UB1604-32
Target: i686-native-linuxapp-gcc
  CC enic_res.o
  CC e1000_logs.o
/tmp/UB1604-32_K4.4.0_GCC5.4.0/i686-native-linuxapp-gcc/05ae8091d16e4bddaf31d9b8a30fb8e6/dpdk/drivers/net/failsafe/failsafe_ops.c: At top level:
cc1: error: unrecognized command line option ‘-Wno-address-of-packed-member’ [-Werror]
cc1: all warnings being treated as errors
/tmp/UB1604-32_K4.4.0_GCC5.4.0/i686-native-linuxapp-gcc/05ae8091d16e4bddaf31d9b8a30fb8e6/dpdk/mk/internal/rte.compile-pre.mk:114: recipe for target 'failsafe_ops.o' failed
make[6]: *** [failsafe_ops.o] Error 1
/tmp/UB1604-32_K4.4.0_GCC5.4.0/i686-native-linuxapp-gcc/05ae8091d16e4bddaf31d9b8a30fb8e6/dpdk/mk/rte.subdir.mk:35: recipe for target 'failsafe' failed
make[5]: *** [failsafe] Error 2
make[5]: *** Waiting for unfinished jobs....
  CC e1000_mac.o
  CC rte_eth_bond_flow.o
  CC e1000_manage.o
  CC t4vf_hw.o
--
  PMDINFO i40e_ethdev.o.pmd.c
  CC i40e_ethdev.o.pmd.o
  LD i40e_ethdev.o
  AR librte_pmd_i40e.a
  INSTALL-LIB librte_pmd_i40e.a
/tmp/UB1604-32_K4.4.0_GCC5.4.0/i686-native-linuxapp-gcc/05ae8091d16e4bddaf31d9b8a30fb8e6/dpdk/mk/rte.subdir.mk:35: recipe for target 'net' failed
make[4]: *** [net] Error 2
/tmp/UB1604-32_K4.4.0_GCC5.4.0/i686-native-linuxapp-gcc/05ae8091d16e4bddaf31d9b8a30fb8e6/dpdk/mk/rte.sdkbuild.mk:46: recipe for target 'drivers' failed
make[3]: *** [drivers] Error 2
/tmp/UB1604-32_K4.4.0_GCC5.4.0/i686-native-linuxapp-gcc/05ae8091d16e4bddaf31d9b8a30fb8e6/dpdk/mk/rte.sdkroot.mk:98: recipe for target 'all' failed
make[2]: *** [all] Error 2
/tmp/UB1604-32_K4.4.0_GCC5.4.0/i686-native-linuxapp-gcc/05ae8091d16e4bddaf31d9b8a30fb8e6/dpdk/mk/rte.sdkinstall.mk:60: recipe for target 'pre_install' failed
make[1]: *** [pre_install] Error 2
/tmp/UB1604-32_K4.4.0_GCC5.4.0/i686-native-linuxapp-gcc/05ae8091d16e4bddaf31d9b8a30fb8e6/dpdk/mk/rte.sdkroot.mk:77: recipe for target 'install' failed
make: *** [install] Error 2


*Make Build Failed #2:
OS: UB1604-64
Target: x86_64-native-linuxapp-clang
/tmp/UB1604-64_K4.4.0_Clang3.8.0/x86_64-native-linuxapp-clang/05ae8091d16e4bddaf31d9b8a30fb8e6/dpdk/drivers/net/failsafe/failsafe_ops.c:879:8: note: did you mean 'rte_eth_basic_stats_count'?
/tmp/UB1604-64_K4.4.0_Clang3.8.0/x86_64-native-linuxapp-clang/05ae8091d16e4bddaf31d9b8a30fb8e6/dpdk/drivers/net/failsafe/failsafe_ops.c:804:10: note: 'rte_eth_basic_stats_count' declared here
        count = rte_eth_basic_stats_count(dev);
                ^
3 errors generated.
/tmp/UB1604-64_K4.4.0_Clang3.8.0/x86_64-native-linuxapp-clang/05ae8091d16e4bddaf31d9b8a30fb8e6/dpdk/mk/internal/rte.compile-pre.mk:114: recipe for target 'failsafe_ops.o' failed
make[6]: *** [failsafe_ops.o] Error 1
make[6]: *** Waiting for unfinished jobs....
  CC fm10k_pf.o
  CC i40e_hmc.o
  CC ena_eth_com.o
  CC hinic_pmd_eqs.o
  CC e1000_82575.o
/tmp/UB1604-64_K4.4.0_Clang3.8.0/x86_64-native-linuxapp-clang/05ae8091d16e4bddaf31d9b8a30fb8e6/dpdk/mk/rte.subdir.mk:35: recipe for target 'failsafe' failed
make[5]: *** [failsafe] Error 2
make[5]: *** Waiting for unfinished jobs....
  CC e1000_i210.o
  CC iavf_common.o
  CC i40e_lan_hmc.o
  CC i40e_nvm.o
--
  PMDINFO i40e_ethdev.o.pmd.c
  CC i40e_ethdev.o.pmd.o
  LD i40e_ethdev.o
  AR librte_pmd_i40e.a
  INSTALL-LIB librte_pmd_i40e.a
/tmp/UB1604-64_K4.4.0_Clang3.8.0/x86_64-native-linuxapp-clang/05ae8091d16e4bddaf31d9b8a30fb8e6/dpdk/mk/rte.subdir.mk:35: recipe for target 'net' failed
make[4]: *** [net] Error 2
/tmp/UB1604-64_K4.4.0_Clang3.8.0/x86_64-native-linuxapp-clang/05ae8091d16e4bddaf31d9b8a30fb8e6/dpdk/mk/rte.sdkbuild.mk:46: recipe for target 'drivers' failed
make[3]: *** [drivers] Error 2
/tmp/UB1604-64_K4.4.0_Clang3.8.0/x86_64-native-linuxapp-clang/05ae8091d16e4bddaf31d9b8a30fb8e6/dpdk/mk/rte.sdkroot.mk:98: recipe for target 'all' failed
make[2]: *** [all] Error 2
/tmp/UB1604-64_K4.4.0_Clang3.8.0/x86_64-native-linuxapp-clang/05ae8091d16e4bddaf31d9b8a30fb8e6/dpdk/mk/rte.sdkinstall.mk:60: recipe for target 'pre_install' failed
make[1]: *** [pre_install] Error 2
/tmp/UB1604-64_K4.4.0_Clang3.8.0/x86_64-native-linuxapp-clang/05ae8091d16e4bddaf31d9b8a30fb8e6/dpdk/mk/rte.sdkroot.mk:77: recipe for target 'install' failed
make: *** [install] Error 2


*Make Build Failed #3:
OS: UB1904-64
Target: x86_64-native-linuxapp-gcc
  CC enic_rxtx.o
  CC e1000_i210.o
/tmp/UB1904-64_K4.18.0_GCC8.3.0/x86_64-native-linuxapp-gcc/05ae8091d16e4bddaf31d9b8a30fb8e6/dpdk/drivers/net/failsafe/failsafe_ops.c: At top level:
cc1: error: unrecognized command line option ‘-Wno-address-of-packed-member’ [-Werror]
cc1: all warnings being treated as errors
make[6]: *** [/tmp/UB1904-64_K4.18.0_GCC8.3.0/x86_64-native-linuxapp-gcc/05ae8091d16e4bddaf31d9b8a30fb8e6/dpdk/mk/internal/rte.compile-pre.mk:114: failsafe_ops.o] Error 1
make[6]: *** Waiting for unfinished jobs....
  CC e1000_api.o
  CC ena_eth_com.o
  CC mc/dpkg.o
make[5]: *** [/tmp/UB1904-64_K4.18.0_GCC8.3.0/x86_64-native-linuxapp-gcc/05ae8091d16e4bddaf31d9b8a30fb8e6/dpdk/mk/rte.subdir.mk:35: failsafe] Error 2
make[5]: *** Waiting for unfinished jobs....
  CC mc/dpdmux.o
  CC l2t.o
  CC enic_clsf.o
  CC enic_res.o
--
  LD igb_ethdev.o
  AR librte_pmd_fm10k.a
  INSTALL-LIB librte_pmd_fm10k.a
  AR librte_pmd_e1000.a
  INSTALL-LIB librte_pmd_e1000.a
make[4]: *** [/tmp/UB1904-64_K4.18.0_GCC8.3.0/x86_64-native-linuxapp-gcc/05ae8091d16e4bddaf31d9b8a30fb8e6/dpdk/mk/rte.subdir.mk:35: net] Error 2
make[3]: *** [/tmp/UB1904-64_K4.18.0_GCC8.3.0/x86_64-native-linuxapp-gcc/05ae8091d16e4bddaf31d9b8a30fb8e6/dpdk/mk/rte.sdkbuild.mk:46: drivers] Error 2
make[2]: *** [/tmp/UB1904-64_K4.18.0_GCC8.3.0/x86_64-native-linuxapp-gcc/05ae8091d16e4bddaf31d9b8a30fb8e6/dpdk/mk/rte.sdkroot.mk:99: all] Error 2
make[1]: *** [/tmp/UB1904-64_K4.18.0_GCC8.3.0/x86_64-native-linuxapp-gcc/05ae8091d16e4bddaf31d9b8a30fb8e6/dpdk/mk/rte.sdkinstall.mk:61: pre_install] Error 2
make: *** [/tmp/UB1904-64_K4.18.0_GCC8.3.0/x86_64-native-linuxapp-gcc/05ae8091d16e4bddaf31d9b8a30fb8e6/dpdk/mk/rte.sdkroot.mk:77: install] Error 2


*Make Build Failed #4:
OS: UB1804-64
Target: x86_64-native-linuxapp-icc
/tmp/UB1804-64_K4.15.0_ICC19.0.0/x86_64-native-linuxapp-icc/05ae8091d16e4bddaf31d9b8a30fb8e6/dpdk/drivers/net/failsafe/failsafe_ops.c(879): error #266: function "rte_eth_basic_stats_get" declared implicitly
  	ret = rte_eth_basic_stats_get(dev->data->port_id, xstats);
  	      ^

compilation aborted for /tmp/UB1804-64_K4.15.0_ICC19.0.0/x86_64-native-linuxapp-icc/05ae8091d16e4bddaf31d9b8a30fb8e6/dpdk/drivers/net/failsafe/failsafe_ops.c (code 2)
/tmp/UB1804-64_K4.15.0_ICC19.0.0/x86_64-native-linuxapp-icc/05ae8091d16e4bddaf31d9b8a30fb8e6/dpdk/mk/internal/rte.compile-pre.mk:114: recipe for target 'failsafe_ops.o' failed
make[6]: *** [failsafe_ops.o] Error 2
make[6]: *** Waiting for unfinished jobs....
  AR librte_pmd_dpaa2.a
  CC e1000_osdep.o
  INSTALL-LIB librte_pmd_dpaa2.a
== Build drivers/net/i40e
--
  AR librte_pmd_octeontx_crypto.a
  INSTALL-LIB librte_pmd_octeontx_crypto.a
  CC enic_flow.o
  CC virtqueue.o
  CC e1000_phy.o
/tmp/UB1804-64_K4.15.0_ICC19.0.0/x86_64-native-linuxapp-icc/05ae8091d16e4bddaf31d9b8a30fb8e6/dpdk/mk/rte.subdir.mk:35: recipe for target 'failsafe' failed
make[5]: *** [failsafe] Error 2
make[5]: *** Waiting for unfinished jobs....
  CC e1000_vf.o
  CC igb_ethdev.o
  CC virtio_pci.o
  CC igb_rxtx.o
--
  PMDINFO i40e_ethdev.o.pmd.c
  CC i40e_ethdev.o.pmd.o
  LD i40e_ethdev.o
  AR librte_pmd_i40e.a
  INSTALL-LIB librte_pmd_i40e.a
/tmp/UB1804-64_K4.15.0_ICC19.0.0/x86_64-native-linuxapp-icc/05ae8091d16e4bddaf31d9b8a30fb8e6/dpdk/mk/rte.subdir.mk:35: recipe for target 'net' failed
make[4]: *** [net] Error 2
/tmp/UB1804-64_K4.15.0_ICC19.0.0/x86_64-native-linuxapp-icc/05ae8091d16e4bddaf31d9b8a30fb8e6/dpdk/mk/rte.sdkbuild.mk:46: recipe for target 'drivers' failed
make[3]: *** [drivers] Error 2
/tmp/UB1804-64_K4.15.0_ICC19.0.0/x86_64-native-linuxapp-icc/05ae8091d16e4bddaf31d9b8a30fb8e6/dpdk/mk/rte.sdkroot.mk:98: recipe for target 'all' failed
make[2]: *** [all] Error 2
/tmp/UB1804-64_K4.15.0_ICC19.0.0/x86_64-native-linuxapp-icc/05ae8091d16e4bddaf31d9b8a30fb8e6/dpdk/mk/rte.sdkinstall.mk:60: recipe for target 'pre_install' failed
make[1]: *** [pre_install] Error 2
/tmp/UB1804-64_K4.15.0_ICC19.0.0/x86_64-native-linuxapp-icc/05ae8091d16e4bddaf31d9b8a30fb8e6/dpdk/mk/rte.sdkroot.mk:77: recipe for target 'install' failed
make: *** [install] Error 2


*Make Build Failed #5:
OS: UB1804-64
Target: x86_64-native-linuxapp-clang
/tmp/UB1804-64_K4.15.0_Clang6.0.0/x86_64-native-linuxapp-clang/05ae8091d16e4bddaf31d9b8a30fb8e6/dpdk/drivers/net/failsafe/failsafe_ops.c:879:8: error: implicit declaration of function 'rte_eth_basic_stats_get' is invalid in C99 [-Werror,-Wimplicit-function-declaration]
        ret = rte_eth_basic_stats_get(dev->data->port_id, xstats);
              ^
  CC e1000_api.o
3 errors generated.
/tmp/UB1804-64_K4.15.0_Clang6.0.0/x86_64-native-linuxapp-clang/05ae8091d16e4bddaf31d9b8a30fb8e6/dpdk/mk/internal/rte.compile-pre.mk:114: recipe for target 'failsafe_ops.o' failed
make[6]: *** [failsafe_ops.o] Error 1
make[6]: *** Waiting for unfinished jobs....
== Build drivers/net/i40e
  CC enic_res.o
  CC hinic_pmd_api_cmd.o
  CC e1000_ich8lan.o
--
  PMDINFO fm10k_ethdev.o.pmd.c
  CC fm10k_ethdev.o.pmd.o
  AR librte_pmd_dpaa2.a
  LD fm10k_ethdev.o
  INSTALL-LIB librte_pmd_dpaa2.a
/tmp/UB1804-64_K4.15.0_Clang6.0.0/x86_64-native-linuxapp-clang/05ae8091d16e4bddaf31d9b8a30fb8e6/dpdk/mk/rte.subdir.mk:35: recipe for target 'failsafe' failed
make[5]: *** [failsafe] Error 2
make[5]: *** Waiting for unfinished jobs....
  CC i40e_common.o
  CC i40e_hmc.o
  CC i40e_diag.o
  CC enic_flow.o
--
  PMDINFO i40e_ethdev.o.pmd.c
  CC i40e_ethdev.o.pmd.o
  LD i40e_ethdev.o
  AR librte_pmd_i40e.a
  INSTALL-LIB librte_pmd_i40e.a
/tmp/UB1804-64_K4.15.0_Clang6.0.0/x86_64-native-linuxapp-clang/05ae8091d16e4bddaf31d9b8a30fb8e6/dpdk/mk/rte.subdir.mk:35: recipe for target 'net' failed
make[4]: *** [net] Error 2
/tmp/UB1804-64_K4.15.0_Clang6.0.0/x86_64-native-linuxapp-clang/05ae8091d16e4bddaf31d9b8a30fb8e6/dpdk/mk/rte.sdkbuild.mk:46: recipe for target 'drivers' failed
make[3]: *** [drivers] Error 2
/tmp/UB1804-64_K4.15.0_Clang6.0.0/x86_64-native-linuxapp-clang/05ae8091d16e4bddaf31d9b8a30fb8e6/dpdk/mk/rte.sdkroot.mk:98: recipe for target 'all' failed
make[2]: *** [all] Error 2
/tmp/UB1804-64_K4.15.0_Clang6.0.0/x86_64-native-linuxapp-clang/05ae8091d16e4bddaf31d9b8a30fb8e6/dpdk/mk/rte.sdkinstall.mk:60: recipe for target 'pre_install' failed
make[1]: *** [pre_install] Error 2
/tmp/UB1804-64_K4.15.0_Clang6.0.0/x86_64-native-linuxapp-clang/05ae8091d16e4bddaf31d9b8a30fb8e6/dpdk/mk/rte.sdkroot.mk:77: recipe for target 'install' failed
make: *** [install] Error 2


*Make Build Failed #6:
OS: RHEL80-64
Target: x86_64-native-linuxapp-icc
/tmp/RHEL80-64_K3.10.0_ICC19.0.0/x86_64-native-linuxapp-icc/05ae8091d16e4bddaf31d9b8a30fb8e6/dpdk/drivers/net/failsafe/failsafe_ops.c(879): error #266: function "rte_eth_basic_stats_get" declared implicitly
  	ret = rte_eth_basic_stats_get(dev->data->port_id, xstats);
  	      ^

compilation aborted for /tmp/RHEL80-64_K3.10.0_ICC19.0.0/x86_64-native-linuxapp-icc/05ae8091d16e4bddaf31d9b8a30fb8e6/dpdk/drivers/net/failsafe/failsafe_ops.c (code 2)
make[6]: *** [/tmp/RHEL80-64_K3.10.0_ICC19.0.0/x86_64-native-linuxapp-icc/05ae8091d16e4bddaf31d9b8a30fb8e6/dpdk/mk/internal/rte.compile-pre.mk:114: failsafe_ops.o] Error 2
make[5]: *** [/tmp/RHEL80-64_K3.10.0_ICC19.0.0/x86_64-native-linuxapp-icc/05ae8091d16e4bddaf31d9b8a30fb8e6/dpdk/mk/rte.subdir.mk:37: failsafe] Error 2
make[5]: *** Waiting for unfinished jobs....
  CC iavf_common.o
  CC enic_rxtx.o
  CC mc/dpdmux.o
  CC i40e_common.o
--
== Build drivers/crypto/virtio
  CC null_crypto_pmd.o
  CC null_crypto_pmd_ops.o
  AR librte_pmd_i40e.a
  INSTALL-LIB librte_pmd_i40e.a
make[4]: *** [/tmp/RHEL80-64_K3.10.0_ICC19.0.0/x86_64-native-linuxapp-icc/05ae8091d16e4bddaf31d9b8a30fb8e6/dpdk/mk/rte.subdir.mk:35: net] Error 2
make[4]: *** Waiting for unfinished jobs....
  PMDINFO null_crypto_pmd.o.pmd.c
  CC null_crypto_pmd.o.pmd.o
  LD null_crypto_pmd.o
  AR librte_pmd_null_crypto.a
--
  PMDINFO dpaa2_sec_dpseci.o.pmd.c
  CC dpaa2_sec_dpseci.o.pmd.o
  LD dpaa2_sec_dpseci.o
  AR librte_pmd_dpaa2_sec.a
  INSTALL-LIB librte_pmd_dpaa2_sec.a
make[3]: *** [/tmp/RHEL80-64_K3.10.0_ICC19.0.0/x86_64-native-linuxapp-icc/05ae8091d16e4bddaf31d9b8a30fb8e6/dpdk/mk/rte.sdkbuild.mk:46: drivers] Error 2
make[2]: *** [/tmp/RHEL80-64_K3.10.0_ICC19.0.0/x86_64-native-linuxapp-icc/05ae8091d16e4bddaf31d9b8a30fb8e6/dpdk/mk/rte.sdkroot.mk:99: all] Error 2
make[1]: *** [/tmp/RHEL80-64_K3.10.0_ICC19.0.0/x86_64-native-linuxapp-icc/05ae8091d16e4bddaf31d9b8a30fb8e6/dpdk/mk/rte.sdkinstall.mk:61: pre_install] Error 2
make: *** [/tmp/RHEL80-64_K3.10.0_ICC19.0.0/x86_64-native-linuxapp-icc/05ae8091d16e4bddaf31d9b8a30fb8e6/dpdk/mk/rte.sdkroot.mk:77: install] Error 2


*Make Build Failed #7:
OS: RHEL80-64
Target: x86_64-native-linuxapp-gcc+debug
  CC mc/dpkg.o
  CC hinic_pmd_niccfg.o
/tmp/RHEL80-64_K3.10.0_GCC8.2.1/x86_64-native-linuxapp-gcc+debug/05ae8091d16e4bddaf31d9b8a30fb8e6/dpdk/drivers/net/failsafe/failsafe_ops.c: At top level:
cc1: error: unrecognized command line option ‘-Wno-address-of-packed-member’ [-Werror]
cc1: all warnings being treated as errors
make[6]: *** [/tmp/RHEL80-64_K3.10.0_GCC8.2.1/x86_64-native-linuxapp-gcc+debug/05ae8091d16e4bddaf31d9b8a30fb8e6/dpdk/mk/internal/rte.compile-pre.mk:116: failsafe_ops.o] Error 1
make[6]: *** Waiting for unfinished jobs....
  CC fm10k_vf.o
  CC hinic_pmd_nicio.o
make[5]: *** [/tmp/RHEL80-64_K3.10.0_GCC8.2.1/x86_64-native-linuxapp-gcc+debug/05ae8091d16e4bddaf31d9b8a30fb8e6/dpdk/mk/rte.subdir.mk:35: failsafe] Error 2
make[5]: *** Waiting for unfinished jobs....
  CC enic_clsf.o
  CC fm10k_api.o
  CC fm10k_rxtx_vec.o
  CC mc/dpdmux.o
--
  PMDINFO i40e_ethdev.o.pmd.c
  CC i40e_ethdev.o.pmd.o
  LD i40e_ethdev.o
  AR librte_pmd_i40e.a
  INSTALL-LIB librte_pmd_i40e.a
make[4]: *** [/tmp/RHEL80-64_K3.10.0_GCC8.2.1/x86_64-native-linuxapp-gcc+debug/05ae8091d16e4bddaf31d9b8a30fb8e6/dpdk/mk/rte.subdir.mk:35: net] Error 2
make[3]: *** [/tmp/RHEL80-64_K3.10.0_GCC8.2.1/x86_64-native-linuxapp-gcc+debug/05ae8091d16e4bddaf31d9b8a30fb8e6/dpdk/mk/rte.sdkbuild.mk:46: drivers] Error 2
make[2]: *** [/tmp/RHEL80-64_K3.10.0_GCC8.2.1/x86_64-native-linuxapp-gcc+debug/05ae8091d16e4bddaf31d9b8a30fb8e6/dpdk/mk/rte.sdkroot.mk:99: all] Error 2
make[1]: *** [/tmp/RHEL80-64_K3.10.0_GCC8.2.1/x86_64-native-linuxapp-gcc+debug/05ae8091d16e4bddaf31d9b8a30fb8e6/dpdk/mk/rte.sdkinstall.mk:61: pre_install] Error 2
make: *** [/tmp/RHEL80-64_K3.10.0_GCC8.2.1/x86_64-native-linuxapp-gcc+debug/05ae8091d16e4bddaf31d9b8a30fb8e6/dpdk/mk/rte.sdkroot.mk:77: install] Error 2


*Make Build Failed #8:
OS: RHEL80-64
Target: x86_64-native-linuxapp-clang
    ^
/tmp/RHEL80-64_K3.10.0_Clang6.0.1/x86_64-native-linuxapp-clang/05ae8091d16e4bddaf31d9b8a30fb8e6/dpdk/drivers/net/failsafe/failsafe_ops.c:879:8: error: implicit declaration of function 'rte_eth_basic_stats_get' is invalid in C99 [-Werror,-Wimplicit-function-declaration]
        ret = rte_eth_basic_stats_get(dev->data->port_id, xstats);
              ^
3 errors generated.
make[6]: *** [/tmp/RHEL80-64_K3.10.0_Clang6.0.1/x86_64-native-linuxapp-clang/05ae8091d16e4bddaf31d9b8a30fb8e6/dpdk/mk/internal/rte.compile-pre.mk:114: failsafe_ops.o] Error 1
make[6]: *** Waiting for unfinished jobs....
  CC hinic_pmd_cmdq.o
  CC fm10k_common.o
make[5]: *** [/tmp/RHEL80-64_K3.10.0_Clang6.0.1/x86_64-native-linuxapp-clang/05ae8091d16e4bddaf31d9b8a30fb8e6/dpdk/mk/rte.subdir.mk:37: failsafe] Error 2
make[5]: *** Waiting for unfinished jobs....
  CC igb_flow.o
  CC fm10k_mbx.o
  CC enic_flow.o
  CC hinic_pmd_eqs.o
--
  LD hinic_pmd_ethdev.o
  AR librte_pmd_enic.a
  INSTALL-LIB librte_pmd_enic.a
  AR librte_pmd_hinic.a
  INSTALL-LIB librte_pmd_hinic.a
make[4]: *** [/tmp/RHEL80-64_K3.10.0_Clang6.0.1/x86_64-native-linuxapp-clang/05ae8091d16e4bddaf31d9b8a30fb8e6/dpdk/mk/rte.subdir.mk:35: net] Error 2
make[3]: *** [/tmp/RHEL80-64_K3.10.0_Clang6.0.1/x86_64-native-linuxapp-clang/05ae8091d16e4bddaf31d9b8a30fb8e6/dpdk/mk/rte.sdkbuild.mk:46: drivers] Error 2
make[2]: *** [/tmp/RHEL80-64_K3.10.0_Clang6.0.1/x86_64-native-linuxapp-clang/05ae8091d16e4bddaf31d9b8a30fb8e6/dpdk/mk/rte.sdkroot.mk:99: all] Error 2
make[1]: *** [/tmp/RHEL80-64_K3.10.0_Clang6.0.1/x86_64-native-linuxapp-clang/05ae8091d16e4bddaf31d9b8a30fb8e6/dpdk/mk/rte.sdkinstall.mk:61: pre_install] Error 2
make: *** [/tmp/RHEL80-64_K3.10.0_Clang6.0.1/x86_64-native-linuxapp-clang/05ae8091d16e4bddaf31d9b8a30fb8e6/dpdk/mk/rte.sdkroot.mk:77: install] Error 2


*Make Build Failed #9:
OS: RHEL80-64
Target: x86_64-native-linuxapp-gcc+shared
  CC hinic_pmd_api_cmd.o
  CC dpaa2_flow.o
/tmp/RHEL80-64_K3.10.0_GCC8.2.1/x86_64-native-linuxapp-gcc+shared/05ae8091d16e4bddaf31d9b8a30fb8e6/dpdk/drivers/net/failsafe/failsafe_ops.c: At top level:
cc1: error: unrecognized command line option ‘-Wno-address-of-packed-member’ [-Werror]
cc1: all warnings being treated as errors
make[6]: *** [/tmp/RHEL80-64_K3.10.0_GCC8.2.1/x86_64-native-linuxapp-gcc+shared/05ae8091d16e4bddaf31d9b8a30fb8e6/dpdk/mk/internal/rte.compile-pre.mk:114: failsafe_ops.o] Error 1
make[5]: *** [/tmp/RHEL80-64_K3.10.0_GCC8.2.1/x86_64-native-linuxapp-gcc+shared/05ae8091d16e4bddaf31d9b8a30fb8e6/dpdk/mk/rte.subdir.mk:35: failsafe] Error 2
make[5]: *** Waiting for unfinished jobs....
  CC dpaa2_mux.o
  CC base/vnic_wq.o
  CC fm10k_ethdev.o
  CC e1000_ich8lan.o
--
  PMDINFO i40e_ethdev.o.pmd.c
  CC i40e_ethdev.o.pmd.o
  LD i40e_ethdev.o
  LD librte_pmd_i40e.so.2.1
  INSTALL-LIB librte_pmd_i40e.so.2.1
make[4]: *** [/tmp/RHEL80-64_K3.10.0_GCC8.2.1/x86_64-native-linuxapp-gcc+shared/05ae8091d16e4bddaf31d9b8a30fb8e6/dpdk/mk/rte.subdir.mk:35: net] Error 2
make[3]: *** [/tmp/RHEL80-64_K3.10.0_GCC8.2.1/x86_64-native-linuxapp-gcc+shared/05ae8091d16e4bddaf31d9b8a30fb8e6/dpdk/mk/rte.sdkbuild.mk:46: drivers] Error 2
make[2]: *** [/tmp/RHEL80-64_K3.10.0_GCC8.2.1/x86_64-native-linuxapp-gcc+shared/05ae8091d16e4bddaf31d9b8a30fb8e6/dpdk/mk/rte.sdkroot.mk:99: all] Error 2
make[1]: *** [/tmp/RHEL80-64_K3.10.0_GCC8.2.1/x86_64-native-linuxapp-gcc+shared/05ae8091d16e4bddaf31d9b8a30fb8e6/dpdk/mk/rte.sdkinstall.mk:61: pre_install] Error 2
make: *** [/tmp/RHEL80-64_K3.10.0_GCC8.2.1/x86_64-native-linuxapp-gcc+shared/05ae8091d16e4bddaf31d9b8a30fb8e6/dpdk/mk/rte.sdkroot.mk:77: install] Error 2


*Make Build Failed #10:
OS: SUSE15-64
Target: x86_64-native-linuxapp-gcc
  SYMLINK-FILE include/rte_pmd_i40e.h
/tmp/SUSE15-64_K4.12.14_GCC7.3.1/x86_64-native-linuxapp-gcc/05ae8091d16e4bddaf31d9b8a30fb8e6/dpdk/drivers/net/failsafe/failsafe_ops.c: At top level:
cc1: error: unrecognized command line option ‘-Wno-address-of-packed-member’ [-Werror]
cc1: all warnings being treated as errors
  CC i40e_adminq.o
make[6]: *** [/tmp/SUSE15-64_K4.12.14_GCC7.3.1/x86_64-native-linuxapp-gcc/05ae8091d16e4bddaf31d9b8a30fb8e6/dpdk/mk/internal/rte.compile-pre.mk:114: failsafe_ops.o] Error 1
make[6]: *** Waiting for unfinished jobs....
  CC base/vnic_cq.o
  CC hinic_pmd_nicio.o
  CC hinic_pmd_wq.o
  CC hinic_pmd_ethdev.o
  CC base/vnic_wq.o
  CC fm10k_tlv.o
  CC hinic_pmd_rx.o
make[5]: *** [/tmp/SUSE15-64_K4.12.14_GCC7.3.1/x86_64-native-linuxapp-gcc/05ae8091d16e4bddaf31d9b8a30fb8e6/dpdk/mk/rte.subdir.mk:35: failsafe] Error 2
make[5]: *** Waiting for unfinished jobs....
  CC hinic_pmd_tx.o
  CC i40e_common.o
  CC fm10k_common.o
  CC fm10k_mbx.o
--
  PMDINFO i40e_ethdev.o.pmd.c
  CC i40e_ethdev.o.pmd.o
  LD i40e_ethdev.o
  AR librte_pmd_i40e.a
  INSTALL-LIB librte_pmd_i40e.a
make[4]: *** [/tmp/SUSE15-64_K4.12.14_GCC7.3.1/x86_64-native-linuxapp-gcc/05ae8091d16e4bddaf31d9b8a30fb8e6/dpdk/mk/rte.subdir.mk:35: net] Error 2
make[3]: *** [/tmp/SUSE15-64_K4.12.14_GCC7.3.1/x86_64-native-linuxapp-gcc/05ae8091d16e4bddaf31d9b8a30fb8e6/dpdk/mk/rte.sdkbuild.mk:46: drivers] Error 2
make[2]: *** [/tmp/SUSE15-64_K4.12.14_GCC7.3.1/x86_64-native-linuxapp-gcc/05ae8091d16e4bddaf31d9b8a30fb8e6/dpdk/mk/rte.sdkroot.mk:99: all] Error 2
make[1]: *** [/tmp/SUSE15-64_K4.12.14_GCC7.3.1/x86_64-native-linuxapp-gcc/05ae8091d16e4bddaf31d9b8a30fb8e6/dpdk/mk/rte.sdkinstall.mk:61: pre_install] Error 2
make: *** [/tmp/SUSE15-64_K4.12.14_GCC7.3.1/x86_64-native-linuxapp-gcc/05ae8091d16e4bddaf31d9b8a30fb8e6/dpdk/mk/rte.sdkroot.mk:77: install] Error 2


*Make Build Failed #11:
OS: RHEL76-64
Target: x86_64-native-linuxapp-gcc
/tmp/RHEL76-64_K3.10.0_GCC4.8.5/x86_64-native-linuxapp-gcc/05ae8091d16e4bddaf31d9b8a30fb8e6/dpdk/drivers/net/failsafe/failsafe_ops.c:879:2: error: nested extern declaration of ‘rte_eth_basic_stats_get’ [-Werror=nested-externs]
  CC enic_res.o
/tmp/RHEL76-64_K3.10.0_GCC4.8.5/x86_64-native-linuxapp-gcc/05ae8091d16e4bddaf31d9b8a30fb8e6/dpdk/drivers/net/failsafe/failsafe_ops.c: At top level:
cc1: error: unrecognized command line option "-Wno-address-of-packed-member" [-Werror]
cc1: all warnings being treated as errors
make[6]: *** [failsafe_ops.o] Error 1
make[5]: *** [failsafe] Error 2
make[5]: *** Waiting for unfinished jobs....
  CC enic_flow.o
  CC igb_pf.o
  CC igb_flow.o
  CC base/vnic_cq.o
--
  PMDINFO i40e_ethdev.o.pmd.c
  CC i40e_ethdev.o.pmd.o
  LD i40e_ethdev.o
  AR librte_pmd_i40e.a
  INSTALL-LIB librte_pmd_i40e.a
make[4]: *** [net] Error 2
make[3]: *** [drivers] Error 2
make[2]: *** [all] Error 2
make[1]: *** [pre_install] Error 2
make: *** [install] Error 2


*Make Build Failed #12:
OS: FC30-64
Target: x86_64-native-linuxapp-gcc
  CC iavf_ethdev.o.pmd.o
  LD iavf_ethdev.o
  CC fm10k_common.o
  CC iavf_vchnl.o
cc1: all warnings being treated as errors
make[6]: *** [/tmp/FC30-64_K4.20_GCC9.1.1/x86_64-native-linuxapp-gcc/05ae8091d16e4bddaf31d9b8a30fb8e6/dpdk/mk/internal/rte.compile-pre.mk:116: failsafe_ops.o] Error 1
make[5]: *** [/tmp/FC30-64_K4.20_GCC9.1.1/x86_64-native-linuxapp-gcc/05ae8091d16e4bddaf31d9b8a30fb8e6/dpdk/mk/rte.subdir.mk:37: failsafe] Error 2
make[5]: *** Waiting for unfinished jobs....
  CC fm10k_mbx.o
  CC ice_sched.o
  CC hinic_pmd_hwif.o
  CC ipn3ke_flow.o
--
  CC i40e_ethdev_vf.o.pmd.o
  INSTALL-LIB librte_pmd_ice.a
  LD i40e_ethdev_vf.o
  AR librte_pmd_i40e.a
  INSTALL-LIB librte_pmd_i40e.a
make[4]: *** [/tmp/FC30-64_K4.20_GCC9.1.1/x86_64-native-linuxapp-gcc/05ae8091d16e4bddaf31d9b8a30fb8e6/dpdk/mk/rte.subdir.mk:35: net] Error 2
make[3]: *** [/tmp/FC30-64_K4.20_GCC9.1.1/x86_64-native-linuxapp-gcc/05ae8091d16e4bddaf31d9b8a30fb8e6/dpdk/mk/rte.sdkbuild.mk:46: drivers] Error 2
make[2]: *** [/tmp/FC30-64_K4.20_GCC9.1.1/x86_64-native-linuxapp-gcc/05ae8091d16e4bddaf31d9b8a30fb8e6/dpdk/mk/rte.sdkroot.mk:99: all] Error 2
make[1]: *** [/tmp/FC30-64_K4.20_GCC9.1.1/x86_64-native-linuxapp-gcc/05ae8091d16e4bddaf31d9b8a30fb8e6/dpdk/mk/rte.sdkinstall.mk:61: pre_install] Error 2
make: *** [/tmp/FC30-64_K4.20_GCC9.1.1/x86_64-native-linuxapp-gcc/05ae8091d16e4bddaf31d9b8a30fb8e6/dpdk/mk/rte.sdkroot.mk:77: install] Error 2


*Make Build Failed #13:
OS: FC30-64
Target: x86_64-native-linuxapp-clang
    ^
/tmp/FC30-64_K4.20_Clang8.0.0/x86_64-native-linuxapp-clang/05ae8091d16e4bddaf31d9b8a30fb8e6/dpdk/drivers/net/failsafe/failsafe_ops.c:879:8: error: implicit declaration of function 'rte_eth_basic_stats_get' is invalid in C99 [-Werror,-Wimplicit-function-declaration]
        ret = rte_eth_basic_stats_get(dev->data->port_id, xstats);
              ^
3 errors generated.
make[6]: *** [/tmp/FC30-64_K4.20_Clang8.0.0/x86_64-native-linuxapp-clang/05ae8091d16e4bddaf31d9b8a30fb8e6/dpdk/mk/internal/rte.compile-pre.mk:116: failsafe_ops.o] Error 1
make[6]: *** Waiting for unfinished jobs....
  CC hinic_pmd_eqs.o
== Build drivers/net/ice
  CC enic_res.o
  CC mc/dpkg.o
  CC e1000_mac.o
make[5]: *** [/tmp/FC30-64_K4.20_Clang8.0.0/x86_64-native-linuxapp-clang/05ae8091d16e4bddaf31d9b8a30fb8e6/dpdk/mk/rte.subdir.mk:37: failsafe] Error 2
make[5]: *** Waiting for unfinished jobs....
  CC e1000_manage.o
  CC hinic_pmd_hwdev.o
  CC i40e_common.o
  CC ice_controlq.o
--
  PMDINFO i40e_ethdev.o.pmd.c
  CC i40e_ethdev.o.pmd.o
  LD i40e_ethdev.o
  AR librte_pmd_i40e.a
  INSTALL-LIB librte_pmd_i40e.a
make[4]: *** [/tmp/FC30-64_K4.20_Clang8.0.0/x86_64-native-linuxapp-clang/05ae8091d16e4bddaf31d9b8a30fb8e6/dpdk/mk/rte.subdir.mk:35: net] Error 2
make[3]: *** [/tmp/FC30-64_K4.20_Clang8.0.0/x86_64-native-linuxapp-clang/05ae8091d16e4bddaf31d9b8a30fb8e6/dpdk/mk/rte.sdkbuild.mk:46: drivers] Error 2
make[2]: *** [/tmp/FC30-64_K4.20_Clang8.0.0/x86_64-native-linuxapp-clang/05ae8091d16e4bddaf31d9b8a30fb8e6/dpdk/mk/rte.sdkroot.mk:99: all] Error 2
make[1]: *** [/tmp/FC30-64_K4.20_Clang8.0.0/x86_64-native-linuxapp-clang/05ae8091d16e4bddaf31d9b8a30fb8e6/dpdk/mk/rte.sdkinstall.mk:61: pre_install] Error 2
make: *** [/tmp/FC30-64_K4.20_Clang8.0.0/x86_64-native-linuxapp-clang/05ae8091d16e4bddaf31d9b8a30fb8e6/dpdk/mk/rte.sdkroot.mk:77: install] Error 2


*Make Build Failed #14:
OS: SUSE15-64
Target: x86_64-native-linuxapp-clang
/tmp/SUSE15-64_K4.12.14_Clang5.0.1/x86_64-native-linuxapp-clang/05ae8091d16e4bddaf31d9b8a30fb8e6/dpdk/drivers/net/failsafe/failsafe_ops.c:879:8: note: did you mean 'rte_eth_basic_stats_count'?
/tmp/SUSE15-64_K4.12.14_Clang5.0.1/x86_64-native-linuxapp-clang/05ae8091d16e4bddaf31d9b8a30fb8e6/dpdk/drivers/net/failsafe/failsafe_ops.c:804:10: note: 'rte_eth_basic_stats_count' declared here
        count = rte_eth_basic_stats_count(dev);
                ^
3 errors generated.
make[6]: *** [/tmp/SUSE15-64_K4.12.14_Clang5.0.1/x86_64-native-linuxapp-clang/05ae8091d16e4bddaf31d9b8a30fb8e6/dpdk/mk/internal/rte.compile-pre.mk:114: failsafe_ops.o] Error 1
  PMDINFO igb_ethdev.o.pmd.c
  CC igb_ethdev.o.pmd.o
  PMDINFO fm10k_ethdev.o.pmd.c
  LD igb_ethdev.o
  CC fm10k_ethdev.o.pmd.o
--
  CC base/vnic_wq.o
  CC igb_flow.o
  CC base/vnic_dev.o
  CC em_ethdev.o
  CC fm10k_vf.o
make[5]: *** [/tmp/SUSE15-64_K4.12.14_Clang5.0.1/x86_64-native-linuxapp-clang/05ae8091d16e4bddaf31d9b8a30fb8e6/dpdk/mk/rte.subdir.mk:35: failsafe] Error 2
make[5]: *** Waiting for unfinished jobs....
  CC em_rxtx.o
== Build drivers/net/hinic
  CC base/vnic_intr.o
  CC fm10k_api.o
--
  PMDINFO hinic_pmd_ethdev.o.pmd.c
  CC hinic_pmd_ethdev.o.pmd.o
  LD hinic_pmd_ethdev.o
  AR librte_pmd_hinic.a
  INSTALL-LIB librte_pmd_hinic.a
make[4]: *** [/tmp/SUSE15-64_K4.12.14_Clang5.0.1/x86_64-native-linuxapp-clang/05ae8091d16e4bddaf31d9b8a30fb8e6/dpdk/mk/rte.subdir.mk:35: net] Error 2
make[3]: *** [/tmp/SUSE15-64_K4.12.14_Clang5.0.1/x86_64-native-linuxapp-clang/05ae8091d16e4bddaf31d9b8a30fb8e6/dpdk/mk/rte.sdkbuild.mk:46: drivers] Error 2
make[2]: *** [/tmp/SUSE15-64_K4.12.14_Clang5.0.1/x86_64-native-linuxapp-clang/05ae8091d16e4bddaf31d9b8a30fb8e6/dpdk/mk/rte.sdkroot.mk:99: all] Error 2
make[1]: *** [/tmp/SUSE15-64_K4.12.14_Clang5.0.1/x86_64-native-linuxapp-clang/05ae8091d16e4bddaf31d9b8a30fb8e6/dpdk/mk/rte.sdkinstall.mk:61: pre_install] Error 2
make: *** [/tmp/SUSE15-64_K4.12.14_Clang5.0.1/x86_64-native-linuxapp-clang/05ae8091d16e4bddaf31d9b8a30fb8e6/dpdk/mk/rte.sdkroot.mk:77: install] Error 2


*Make Build Failed #15:
OS: RHEL80-64
Target: x86_64-native-linuxapp-gcc
  CC hinic_pmd_hwdev.o
  CC e1000_phy.o
/tmp/RHEL80-64_K3.10.0_GCC8.2.1/x86_64-native-linuxapp-gcc/05ae8091d16e4bddaf31d9b8a30fb8e6/dpdk/drivers/net/failsafe/failsafe_ops.c: At top level:
cc1: error: unrecognized command line option ‘-Wno-address-of-packed-member’ [-Werror]
cc1: all warnings being treated as errors
make[6]: *** [/tmp/RHEL80-64_K3.10.0_GCC8.2.1/x86_64-native-linuxapp-gcc/05ae8091d16e4bddaf31d9b8a30fb8e6/dpdk/mk/internal/rte.compile-pre.mk:114: failsafe_ops.o] Error 1
make[5]: *** [/tmp/RHEL80-64_K3.10.0_GCC8.2.1/x86_64-native-linuxapp-gcc/05ae8091d16e4bddaf31d9b8a30fb8e6/dpdk/mk/rte.subdir.mk:37: failsafe] Error 2
make[5]: *** Waiting for unfinished jobs....
  CC e1000_vf.o
  CC i40e_common.o
  CC base/vnic_wq.o
  CC mc/dpni.o
--
  PMDINFO i40e_ethdev.o.pmd.c
  CC i40e_ethdev.o.pmd.o
  LD i40e_ethdev.o
  AR librte_pmd_i40e.a
  INSTALL-LIB librte_pmd_i40e.a
make[4]: *** [/tmp/RHEL80-64_K3.10.0_GCC8.2.1/x86_64-native-linuxapp-gcc/05ae8091d16e4bddaf31d9b8a30fb8e6/dpdk/mk/rte.subdir.mk:35: net] Error 2
make[3]: *** [/tmp/RHEL80-64_K3.10.0_GCC8.2.1/x86_64-native-linuxapp-gcc/05ae8091d16e4bddaf31d9b8a30fb8e6/dpdk/mk/rte.sdkbuild.mk:46: drivers] Error 2
make[2]: *** [/tmp/RHEL80-64_K3.10.0_GCC8.2.1/x86_64-native-linuxapp-gcc/05ae8091d16e4bddaf31d9b8a30fb8e6/dpdk/mk/rte.sdkroot.mk:99: all] Error 2
make[1]: *** [/tmp/RHEL80-64_K3.10.0_GCC8.2.1/x86_64-native-linuxapp-gcc/05ae8091d16e4bddaf31d9b8a30fb8e6/dpdk/mk/rte.sdkinstall.mk:61: pre_install] Error 2
make: *** [/tmp/RHEL80-64_K3.10.0_GCC8.2.1/x86_64-native-linuxapp-gcc/05ae8091d16e4bddaf31d9b8a30fb8e6/dpdk/mk/rte.sdkroot.mk:77: install] Error 2


*Make Build Failed #16:
OS: UB1604-64
Target: x86_64-native-linuxapp-gcc
  CC hinic_pmd_hwdev.o
/tmp/UB1604-64_K4.4.0_GCC5.4.0/x86_64-native-linuxapp-gcc/05ae8091d16e4bddaf31d9b8a30fb8e6/dpdk/drivers/net/failsafe/failsafe_ops.c: At top level:
cc1: error: unrecognized command line option ‘-Wno-address-of-packed-member’ [-Werror]
cc1: all warnings being treated as errors
  CC failsafe_rxtx.o
/tmp/UB1604-64_K4.4.0_GCC5.4.0/x86_64-native-linuxapp-gcc/05ae8091d16e4bddaf31d9b8a30fb8e6/dpdk/mk/internal/rte.compile-pre.mk:114: recipe for target 'failsafe_ops.o' failed
make[6]: *** [failsafe_ops.o] Error 1
make[6]: *** Waiting for unfinished jobs....
== Build drivers/net/ice
  CC fm10k_mbx.o
  CC fm10k_vf.o
  CC base/vnic_cq.o
/tmp/UB1604-64_K4.4.0_GCC5.4.0/x86_64-native-linuxapp-gcc/05ae8091d16e4bddaf31d9b8a30fb8e6/dpdk/mk/rte.subdir.mk:35: recipe for target 'failsafe' failed
make[5]: *** [failsafe] Error 2
make[5]: *** Waiting for unfinished jobs....
  CC iavf_adminq.o
  CC iavf_common.o
  SYMLINK-FILE include/rte_pmd_i40e.h
  CC i40e_adminq.o
--
  PMDINFO i40e_ethdev.o.pmd.c
  CC i40e_ethdev.o.pmd.o
  LD i40e_ethdev.o
  AR librte_pmd_i40e.a
  INSTALL-LIB librte_pmd_i40e.a
/tmp/UB1604-64_K4.4.0_GCC5.4.0/x86_64-native-linuxapp-gcc/05ae8091d16e4bddaf31d9b8a30fb8e6/dpdk/mk/rte.subdir.mk:35: recipe for target 'net' failed
make[4]: *** [net] Error 2
/tmp/UB1604-64_K4.4.0_GCC5.4.0/x86_64-native-linuxapp-gcc/05ae8091d16e4bddaf31d9b8a30fb8e6/dpdk/mk/rte.sdkbuild.mk:46: recipe for target 'drivers' failed
make[3]: *** [drivers] Error 2
/tmp/UB1604-64_K4.4.0_GCC5.4.0/x86_64-native-linuxapp-gcc/05ae8091d16e4bddaf31d9b8a30fb8e6/dpdk/mk/rte.sdkroot.mk:98: recipe for target 'all' failed
make[2]: *** [all] Error 2
/tmp/UB1604-64_K4.4.0_GCC5.4.0/x86_64-native-linuxapp-gcc/05ae8091d16e4bddaf31d9b8a30fb8e6/dpdk/mk/rte.sdkinstall.mk:60: recipe for target 'pre_install' failed
make[1]: *** [pre_install] Error 2
/tmp/UB1604-64_K4.4.0_GCC5.4.0/x86_64-native-linuxapp-gcc/05ae8091d16e4bddaf31d9b8a30fb8e6/dpdk/mk/rte.sdkroot.mk:77: recipe for target 'install' failed
make: *** [install] Error 2


*Make Build Failed #17:
OS: UB1804-64
Target: x86_64-native-linuxapp-gcc
  CC e1000_mac.o
  CC fm10k_common.o
/tmp/UB1804-64_K4.15.0_GCC7.3.0/x86_64-native-linuxapp-gcc/05ae8091d16e4bddaf31d9b8a30fb8e6/dpdk/drivers/net/failsafe/failsafe_ops.c: At top level:
cc1: error: unrecognized command line option ‘-Wno-address-of-packed-member’ [-Werror]
cc1: all warnings being treated as errors
/tmp/UB1804-64_K4.15.0_GCC7.3.0/x86_64-native-linuxapp-gcc/05ae8091d16e4bddaf31d9b8a30fb8e6/dpdk/mk/internal/rte.compile-pre.mk:114: recipe for target 'failsafe_ops.o' failed
make[6]: *** [failsafe_ops.o] Error 1
/tmp/UB1804-64_K4.15.0_GCC7.3.0/x86_64-native-linuxapp-gcc/05ae8091d16e4bddaf31d9b8a30fb8e6/dpdk/mk/rte.subdir.mk:35: recipe for target 'failsafe' failed
make[5]: *** [failsafe] Error 2
make[5]: *** Waiting for unfinished jobs....
  CC fm10k_mbx.o
  CC mc/dpni.o
  CC mc/dpkg.o
  CC fm10k_vf.o
--
  PMDINFO igb_ethdev.o.pmd.c
  CC igb_ethdev.o.pmd.o
  LD igb_ethdev.o
  AR librte_pmd_e1000.a
  INSTALL-LIB librte_pmd_e1000.a
/tmp/UB1804-64_K4.15.0_GCC7.3.0/x86_64-native-linuxapp-gcc/05ae8091d16e4bddaf31d9b8a30fb8e6/dpdk/mk/rte.subdir.mk:35: recipe for target 'net' failed
make[4]: *** [net] Error 2
/tmp/UB1804-64_K4.15.0_GCC7.3.0/x86_64-native-linuxapp-gcc/05ae8091d16e4bddaf31d9b8a30fb8e6/dpdk/mk/rte.sdkbuild.mk:46: recipe for target 'drivers' failed
make[3]: *** [drivers] Error 2
/tmp/UB1804-64_K4.15.0_GCC7.3.0/x86_64-native-linuxapp-gcc/05ae8091d16e4bddaf31d9b8a30fb8e6/dpdk/mk/rte.sdkroot.mk:98: recipe for target 'all' failed
make[2]: *** [all] Error 2
/tmp/UB1804-64_K4.15.0_GCC7.3.0/x86_64-native-linuxapp-gcc/05ae8091d16e4bddaf31d9b8a30fb8e6/dpdk/mk/rte.sdkinstall.mk:60: recipe for target 'pre_install' failed
make[1]: *** [pre_install] Error 2
/tmp/UB1804-64_K4.15.0_GCC7.3.0/x86_64-native-linuxapp-gcc/05ae8091d16e4bddaf31d9b8a30fb8e6/dpdk/mk/rte.sdkroot.mk:77: recipe for target 'install' failed
make: *** [install] Error 2


*Make Build Failed #18:
OS: FreeBSD12-64
Target: x86_64-native-bsdapp-gcc
  CC igb_rxtx.o
  CC base/vnic_rq.o
/tmp/FreeBSD12-64_K19.02_GCC7.3.0/x86_64-native-bsdapp-gcc/05ae8091d16e4bddaf31d9b8a30fb8e6/dpdk/drivers/net/failsafe/failsafe_ops.c: At top level:
cc1: error: unrecognized command line option '-Wno-address-of-packed-member' [-Werror]
cc1: all warnings being treated as errors
gmake[6]: *** [/tmp/FreeBSD12-64_K19.02_GCC7.3.0/x86_64-native-bsdapp-gcc/05ae8091d16e4bddaf31d9b8a30fb8e6/dpdk/mk/internal/rte.compile-pre.mk:116: failsafe_ops.o] Error 1
gmake[5]: *** [/tmp/FreeBSD12-64_K19.02_GCC7.3.0/x86_64-native-bsdapp-gcc/05ae8091d16e4bddaf31d9b8a30fb8e6/dpdk/mk/rte.subdir.mk:37: failsafe] Error 2
gmake[5]: *** Waiting for unfinished jobs....
  CC i40e_nvm.o
  CC ixgbe_82598.o
  CC fm10k_rxtx_vec.o
  CC enic_rxtx_vec_avx2.o
--
  PMDINFO ixgbe_ethdev.o.pmd.c
  CC ixgbe_ethdev.o.pmd.o
  LD ixgbe_ethdev.o
  AR librte_pmd_ixgbe.a
  INSTALL-LIB librte_pmd_ixgbe.a
gmake[4]: *** [/tmp/FreeBSD12-64_K19.02_GCC7.3.0/x86_64-native-bsdapp-gcc/05ae8091d16e4bddaf31d9b8a30fb8e6/dpdk/mk/rte.subdir.mk:35: net] Error 2
gmake[3]: *** [/tmp/FreeBSD12-64_K19.02_GCC7.3.0/x86_64-native-bsdapp-gcc/05ae8091d16e4bddaf31d9b8a30fb8e6/dpdk/mk/rte.sdkbuild.mk:46: drivers] Error 2
gmake[2]: *** [/tmp/FreeBSD12-64_K19.02_GCC7.3.0/x86_64-native-bsdapp-gcc/05ae8091d16e4bddaf31d9b8a30fb8e6/dpdk/mk/rte.sdkroot.mk:99: all] Error 2
gmake[1]: *** [/tmp/FreeBSD12-64_K19.02_GCC7.3.0/x86_64-native-bsdapp-gcc/05ae8091d16e4bddaf31d9b8a30fb8e6/dpdk/mk/rte.sdkinstall.mk:61: pre_install] Error 2
gmake: *** [/tmp/FreeBSD12-64_K19.02_GCC7.3.0/x86_64-native-bsdapp-gcc/05ae8091d16e4bddaf31d9b8a30fb8e6/dpdk/mk/rte.sdkroot.mk:77: install] Error 2


*Make Build Failed #19:
OS: CENTOS76-64
Target: x86_64-native-linuxapp-gcc
  ^
/tmp/CENTOS76-64_K3.10.0_GCC4.8.5/x86_64-native-linuxapp-gcc/05ae8091d16e4bddaf31d9b8a30fb8e6/dpdk/drivers/net/failsafe/failsafe_ops.c:879:2: error: nested extern declaration of ‘rte_eth_basic_stats_get’ [-Werror=nested-externs]
/tmp/CENTOS76-64_K3.10.0_GCC4.8.5/x86_64-native-linuxapp-gcc/05ae8091d16e4bddaf31d9b8a30fb8e6/dpdk/drivers/net/failsafe/failsafe_ops.c: At top level:
cc1: error: unrecognized command line option "-Wno-address-of-packed-member" [-Werror]
cc1: all warnings being treated as errors
make[6]: *** [failsafe_ops.o] Error 1
make[5]: *** [failsafe] Error 2
make[5]: *** Waiting for unfinished jobs....
  CC e1000_mac.o
  CC hinic_pmd_api_cmd.o
  PMDINFO dpaa2_sec_dpseci.o.pmd.c
  CC enic_rxtx.o
--
  PMDINFO igb_ethdev.o.pmd.c
  CC igb_ethdev.o.pmd.o
  LD igb_ethdev.o
  AR librte_pmd_e1000.a
  INSTALL-LIB librte_pmd_e1000.a
make[4]: *** [net] Error 2
make[3]: *** [drivers] Error 2
make[2]: *** [all] Error 2
make[1]: *** [pre_install] Error 2
make: *** [install] Error 2


*Make Build Failed #20:
OS: FreeBSD12-64
Target: x86_64-native-bsdapp-gcc+shared
/tmp/FreeBSD12-64_K19.02_GCC7.3.0/x86_64-native-bsdapp-gcc+shared/05ae8091d16e4bddaf31d9b8a30fb8e6/dpdk/drivers/net/failsafe/failsafe_ops.c: At top level:
cc1: error: unrecognized command line option '-Wno-address-of-packed-member' [-Werror]
cc1: all warnings being treated as errors
  PMDINFO fm10k_ethdev.o.pmd.c
  CC fm10k_ethdev.o.pmd.o
gmake[6]: *** [/tmp/FreeBSD12-64_K19.02_GCC7.3.0/x86_64-native-bsdapp-gcc+shared/05ae8091d16e4bddaf31d9b8a30fb8e6/dpdk/mk/internal/rte.compile-pre.mk:116: failsafe_ops.o] Error 1
gmake[6]: *** Waiting for unfinished jobs....
  LD fm10k_ethdev.o
  CC fm10k_pf.o
  CC scheduler_roundrobin.o
  LD librte_pmd_atlantic.so.1.1
  CC enic_flow.o
gmake[5]: *** [/tmp/FreeBSD12-64_K19.02_GCC7.3.0/x86_64-native-bsdapp-gcc+shared/05ae8091d16e4bddaf31d9b8a30fb8e6/dpdk/mk/rte.subdir.mk:35: failsafe] Error 2
  CC scheduler_pkt_size_distr.o
gmake[5]: *** Waiting for unfinished jobs....
== Build drivers/crypto/virtio
  CC fm10k_tlv.o
  INSTALL-LIB librte_pmd_atlantic.so.1.1
--
  PMDINFO igb_ethdev.o.pmd.c
  CC igb_ethdev.o.pmd.o
  LD igb_ethdev.o
  LD librte_pmd_e1000.so.1.1
  INSTALL-LIB librte_pmd_e1000.so.1.1
gmake[4]: *** [/tmp/FreeBSD12-64_K19.02_GCC7.3.0/x86_64-native-bsdapp-gcc+shared/05ae8091d16e4bddaf31d9b8a30fb8e6/dpdk/mk/rte.subdir.mk:35: net] Error 2
gmake[4]: *** Waiting for unfinished jobs....
  PMDINFO virtio_cryptodev.o.pmd.c
  CC virtio_cryptodev.o.pmd.o
  LD virtio_cryptodev.o
  LD librte_pmd_virtio_crypto.so.1.1
  INSTALL-LIB librte_pmd_virtio_crypto.so.1.1
gmake[3]: *** [/tmp/FreeBSD12-64_K19.02_GCC7.3.0/x86_64-native-bsdapp-gcc+shared/05ae8091d16e4bddaf31d9b8a30fb8e6/dpdk/mk/rte.sdkbuild.mk:46: drivers] Error 2
gmake[2]: *** [/tmp/FreeBSD12-64_K19.02_GCC7.3.0/x86_64-native-bsdapp-gcc+shared/05ae8091d16e4bddaf31d9b8a30fb8e6/dpdk/mk/rte.sdkroot.mk:99: all] Error 2
gmake[1]: *** [/tmp/FreeBSD12-64_K19.02_GCC7.3.0/x86_64-native-bsdapp-gcc+shared/05ae8091d16e4bddaf31d9b8a30fb8e6/dpdk/mk/rte.sdkinstall.mk:61: pre_install] Error 2
gmake: *** [/tmp/FreeBSD12-64_K19.02_GCC7.3.0/x86_64-native-bsdapp-gcc+shared/05ae8091d16e4bddaf31d9b8a30fb8e6/dpdk/mk/rte.sdkroot.mk:77: install] Error 2


*Make Build Failed #21:
OS: FreeBSD12-64
Target: x86_64-native-bsdapp-gcc+debug
  CC clip_tbl.o
  CC enic_clsf.o
/tmp/FreeBSD12-64_K19.02_GCC7.3.0/x86_64-native-bsdapp-gcc+debug/05ae8091d16e4bddaf31d9b8a30fb8e6/dpdk/drivers/net/failsafe/failsafe_ops.c: At top level:
cc1: error: unrecognized command line option '-Wno-address-of-packed-member' [-Werror]
cc1: all warnings being treated as errors
gmake[6]: *** [/tmp/FreeBSD12-64_K19.02_GCC7.3.0/x86_64-native-bsdapp-gcc+debug/05ae8091d16e4bddaf31d9b8a30fb8e6/dpdk/mk/internal/rte.compile-pre.mk:114: failsafe_ops.o] Error 1
gmake[5]: *** [/tmp/FreeBSD12-64_K19.02_GCC7.3.0/x86_64-native-bsdapp-gcc+debug/05ae8091d16e4bddaf31d9b8a30fb8e6/dpdk/mk/rte.subdir.mk:35: failsafe] Error 2
gmake[5]: *** Waiting for unfinished jobs....
  CC e1000_mac.o
  CC mps_tcam.o
  CC e1000_manage.o
  CC enic_res.o
--
  PMDINFO i40e_ethdev.o.pmd.c
  CC i40e_ethdev.o.pmd.o
  LD i40e_ethdev.o
  AR librte_pmd_i40e.a
  INSTALL-LIB librte_pmd_i40e.a
gmake[4]: *** [/tmp/FreeBSD12-64_K19.02_GCC7.3.0/x86_64-native-bsdapp-gcc+debug/05ae8091d16e4bddaf31d9b8a30fb8e6/dpdk/mk/rte.subdir.mk:35: net] Error 2
gmake[3]: *** [/tmp/FreeBSD12-64_K19.02_GCC7.3.0/x86_64-native-bsdapp-gcc+debug/05ae8091d16e4bddaf31d9b8a30fb8e6/dpdk/mk/rte.sdkbuild.mk:46: drivers] Error 2
gmake[2]: *** [/tmp/FreeBSD12-64_K19.02_GCC7.3.0/x86_64-native-bsdapp-gcc+debug/05ae8091d16e4bddaf31d9b8a30fb8e6/dpdk/mk/rte.sdkroot.mk:99: all] Error 2
gmake[1]: *** [/tmp/FreeBSD12-64_K19.02_GCC7.3.0/x86_64-native-bsdapp-gcc+debug/05ae8091d16e4bddaf31d9b8a30fb8e6/dpdk/mk/rte.sdkinstall.mk:61: pre_install] Error 2
gmake: *** [/tmp/FreeBSD12-64_K19.02_GCC7.3.0/x86_64-native-bsdapp-gcc+debug/05ae8091d16e4bddaf31d9b8a30fb8e6/dpdk/mk/rte.sdkroot.mk:77: install] Error 2


*Make Build Failed #22:
OS: FreeBSD12-64
Target: x86_64-native-bsdapp-clang
    ^
/tmp/FreeBSD12-64_K19.02_Clang6.0.1/x86_64-native-bsdapp-clang/05ae8091d16e4bddaf31d9b8a30fb8e6/dpdk/drivers/net/failsafe/failsafe_ops.c:879:8: error: implicit declaration of function 'rte_eth_basic_stats_get' is invalid in C99 [-Werror,-Wimplicit-function-declaration]
        ret = rte_eth_basic_stats_get(dev->data->port_id, xstats);
              ^
3 errors generated.
gmake[6]: *** [/tmp/FreeBSD12-64_K19.02_Clang6.0.1/x86_64-native-bsdapp-clang/05ae8091d16e4bddaf31d9b8a30fb8e6/dpdk/mk/internal/rte.compile-pre.mk:114: failsafe_ops.o] Error 1
gmake[5]: *** [/tmp/FreeBSD12-64_K19.02_Clang6.0.1/x86_64-native-bsdapp-clang/05ae8091d16e4bddaf31d9b8a30fb8e6/dpdk/mk/rte.subdir.mk:35: failsafe] Error 2
gmake[5]: *** Waiting for unfinished jobs....
  CC iavf_vchnl.o
  CC e1000_nvm.o
  CC iavf_rxtx.o
  CC fm10k_vf.o
--
  PMDINFO i40e_ethdev.o.pmd.c
  CC i40e_ethdev.o.pmd.o
  LD i40e_ethdev.o
  AR librte_pmd_i40e.a
  INSTALL-LIB librte_pmd_i40e.a
gmake[4]: *** [/tmp/FreeBSD12-64_K19.02_Clang6.0.1/x86_64-native-bsdapp-clang/05ae8091d16e4bddaf31d9b8a30fb8e6/dpdk/mk/rte.subdir.mk:35: net] Error 2
gmake[3]: *** [/tmp/FreeBSD12-64_K19.02_Clang6.0.1/x86_64-native-bsdapp-clang/05ae8091d16e4bddaf31d9b8a30fb8e6/dpdk/mk/rte.sdkbuild.mk:46: drivers] Error 2
gmake[2]: *** [/tmp/FreeBSD12-64_K19.02_Clang6.0.1/x86_64-native-bsdapp-clang/05ae8091d16e4bddaf31d9b8a30fb8e6/dpdk/mk/rte.sdkroot.mk:99: all] Error 2
gmake[1]: *** [/tmp/FreeBSD12-64_K19.02_Clang6.0.1/x86_64-native-bsdapp-clang/05ae8091d16e4bddaf31d9b8a30fb8e6/dpdk/mk/rte.sdkinstall.mk:61: pre_install] Error 2
gmake: *** [/tmp/FreeBSD12-64_K19.02_Clang6.0.1/x86_64-native-bsdapp-clang/05ae8091d16e4bddaf31d9b8a30fb8e6/dpdk/mk/rte.sdkroot.mk:77: install] Error 2

*Meson Build Failed #1:
OS: FC30-64
Target:build-gcc-static
FAILED: drivers/a715181@@tmp_rte_pmd_failsafe@sta/net_failsafe_failsafe_ops.c.o 
gcc -Idrivers/a715181@@tmp_rte_pmd_failsafe@sta -Idrivers -I../drivers -Idrivers/net/failsafe -I../drivers/net/failsafe -Ilib/librte_ethdev -I../lib/librte_ethdev -I. -I../ -Iconfig -I../config -Ilib/librte_eal/common/include -I../lib/librte_eal/common/include -I../lib/librte_eal/linux/eal/include -Ilib/librte_eal/common -I../lib/librte_eal/common -Ilib/librte_eal/common/include/arch/x86 -I../lib/librte_eal/common/include/arch/x86 -Ilib/librte_eal -I../lib/librte_eal -Ilib/librte_kvargs -I../lib/librte_kvargs -Ilib/librte_net -I../lib/librte_net -Ilib/librte_mbuf -I../lib/librte_mbuf -Ilib/librte_mempool -I../lib/librte_mempool -Ilib/librte_ring -I../lib/librte_ring -Ilib/librte_meter -I../lib/librte_meter -Idrivers/bus/pci -I../drivers/bus/pci -I../drivers/bus/pci/linux -Ilib/librte_pci -I../lib/librte_pci -Idrivers/bus/vdev -I../drivers/bus/vdev -fdiagnostics-color=always -pipe -D_FILE_OFFSET_BITS=64 -Wall -Winvalid-pch -Werror -O3 -include rte_config.h -Wunused-parameter -Wsign-compare -Wcast-qual -Wno-address-of-packed-member -D_GNU_SOURCE -fPIC -march=native -mno-avx512f -Wno-format-truncation -std=gnu99 -D_DEFAULT_SOURCE -D_XOPEN_SOURCE=700 -pedantic -DLINUX -DALLOW_EXPERIMENTAL_API -MD -MQ 'drivers/a715181@@tmp_rte_pmd_failsafe@sta/net_failsafe_failsafe_ops.c.o' -MF 'drivers/a715181@@tmp_rte_pmd_failsafe@sta/net_failsafe_failsafe_ops.c.o.d' -o 'drivers/a715181@@tmp_rte_pmd_failsafe@sta/net_failsafe_failsafe_ops.c.o' -c ../drivers/net/failsafe/failsafe_ops.c
../drivers/net/failsafe/failsafe_ops.c: In function ‘fs_xstats_count’:
../drivers/net/failsafe/failsafe_ops.c:804:10: error: implicit declaration of function ‘rte_eth_basic_stats_count’ [-Werror=implicit-function-declaration]
  804 |  count = rte_eth_basic_stats_count(dev);
      |          ^~~~~~~~~~~~~~~~~~~~~~~~~
../drivers/net/failsafe/failsafe_ops.c: In function ‘fs_xstats_get_names’:
../drivers/net/failsafe/failsafe_ops.c:830:6: error: implicit declaration of function ‘rte_eth_basic_stats_get_names’; did you mean ‘rte_eth_xstats_get_names’? [-Werror=implicit-function-declaration]
  830 |  r = rte_eth_basic_stats_get_names(dev, xstats_names);
      |      ^~~~~~~~~~~~~~~~~~~~~~~~~~~~~
      |      rte_eth_xstats_get_names
../drivers/net/failsafe/failsafe_ops.c: In function ‘fs_xstats_get’:
../drivers/net/failsafe/failsafe_ops.c:879:8: error: implicit declaration of function ‘rte_eth_basic_stats_get’; did you mean ‘rte_eth_linkstatus_get’? [-Werror=implicit-function-declaration]
  879 |  ret = rte_eth_basic_stats_get(dev->data->port_id, xstats);
      |        ^~~~~~~~~~~~~~~~~~~~~~~
      |        rte_eth_linkstatus_get
cc1: all warnings being treated as errors
[763/1784] Compiling C object 'drivers/net/i40e/base/3c1f984@@i40e_base@sta/i40e_hmc.c.o'.
[764/1784] Compiling C object 'drivers/a715181@@tmp_rte_pmd_fm10k@sta/net_fm10k_fm10k_ethdev.c.o'.
[765/1784] Compiling C object 'drivers/a715181@@tmp_rte_pmd_fm10k@sta/net_fm10k_fm10k_rxtx_vec.c.o'.
[766/1784] Compiling C object 'drivers/net/i40e/base/3c1f984@@i40e_base@sta/i40e_adminq.c.o'.
[767/1784] Compiling C object 'drivers/net/i40e/base/3c1f984@@i40e_base@sta/i40e_lan_hmc.c.o'.
[768/1784] Compiling C object 'drivers/net/i40e/base/3c1f984@@i40e_base@sta/i40e_nvm.c.o'.
[769/1784] Compiling C object 'drivers/net/i40e/base/3c1f984@@i40e_base@sta/i40e_common.c.o'.
ninja: build stopped: subcommand failed




*Meson Build Failed #2:
OS: RHEL80-64
Target:build-gcc-static
FAILED: drivers/a715181@@tmp_rte_pmd_failsafe@sta/net_failsafe_failsafe_ops.c.o 
gcc -Idrivers/a715181@@tmp_rte_pmd_failsafe@sta -Idrivers -I../drivers -Idrivers/net/failsafe -I../drivers/net/failsafe -Ilib/librte_ethdev -I../lib/librte_ethdev -I. -I../ -Iconfig -I../config -Ilib/librte_eal/common/include -I../lib/librte_eal/common/include -I../lib/librte_eal/linux/eal/include -Ilib/librte_eal/common -I../lib/librte_eal/common -Ilib/librte_eal/common/include/arch/x86 -I../lib/librte_eal/common/include/arch/x86 -Ilib/librte_eal -I../lib/librte_eal -Ilib/librte_kvargs -I../lib/librte_kvargs -Ilib/librte_net -I../lib/librte_net -Ilib/librte_mbuf -I../lib/librte_mbuf -Ilib/librte_mempool -I../lib/librte_mempool -Ilib/librte_ring -I../lib/librte_ring -Ilib/librte_meter -I../lib/librte_meter -Idrivers/bus/pci -I../drivers/bus/pci -I../drivers/bus/pci/linux -Ilib/librte_pci -I../lib/librte_pci -Idrivers/bus/vdev -I../drivers/bus/vdev -fdiagnostics-color=always -pipe -D_FILE_OFFSET_BITS=64 -Wall -Winvalid-pch -Werror -O3 -include rte_config.h -Wunused-parameter -Wsign-compare -Wcast-qual -D_GNU_SOURCE -fPIC -march=native -mno-avx512f -Wno-format-truncation -std=gnu99 -D_DEFAULT_SOURCE -D_XOPEN_SOURCE=700 -pedantic -DLINUX -DALLOW_EXPERIMENTAL_API -MD -MQ 'drivers/a715181@@tmp_rte_pmd_failsafe@sta/net_failsafe_failsafe_ops.c.o' -MF 'drivers/a715181@@tmp_rte_pmd_failsafe@sta/net_failsafe_failsafe_ops.c.o.d' -o 'drivers/a715181@@tmp_rte_pmd_failsafe@sta/net_failsafe_failsafe_ops.c.o' -c ../drivers/net/failsafe/failsafe_ops.c
../drivers/net/failsafe/failsafe_ops.c: In function ‘fs_xstats_count’:
../drivers/net/failsafe/failsafe_ops.c:804:10: error: implicit declaration of function ‘rte_eth_basic_stats_count’; did you mean ‘rte_eth_linkstatus_get’? [-Werror=implicit-function-declaration]
  count = rte_eth_basic_stats_count(dev);
          ^~~~~~~~~~~~~~~~~~~~~~~~~
          rte_eth_linkstatus_get
../drivers/net/failsafe/failsafe_ops.c: In function ‘fs_xstats_get_names’:
../drivers/net/failsafe/failsafe_ops.c:830:6: error: implicit declaration of function ‘rte_eth_basic_stats_get_names’; did you mean ‘rte_eth_xstats_get_names’? [-Werror=implicit-function-declaration]
  r = rte_eth_basic_stats_get_names(dev, xstats_names);
      ^~~~~~~~~~~~~~~~~~~~~~~~~~~~~
      rte_eth_xstats_get_names
../drivers/net/failsafe/failsafe_ops.c: In function ‘fs_xstats_get’:
../drivers/net/failsafe/failsafe_ops.c:879:8: error: implicit declaration of function ‘rte_eth_basic_stats_get’; did you mean ‘rte_eth_linkstatus_get’? [-Werror=implicit-function-declaration]
  ret = rte_eth_basic_stats_get(dev->data->port_id, xstats);
        ^~~~~~~~~~~~~~~~~~~~~~~
        rte_eth_linkstatus_get
cc1: all warnings being treated as errors
[773/1824] Compiling C object 'drivers/a715181@@tmp_rte_pmd_fm10k@sta/net_fm10k_fm10k_rxtx.c.o'.
[774/1824] Compiling C object 'drivers/a715181@@tmp_rte_pmd_fm10k@sta/net_fm10k_fm10k_rxtx_vec.c.o'.
[775/1824] Compiling C object 'drivers/a715181@@tmp_rte_pmd_fm10k@sta/net_fm10k_fm10k_ethdev.c.o'.
[776/1824] Compiling C object 'drivers/net/i40e/base/3c1f984@@i40e_base@sta/i40e_adminq.c.o'.
[777/1824] Compiling C object 'drivers/net/i40e/base/3c1f984@@i40e_base@sta/i40e_common.c.o'.
ninja: build stopped: subcommand failed




*Meson Build Failed #3:
OS: UB1604-32
Target:build-gcc-static
FAILED: drivers/a715181@@tmp_rte_pmd_failsafe@sta/net_failsafe_failsafe_ops.c.o 
gcc -Idrivers/a715181@@tmp_rte_pmd_failsafe@sta -Idrivers -I../drivers -Idrivers/net/failsafe -I../drivers/net/failsafe -Ilib/librte_ethdev -I../lib/librte_ethdev -I. -I../ -Iconfig -I../config -Ilib/librte_eal/common/include -I../lib/librte_eal/common/include -I../lib/librte_eal/linux/eal/include -Ilib/librte_eal/common -I../lib/librte_eal/common -Ilib/librte_eal/common/include/arch/x86 -I../lib/librte_eal/common/include/arch/x86 -Ilib/librte_eal -I../lib/librte_eal -Ilib/librte_kvargs -I../lib/librte_kvargs -Ilib/librte_net -I../lib/librte_net -Ilib/librte_mbuf -I../lib/librte_mbuf -Ilib/librte_mempool -I../lib/librte_mempool -Ilib/librte_ring -I../lib/librte_ring -Ilib/librte_meter -I../lib/librte_meter -Idrivers/bus/pci -I../drivers/bus/pci -I../drivers/bus/pci/linux -Ilib/librte_pci -I../lib/librte_pci -Idrivers/bus/vdev -I../drivers/bus/vdev -fdiagnostics-color=always -pipe -D_FILE_OFFSET_BITS=64 -Wall -Winvalid-pch -Werror -O3 -include rte_config.h -Wunused-parameter -Wsign-compare -Wcast-qual -Wno-pointer-to-int-cast -D_GNU_SOURCE -fPIC -march=native -std=gnu99 -D_DEFAULT_SOURCE -D_XOPEN_SOURCE=700 -pedantic -DLINUX -DALLOW_EXPERIMENTAL_API -MD -MQ 'drivers/a715181@@tmp_rte_pmd_failsafe@sta/net_failsafe_failsafe_ops.c.o' -MF 'drivers/a715181@@tmp_rte_pmd_failsafe@sta/net_failsafe_failsafe_ops.c.o.d' -o 'drivers/a715181@@tmp_rte_pmd_failsafe@sta/net_failsafe_failsafe_ops.c.o' -c ../drivers/net/failsafe/failsafe_ops.c
../drivers/net/failsafe/failsafe_ops.c: In function ‘fs_xstats_count’:
../drivers/net/failsafe/failsafe_ops.c:804:10: error: implicit declaration of function ‘rte_eth_basic_stats_count’ [-Werror=implicit-function-declaration]
  count = rte_eth_basic_stats_count(dev);
          ^
../drivers/net/failsafe/failsafe_ops.c: In function ‘fs_xstats_get_names’:
../drivers/net/failsafe/failsafe_ops.c:830:6: error: implicit declaration of function ‘rte_eth_basic_stats_get_names’ [-Werror=implicit-function-declaration]
  r = rte_eth_basic_stats_get_names(dev, xstats_names);
      ^
../drivers/net/failsafe/failsafe_ops.c: In function ‘fs_xstats_get’:
../drivers/net/failsafe/failsafe_ops.c:879:8: error: implicit declaration of function ‘rte_eth_basic_stats_get’ [-Werror=implicit-function-declaration]
  ret = rte_eth_basic_stats_get(dev->data->port_id, xstats);
        ^
cc1: all warnings being treated as errors
[753/1656] Compiling C object 'drivers/a715181@@tmp_rte_pmd_fm10k@sta/net_fm10k_fm10k_rxtx.c.o'.
[754/1656] Compiling C object 'drivers/a715181@@tmp_rte_pmd_fm10k@sta/net_fm10k_fm10k_rxtx_vec.c.o'.
[755/1656] Compiling C object 'drivers/a715181@@tmp_rte_pmd_fm10k@sta/net_fm10k_fm10k_ethdev.c.o'.
[756/1656] Compiling C object 'drivers/net/i40e/base/3c1f984@@i40e_base@sta/i40e_common.c.o'.
[757/1656] Compiling C object 'drivers/a715181@@tmp_rte_pmd_octeontx2_event@sta/event_octeontx2_otx2_worker.c.o'.
ninja: build stopped: subcommand failed




*Meson Build Failed #4:
OS: SUSE15-64
Target:build-gcc-static
FAILED: drivers/a715181@@tmp_rte_pmd_failsafe@sta/net_failsafe_failsafe_ops.c.o 
gcc -Idrivers/a715181@@tmp_rte_pmd_failsafe@sta -Idrivers -I../drivers -Idrivers/net/failsafe -I../drivers/net/failsafe -Ilib/librte_ethdev -I../lib/librte_ethdev -I. -I../ -Iconfig -I../config -Ilib/librte_eal/common/include -I../lib/librte_eal/common/include -I../lib/librte_eal/linux/eal/include -Ilib/librte_eal/common -I../lib/librte_eal/common -Ilib/librte_eal/common/include/arch/x86 -I../lib/librte_eal/common/include/arch/x86 -Ilib/librte_eal -I../lib/librte_eal -Ilib/librte_kvargs -I../lib/librte_kvargs -Ilib/librte_net -I../lib/librte_net -Ilib/librte_mbuf -I../lib/librte_mbuf -Ilib/librte_mempool -I../lib/librte_mempool -Ilib/librte_ring -I../lib/librte_ring -Ilib/librte_meter -I../lib/librte_meter -Idrivers/bus/pci -I../drivers/bus/pci -I../drivers/bus/pci/linux -Ilib/librte_pci -I../lib/librte_pci -Idrivers/bus/vdev -I../drivers/bus/vdev -fdiagnostics-color=always -pipe -D_FILE_OFFSET_BITS=64 -Wall -Winvalid-pch -Werror -O3 -include rte_config.h -Wunused-parameter -Wsign-compare -Wcast-qual -D_GNU_SOURCE -fPIC -march=native -Wno-format-truncation -std=gnu99 -D_DEFAULT_SOURCE -D_XOPEN_SOURCE=700 -pedantic -DLINUX -DALLOW_EXPERIMENTAL_API -MD -MQ 'drivers/a715181@@tmp_rte_pmd_failsafe@sta/net_failsafe_failsafe_ops.c.o' -MF 'drivers/a715181@@tmp_rte_pmd_failsafe@sta/net_failsafe_failsafe_ops.c.o.d' -o 'drivers/a715181@@tmp_rte_pmd_failsafe@sta/net_failsafe_failsafe_ops.c.o' -c ../drivers/net/failsafe/failsafe_ops.c
../drivers/net/failsafe/failsafe_ops.c: In function ‘fs_xstats_count’:
../drivers/net/failsafe/failsafe_ops.c:804:10: error: implicit declaration of function ‘rte_eth_basic_stats_count’; did you mean ‘rte_eth_linkstatus_get’? [-Werror=implicit-function-declaration]
  count = rte_eth_basic_stats_count(dev);
          ^~~~~~~~~~~~~~~~~~~~~~~~~
          rte_eth_linkstatus_get
../drivers/net/failsafe/failsafe_ops.c: In function ‘fs_xstats_get_names’:
../drivers/net/failsafe/failsafe_ops.c:830:6: error: implicit declaration of function ‘rte_eth_basic_stats_get_names’; did you mean ‘rte_eth_xstats_get_names’? [-Werror=implicit-function-declaration]
  r = rte_eth_basic_stats_get_names(dev, xstats_names);
      ^~~~~~~~~~~~~~~~~~~~~~~~~~~~~
      rte_eth_xstats_get_names
../drivers/net/failsafe/failsafe_ops.c: In function ‘fs_xstats_get’:
../drivers/net/failsafe/failsafe_ops.c:879:8: error: implicit declaration of function ‘rte_eth_basic_stats_get’; did you mean ‘rte_eth_linkstatus_get’? [-Werror=implicit-function-declaration]
  ret = rte_eth_basic_stats_get(dev->data->port_id, xstats);
        ^~~~~~~~~~~~~~~~~~~~~~~
        rte_eth_linkstatus_get
cc1: all warnings being treated as errors
[775/1831] Compiling C object 'drivers/net/i40e/base/3c1f984@@i40e_base@sta/i40e_adminq.c.o'.
[776/1831] Compiling C object 'drivers/net/i40e/base/3c1f984@@i40e_base@sta/i40e_lan_hmc.c.o'.
[777/1831] Compiling C object 'drivers/net/i40e/base/3c1f984@@i40e_base@sta/i40e_nvm.c.o'.
[778/1831] Compiling C object 'drivers/net/i40e/base/3c1f984@@i40e_base@sta/i40e_common.c.o'.
[779/1831] Compiling C object 'drivers/a715181@@tmp_rte_pmd_fm10k@sta/net_fm10k_fm10k_ethdev.c.o'.
[780/1831] Compiling C object 'drivers/a715181@@tmp_rte_pmd_i40e@sta/net_i40e_i40e_rxtx.c.o'.
[781/1831] Compiling C object 'drivers/a715181@@tmp_rte_pmd_i40e@sta/net_i40e_i40e_ethdev.c.o'.
ninja: build stopped: subcommand failed




*Meson Build Failed #5:
OS: UB1804-64
Target:build-gcc-static
FAILED: drivers/a715181@@tmp_rte_pmd_failsafe@sta/net_failsafe_failsafe_ops.c.o 
gcc -Idrivers/a715181@@tmp_rte_pmd_failsafe@sta -Idrivers -I../drivers -Idrivers/net/failsafe -I../drivers/net/failsafe -Ilib/librte_ethdev -I../lib/librte_ethdev -I. -I../ -Iconfig -I../config -Ilib/librte_eal/common/include -I../lib/librte_eal/common/include -I../lib/librte_eal/linux/eal/include -Ilib/librte_eal/common -I../lib/librte_eal/common -Ilib/librte_eal/common/include/arch/x86 -I../lib/librte_eal/common/include/arch/x86 -Ilib/librte_eal -I../lib/librte_eal -Ilib/librte_kvargs -I../lib/librte_kvargs -Ilib/librte_net -I../lib/librte_net -Ilib/librte_mbuf -I../lib/librte_mbuf -Ilib/librte_mempool -I../lib/librte_mempool -Ilib/librte_ring -I../lib/librte_ring -Ilib/librte_meter -I../lib/librte_meter -Idrivers/bus/pci -I../drivers/bus/pci -I../drivers/bus/pci/linux -Ilib/librte_pci -I../lib/librte_pci -Idrivers/bus/vdev -I../drivers/bus/vdev -fdiagnostics-color=always -pipe -D_FILE_OFFSET_BITS=64 -Wall -Winvalid-pch -Werror -O3 -include rte_config.h -Wunused-parameter -Wsign-compare -Wcast-qual -D_GNU_SOURCE -fPIC -march=native -mno-avx512f -Wno-format-truncation -std=gnu99 -D_DEFAULT_SOURCE -D_XOPEN_SOURCE=700 -pedantic -DLINUX -DALLOW_EXPERIMENTAL_API -MD -MQ 'drivers/a715181@@tmp_rte_pmd_failsafe@sta/net_failsafe_failsafe_ops.c.o' -MF 'drivers/a715181@@tmp_rte_pmd_failsafe@sta/net_failsafe_failsafe_ops.c.o.d' -o 'drivers/a715181@@tmp_rte_pmd_failsafe@sta/net_failsafe_failsafe_ops.c.o' -c ../drivers/net/failsafe/failsafe_ops.c
../drivers/net/failsafe/failsafe_ops.c: In function ‘fs_xstats_count’:
../drivers/net/failsafe/failsafe_ops.c:804:10: error: implicit declaration of function ‘rte_eth_basic_stats_count’; did you mean ‘rte_eth_linkstatus_get’? [-Werror=implicit-function-declaration]
  count = rte_eth_basic_stats_count(dev);
          ^~~~~~~~~~~~~~~~~~~~~~~~~
          rte_eth_linkstatus_get
../drivers/net/failsafe/failsafe_ops.c: In function ‘fs_xstats_get_names’:
../drivers/net/failsafe/failsafe_ops.c:830:6: error: implicit declaration of function ‘rte_eth_basic_stats_get_names’; did you mean ‘rte_eth_xstats_get_names’? [-Werror=implicit-function-declaration]
  r = rte_eth_basic_stats_get_names(dev, xstats_names);
      ^~~~~~~~~~~~~~~~~~~~~~~~~~~~~
      rte_eth_xstats_get_names
../drivers/net/failsafe/failsafe_ops.c: In function ‘fs_xstats_get’:
../drivers/net/failsafe/failsafe_ops.c:879:8: error: implicit declaration of function ‘rte_eth_basic_stats_get’; did you mean ‘rte_eth_linkstatus_get’? [-Werror=implicit-function-declaration]
  ret = rte_eth_basic_stats_get(dev->data->port_id, xstats);
        ^~~~~~~~~~~~~~~~~~~~~~~
        rte_eth_linkstatus_get
cc1: all warnings being treated as errors
[772/1791] Compiling C object 'drivers/net/i40e/base/3c1f984@@i40e_base@sta/i40e_dcb.c.o'.
[773/1791] Compiling C object 'drivers/a715181@@tmp_rte_pmd_fm10k@sta/net_fm10k_fm10k_rxtx_vec.c.o'.
[774/1791] Compiling C object 'drivers/net/i40e/base/3c1f984@@i40e_base@sta/i40e_adminq.c.o'.
[775/1791] Compiling C object 'drivers/a715181@@tmp_rte_pmd_fm10k@sta/net_fm10k_fm10k_ethdev.c.o'.
[776/1791] Compiling C object 'drivers/net/i40e/base/3c1f984@@i40e_base@sta/i40e_common.c.o'.
ninja: build stopped: subcommand failed




*Meson Build Failed #6:
OS: FreeBSD12-64
Target:build-gcc-static
FAILED: drivers/a715181@@tmp_rte_pmd_failsafe@sta/net_failsafe_failsafe_ops.c.o 
ccache gcc -Idrivers/a715181@@tmp_rte_pmd_failsafe@sta -Idrivers -I../drivers -Idrivers/net/failsafe -I../drivers/net/failsafe -Ilib/librte_ethdev -I../lib/librte_ethdev -I. -I../ -Iconfig -I../config -Ilib/librte_eal/common/include -I../lib/librte_eal/common/include -I../lib/librte_eal/freebsd/eal/include -Ilib/librte_eal/common -I../lib/librte_eal/common -Ilib/librte_eal/common/include/arch/x86 -I../lib/librte_eal/common/include/arch/x86 -Ilib/librte_eal -I../lib/librte_eal -Ilib/librte_kvargs -I../lib/librte_kvargs -Ilib/librte_net -I../lib/librte_net -Ilib/librte_mbuf -I../lib/librte_mbuf -Ilib/librte_mempool -I../lib/librte_mempool -Ilib/librte_ring -I../lib/librte_ring -Ilib/librte_meter -I../lib/librte_meter -Idrivers/bus/pci -I../drivers/bus/pci -I../drivers/bus/pci/bsd -Ilib/librte_pci -I../lib/librte_pci -Idrivers/bus/vdev -I../drivers/bus/vdev -fdiagnostics-color=always -pipe -D_FILE_OFFSET_BITS=64 -Wall -Winvalid-pch -Werror -O3 -include rte_config.h -Wunused-parameter -Wsign-compare -Wcast-qual -D_GNU_SOURCE -D__BSD_VISIBLE -fPIC -march=native -Wno-format-truncation -std=gnu99 -D_DEFAULT_SOURCE -D_XOPEN_SOURCE=700 -pedantic -DBSD -DALLOW_EXPERIMENTAL_API -MD -MQ 'drivers/a715181@@tmp_rte_pmd_failsafe@sta/net_failsafe_failsafe_ops.c.o' -MF 'drivers/a715181@@tmp_rte_pmd_failsafe@sta/net_failsafe_failsafe_ops.c.o.d' -o 'drivers/a715181@@tmp_rte_pmd_failsafe@sta/net_failsafe_failsafe_ops.c.o' -c ../drivers/net/failsafe/failsafe_ops.c
../drivers/net/failsafe/failsafe_ops.c: In function 'fs_xstats_count':
../drivers/net/failsafe/failsafe_ops.c:804:10: error: implicit declaration of function 'rte_eth_basic_stats_count'; did you mean 'rte_eth_linkstatus_get'? [-Werror=implicit-function-declaration]
  count = rte_eth_basic_stats_count(dev);
          ^~~~~~~~~~~~~~~~~~~~~~~~~
          rte_eth_linkstatus_get
../drivers/net/failsafe/failsafe_ops.c: In function 'fs_xstats_get_names':
../drivers/net/failsafe/failsafe_ops.c:830:6: error: implicit declaration of function 'rte_eth_basic_stats_get_names'; did you mean 'rte_eth_xstats_get_names'? [-Werror=implicit-function-declaration]
  r = rte_eth_basic_stats_get_names(dev, xstats_names);
      ^~~~~~~~~~~~~~~~~~~~~~~~~~~~~
      rte_eth_xstats_get_names
../drivers/net/failsafe/failsafe_ops.c: In function 'fs_xstats_get':
../drivers/net/failsafe/failsafe_ops.c:879:8: error: implicit declaration of function 'rte_eth_basic_stats_get'; did you mean 'rte_eth_linkstatus_get'? [-Werror=implicit-function-declaration]
  ret = rte_eth_basic_stats_get(dev->data->port_id, xstats);
        ^~~~~~~~~~~~~~~~~~~~~~~
        rte_eth_linkstatus_get
cc1: all warnings being treated as errors
[1111/1413] Compiling C object 'app/a172ced@@dpdk-test-compress-perf@exe/test-compress-perf_comp_perf_options_parse.c.o'.
[1112/1413] Compiling C object 'app/a172ced@@dpdk-test-compress-perf@exe/test-compress-perf_main.c.o'.
[1113/1413] Compiling C object 'app/a172ced@@dpdk-test-compress-perf@exe/test-compress-perf_comp_perf_test_verify.c.o'.
[1114/1413] Compiling C object 'app/a172ced@@dpdk-test-compress-perf@exe/test-compress-perf_comp_perf_test_benchmark.c.o'.
[1115/1413] Compiling C object 'app/a172ced@@dpdk-test-compress-perf@exe/test-compress-perf_comp_perf_test_common.c.o'.
ninja: build stopped: subcommand failed



DPDK STV team

^ permalink raw reply	[flat|nested] only message in thread

only message in thread, back to index

Thread overview: (only message) (download: mbox.gz / follow: Atom feed)
-- links below jump to the message on this page --
2019-08-11 16:36 [dpdk-test-report] |FAILURE| pw57611[v3, 1/2] ethdev: expose basic xstats for driver use sys_stv

automatic DPDK test reports

Archives are clonable:
	git clone --mirror http://inbox.dpdk.org/test-report/0 test-report/git/0.git

	# If you have public-inbox 1.1+ installed, you may
	# initialize and index your mirror using the following commands:
	public-inbox-init -V2 test-report test-report/ http://inbox.dpdk.org/test-report \
		test-report@dpdk.org
	public-inbox-index test-report


Newsgroup available over NNTP:
	nntp://inbox.dpdk.org/inbox.dpdk.test-report


AGPL code for this site: git clone https://public-inbox.org/ public-inbox