automatic DPDK test reports
 help / color / Atom feed
* [dpdk-test-report] |FAILURE| pw57619[v4] net/i40e: fix vf runtime queues rss config
@ 2019-08-12  9:13 sys_stv
  0 siblings, 0 replies; only message in thread
From: sys_stv @ 2019-08-12  9:13 UTC (permalink / raw)
  To: test-report

[-- Attachment #1: Type: text/plain, Size: 74782 bytes --]

Test-Label: Intel-compilation
Test-Status: FAILURE
http://dpdk.org/patch/57619

_Compilation issues_

Submitter: Xiao Zhang <xiao.zhang@intel.com>
Date: 2019-08-12 17:43:32
Reply_mail: 1565631812-3136-1-git-send-email-xiao.zhang@intel.com
DPDK git baseline: Repo:dpdk-next-net-intel, CommitID: d37997a2f8f6f8451297f7052e684cb04c486a1b

Makefile build Summary: 22 Builds Done, 0 Successful, 22 Failures

Meson build Summary: 8 Builds Done, 2 Successful, 6 Failures

               +==============================================+===========+==========+
               |                   Makefile                   |   Meson   | Document |
+--------------+------+-------+------+------------+-----------+-----------+----------+
| os           | gcc  | clang | icc  | gcc+shared | gcc+debug | gcc/clang | pdf/html |
+--------------+------+-------+------+------------+-----------+-----------+----------+
| RHEL76-64    | FAIL |       |      |            |           |           |          |
| CENTOS76-64  | FAIL |       |      |            |           |           |          |
| UB1804-64    | FAIL | FAIL  | FAIL |            |           | FAIL      | pass     |
| UB1604-32    | FAIL |       |      |            |           | FAIL      |          |
| UB1904-64    | FAIL |       |      |            |           |           |          |
| UB1604-64    | FAIL | FAIL  |      |            |           |           |          |
| FC30-64      | FAIL | FAIL  |      |            |           | FAIL      |          |
| WIN10-64     |      |       |      |            |           | pass      |          |
| FreeBSD12-64 | FAIL | FAIL  |      | FAIL       | FAIL      | FAIL      |          |
| RHEL80-64    | FAIL | FAIL  | FAIL | FAIL       | FAIL      | FAIL      |          |
| SUSE15-64    | FAIL | FAIL  |      |            |           | FAIL      |          |
+--------------+------+-------+------+------------+-----------+-----------+----------+

Test environment and configuration as below:

** Makefile build **


OS: RHEL76-64
	Kernel Version: 3.10.0-957.el7.x86_64
	CPU info: Intel(R) Xeon(R) CPU E5-2699 v4 @ 2.20GHz
	GCC Version: gcc (GCC) 4.8.5 20150623 (Red Hat 4.8.5-36)
	Clang Version: NA
	x86_64-native-linuxapp-gcc


OS: CENTOS76-64
	Kernel Version: 3.10.0-957.10.1.el7.x86_64
	CPU info: Intel(R) Xeon(R) CPU E5-2699 v4 @ 2.20GHz
	GCC Version: gcc (GCC) 4.8.5 20150623 (Red Hat 4.8.5-36)
	Clang Version: 3.4.2 (tags/RELEASE_34/dot2-final)
	x86_64-native-linuxapp-gcc


OS: UB1804-64
	Kernel Version: 4.15.0-20-generic
	CPU info: Intel(R) Xeon(R) CPU E5-2699 v3 @ 2.30GHz
	GCC Version: gcc (Ubuntu 7.3.0-27ubuntu1~18.04) 7.3.0
	Clang Version: 6.0.0-1ubuntu2 (tags/RELEASE_600/final)
	x86_64-native-linuxapp-icc
	x86_64-native-linuxapp-clang
	x86_64-native-linuxapp-gcc


OS: UB1904-64
	Kernel Version: 5.0.0-13-generic
	CPU info: Intel(R) Xeon(R) CPU E5-2699 v3 @ 2.30GHz
	GCC Version: gcc (Ubuntu 8.3.0-6ubuntu1) 8.3.0
	Clang Version: 8.0.0-3 (tags/RELEASE_800/final)
	x86_64-native-linuxapp-gcc


OS: UB1604-32
	Kernel Version: 4.4.0-131-generic
	CPU info: Intel(R) Xeon(R) CPU E5-2699 v3 @ 2.30GHz
	GCC Version: gcc (Ubuntu 5.4.0-6ubuntu1~16.04.11) 5.4.0 20160609
	Clang Version: 3.8.0-2ubuntu4 (tags/RELEASE_380/final)
	i686-native-linuxapp-gcc


OS: UB1604-64
	Kernel Version: 4.4.0-47-generic
	CPU info: Intel(R) Xeon(R) CPU E5-2699 v3 @ 2.30GHz
	GCC Version: gcc (Ubuntu 5.4.0-6ubuntu1~16.04.10) 5.4.0 20160609
	Clang Version: 3.8.0-2ubuntu4 (tags/RELEASE_380/final)
	x86_64-native-linuxapp-clang
	x86_64-native-linuxapp-gcc


OS: FC30-64
	Kernel Version: 5.1.7-300.fc30.x86_64
	CPU info: Intel(R) Xeon(R) CPU E5-2699 v4 @ 2.20GHz
	GCC Version: gcc (GCC) 9.1.1 20190503 (Red Hat 9.1.1-1)
	Clang Version: 8.0.0 (Fedora 8.0.0-1.fc30)
	x86_64-native-linuxapp-gcc
	x86_64-native-linuxapp-clang


OS: FreeBSD12-64
	Kernel Version: 12.0-RC3
	CPU info: Intel(R) Xeon(R) CPU E5-2699 v4 @ 2.20GHz (2194.98-MHz K8-class CPU)
	GCC Version: gcc (FreeBSD Ports Collection) 7.3.0
	Clang Version: 6.0.1 (tags/RELEASE_601/final 335540) (based on LLVM 6.0.1)
	x86_64-native-bsdapp-clang
	x86_64-native-bsdapp-gcc+shared
	x86_64-native-bsdapp-gcc
	x86_64-native-bsdapp-gcc+debug


OS: RHEL80-64
	Kernel Version: 4.18.0-80.el8.x86_64
	CPU info: Intel(R) Xeon(R) CPU E5-2699 v4 @ 2.20GHz
	GCC Version: gcc (GCC) 8.2.1 20180905 (Red Hat 8.2.1-3)
	Clang Version: NA
	x86_64-native-linuxapp-icc
	x86_64-native-linuxapp-gcc+debug
	x86_64-native-linuxapp-clang
	x86_64-native-linuxapp-gcc+shared
	x86_64-native-linuxapp-gcc


OS: SUSE15-64
	Kernel Version: 4.12.14-lp150.11-default
	CPU info: Intel(R) Xeon(R) CPU E5-2699 v4 @ 2.20GHz
	GCC Version: gcc (SUSE Linux) 7.3.1 20180323 [gcc-7-branch revision 258812]
	Clang Version: 5.0.1 (tags/RELEASE_501/final 312548)
	x86_64-native-linuxapp-gcc
	x86_64-native-linuxapp-clang


** Meson build **


OS: UB1804-64
	Kernel Version: 4.15.0-20-generic
	CPU info: Intel(R) Xeon(R) CPU E5-2699 v4 @ 2.20GHz
	GCC Version: gcc (Ubuntu 7.3.0-27ubuntu1~18.04) 7.3.0
	Clang Version: 6.0.0-1ubuntu2 (tags/RELEASE_600/final)
	x86_64-native-linuxapp-doc
	build-gcc-static
	build-gcc-shared
	build-clang-static
	build-clang-shared
	build-x86-default


OS: UB1604-32
	Kernel Version: 4.4.0-131-generic
	CPU info: Intel(R) Xeon(R) CPU E5-2699 v4 @ 2.20GHz
	GCC Version: gcc (Ubuntu 5.4.0-6ubuntu1~16.04.11) 5.4.0 20160609
	Clang Version: 3.8.0-2ubuntu4 (tags/RELEASE_380/final)
	build-gcc-static
	build-gcc-shared
	build-clang-static
	build-clang-shared
	build-x86-default


OS: FC30-64
	Kernel Version: 5.0.9-301.fc30.x86_64
	CPU info: Intel(R) Xeon(R) CPU E5-2699 v4 @ 2.20GHz
	GCC Version: gcc (GCC) 9.1.1 20190503 (Red Hat 9.1.1-1)
	Clang Version: 8.0.0 (Fedora 8.0.0-1.fc30)
	build-gcc-static
	build-gcc-shared
	build-clang-static
	build-clang-shared
	build-x86-default


OS: WIN10-64
	Kernel Version: N/A
	CPU info: N/A
	GCC Version: N/A
	Clang Version: Clang 8.0.0
	x86_64-windows-clang


OS: FreeBSD12-64
	Kernel Version: 12.0-RC3
	CPU info: Intel(R) Xeon(R) CPU E5-2699 v4 @ 2.20GHz (2194.99-MHz K8-class CPU)
	GCC Version: gcc (FreeBSD Ports Collection) 7.3.0
	Clang Version: 6.0.1 (tags/RELEASE_601/final 335540) (based on LLVM 6.0.1)
	build-gcc-static
	build-gcc-shared
	build-clang-static
	build-clang-shared
	build-x86-default


OS: RHEL80-64
	Kernel Version: 4.18.0-80.el8.x86_64
	CPU info: Intel(R) Xeon(R) CPU E5-2699 v4 @ 2.20GHz
	GCC Version: gcc (GCC) 8.2.1 20180905 (Red Hat 8.2.1-3)
	Clang Version: NA
	build-gcc-static
	build-gcc-shared
	build-x86-default


OS: SUSE15-64
	Kernel Version: 4.12.14-lp150.11-default
	CPU info: Intel(R) Xeon(R) CPU E5-2699 v4 @ 2.20GHz
	GCC Version: gcc (SUSE Linux) 7.3.1 20180323 [gcc-7-branch revision 258812]
	Clang Version: 5.0.1 (tags/RELEASE_501/final 312548)
	build-gcc-static
	build-gcc-shared
	build-clang-static
	build-clang-shared
	build-x86-default


*Make Build Failed #1:
OS: UB1604-64
Target: x86_64-native-linuxapp-clang
                         ^~~
/tmp/UB1604-64_K4.4.0_Clang3.8.0/x86_64-native-linuxapp-clang/adeb371164ac4d7d958708310b5827a0/dpdk/x86_64-native-linuxapp-clang/include/rte_malloc.h:255:16: note: passing argument to parameter 'ptr' here
rte_free(void *ptr);
               ^
5 errors generated.
/tmp/UB1604-64_K4.4.0_Clang3.8.0/x86_64-native-linuxapp-clang/adeb371164ac4d7d958708310b5827a0/dpdk/mk/internal/rte.compile-pre.mk:114: recipe for target 'i40e_ethdev_vf.o' failed
make[6]: *** [i40e_ethdev_vf.o] Error 1
make[6]: *** Waiting for unfinished jobs....
  CC ice_switch_filter.o
  LD ice_ethdev.o
  AR librte_pmd_octeontx.a
  INSTALL-LIB librte_pmd_octeontx.a
  CC rte_eth_pcap.o
== Build drivers/net/qede
  CC ice_rxtx_vec_avx2.o
  CC nfp_rtsym.o
  CC ixgbe_phy.o
/tmp/UB1604-64_K4.4.0_Clang3.8.0/x86_64-native-linuxapp-clang/adeb371164ac4d7d958708310b5827a0/dpdk/mk/rte.subdir.mk:35: recipe for target 'i40e' failed
make[5]: *** [i40e] Error 2
make[5]: *** Waiting for unfinished jobs....
  CC ixgbe_api.o
  CC ecore_dev.o
  CC ixgbe_vf.o
  CC nfp_nsp.o
--
  PMDINFO qede_ethdev.o.pmd.c
  CC qede_ethdev.o.pmd.o
  LD qede_ethdev.o
  AR librte_pmd_qede.a
  INSTALL-LIB librte_pmd_qede.a
/tmp/UB1604-64_K4.4.0_Clang3.8.0/x86_64-native-linuxapp-clang/adeb371164ac4d7d958708310b5827a0/dpdk/mk/rte.subdir.mk:35: recipe for target 'net' failed
make[4]: *** [net] Error 2
/tmp/UB1604-64_K4.4.0_Clang3.8.0/x86_64-native-linuxapp-clang/adeb371164ac4d7d958708310b5827a0/dpdk/mk/rte.sdkbuild.mk:46: recipe for target 'drivers' failed
make[3]: *** [drivers] Error 2
/tmp/UB1604-64_K4.4.0_Clang3.8.0/x86_64-native-linuxapp-clang/adeb371164ac4d7d958708310b5827a0/dpdk/mk/rte.sdkroot.mk:98: recipe for target 'all' failed
make[2]: *** [all] Error 2
/tmp/UB1604-64_K4.4.0_Clang3.8.0/x86_64-native-linuxapp-clang/adeb371164ac4d7d958708310b5827a0/dpdk/mk/rte.sdkinstall.mk:60: recipe for target 'pre_install' failed
make[1]: *** [pre_install] Error 2
/tmp/UB1604-64_K4.4.0_Clang3.8.0/x86_64-native-linuxapp-clang/adeb371164ac4d7d958708310b5827a0/dpdk/mk/rte.sdkroot.mk:77: recipe for target 'install' failed
make: *** [install] Error 2


*Make Build Failed #2:
OS: UB1604-32
Target: i686-native-linuxapp-gcc
 rte_write32(uint32_t value, volatile void *addr)
 ^
/tmp/UB1604-32_K4.4.0_GCC5.4.0/i686-native-linuxapp-gcc/adeb371164ac4d7d958708310b5827a0/dpdk/drivers/net/i40e/i40e_ethdev_vf.c: At top level:
cc1: error: unrecognized command line option ‘-Wno-address-of-packed-member’ [-Werror]
cc1: all warnings being treated as errors
/tmp/UB1604-32_K4.4.0_GCC5.4.0/i686-native-linuxapp-gcc/adeb371164ac4d7d958708310b5827a0/dpdk/mk/internal/rte.compile-pre.mk:114: recipe for target 'i40e_ethdev_vf.o' failed
make[6]: *** [i40e_ethdev_vf.o] Error 1
make[6]: *** Waiting for unfinished jobs....
  CC nicvf_svf.o
  CC ecore_cxt.o
  CC ixgbe_pf.o
  CC ixgbe_flow.o
--
  INSTALL-LIB librte_pmd_thunderx_nicvf.a
== Build drivers/net/virtio
  AR librte_pmd_vdev_netvsc.a
  INSTALL-LIB librte_pmd_vdev_netvsc.a
== Build drivers/net/vmxnet3
/tmp/UB1604-32_K4.4.0_GCC5.4.0/i686-native-linuxapp-gcc/adeb371164ac4d7d958708310b5827a0/dpdk/mk/rte.subdir.mk:35: recipe for target 'i40e' failed
make[5]: *** [i40e] Error 2
make[5]: *** Waiting for unfinished jobs....
  CC bnxt_txq.o
  CC tap_netlink.o
  CC bnxt_txr.o
  CC ecore_l2.o
--
  LD virtio_user_ethdev.o
  AR librte_pmd_virtio.a
  INSTALL-LIB librte_pmd_virtio.a
  AR librte_pmd_qede.a
  INSTALL-LIB librte_pmd_qede.a
/tmp/UB1604-32_K4.4.0_GCC5.4.0/i686-native-linuxapp-gcc/adeb371164ac4d7d958708310b5827a0/dpdk/mk/rte.subdir.mk:35: recipe for target 'net' failed
make[4]: *** [net] Error 2
/tmp/UB1604-32_K4.4.0_GCC5.4.0/i686-native-linuxapp-gcc/adeb371164ac4d7d958708310b5827a0/dpdk/mk/rte.sdkbuild.mk:46: recipe for target 'drivers' failed
make[3]: *** [drivers] Error 2
/tmp/UB1604-32_K4.4.0_GCC5.4.0/i686-native-linuxapp-gcc/adeb371164ac4d7d958708310b5827a0/dpdk/mk/rte.sdkroot.mk:98: recipe for target 'all' failed
make[2]: *** [all] Error 2
/tmp/UB1604-32_K4.4.0_GCC5.4.0/i686-native-linuxapp-gcc/adeb371164ac4d7d958708310b5827a0/dpdk/mk/rte.sdkinstall.mk:60: recipe for target 'pre_install' failed
make[1]: *** [pre_install] Error 2
/tmp/UB1604-32_K4.4.0_GCC5.4.0/i686-native-linuxapp-gcc/adeb371164ac4d7d958708310b5827a0/dpdk/mk/rte.sdkroot.mk:77: recipe for target 'install' failed
make: *** [install] Error 2


*Make Build Failed #3:
OS: UB1904-64
Target: x86_64-native-linuxapp-gcc
 rte_write32(uint32_t value, volatile void *addr)
             ~~~~~~~~~^~~~~
/tmp/UB1904-64_K4.18.0_GCC8.3.0/x86_64-native-linuxapp-gcc/adeb371164ac4d7d958708310b5827a0/dpdk/drivers/net/i40e/i40e_ethdev_vf.c: At top level:
cc1: error: unrecognized command line option ‘-Wno-address-of-packed-member’ [-Werror]
cc1: all warnings being treated as errors
make[6]: *** [/tmp/UB1904-64_K4.18.0_GCC8.3.0/x86_64-native-linuxapp-gcc/adeb371164ac4d7d958708310b5827a0/dpdk/mk/internal/rte.compile-pre.mk:116: i40e_ethdev_vf.o] Error 1
make[6]: *** Waiting for unfinished jobs....
== Build drivers/net/ixgbe
  CC ipn3ke_ethdev.o
  AR librte_pmd_iavf.a
  INSTALL-LIB librte_pmd_iavf.a
--
  CC i40e_ethdev.o.pmd.o
  LD i40e_ethdev.o
  CC ixgbe_common.o
  CC ice_sched.o
  CC ice_switch.o
make[5]: *** [/tmp/UB1904-64_K4.18.0_GCC8.3.0/x86_64-native-linuxapp-gcc/adeb371164ac4d7d958708310b5827a0/dpdk/mk/rte.subdir.mk:37: i40e] Error 2
make[5]: *** Waiting for unfinished jobs....
  CC ice_nvm.o
  CC hn_ethdev.o
  AR librte_pmd_ipn3ke.a
  INSTALL-LIB librte_pmd_ipn3ke.a
--
  LD ixgbe_ethdev.o
  AR librte_pmd_ixgbe.a
  INSTALL-LIB librte_pmd_ixgbe.a
  AR librte_pmd_ice.a
  INSTALL-LIB librte_pmd_ice.a
make[4]: *** [/tmp/UB1904-64_K4.18.0_GCC8.3.0/x86_64-native-linuxapp-gcc/adeb371164ac4d7d958708310b5827a0/dpdk/mk/rte.subdir.mk:35: net] Error 2
make[3]: *** [/tmp/UB1904-64_K4.18.0_GCC8.3.0/x86_64-native-linuxapp-gcc/adeb371164ac4d7d958708310b5827a0/dpdk/mk/rte.sdkbuild.mk:46: drivers] Error 2
make[2]: *** [/tmp/UB1904-64_K4.18.0_GCC8.3.0/x86_64-native-linuxapp-gcc/adeb371164ac4d7d958708310b5827a0/dpdk/mk/rte.sdkroot.mk:99: all] Error 2
make[1]: *** [/tmp/UB1904-64_K4.18.0_GCC8.3.0/x86_64-native-linuxapp-gcc/adeb371164ac4d7d958708310b5827a0/dpdk/mk/rte.sdkinstall.mk:61: pre_install] Error 2
make: *** [/tmp/UB1904-64_K4.18.0_GCC8.3.0/x86_64-native-linuxapp-gcc/adeb371164ac4d7d958708310b5827a0/dpdk/mk/rte.sdkroot.mk:77: install] Error 2


*Make Build Failed #4:
OS: UB1804-64
Target: x86_64-native-linuxapp-icc
/tmp/UB1804-64_K4.15.0_ICC19.0.0/x86_64-native-linuxapp-icc/adeb371164ac4d7d958708310b5827a0/dpdk/drivers/net/i40e/i40e_ethdev_vf.c(2620): error #810: conversion from "uint8_t={__uint8_t={unsigned char}} *" to "uint32_t={__uint32_t={unsigned int}}" may lose significant bits
  				I40E_WRITE_REG(hw, I40E_VFQF_HLUT(i >> 2), lut);
  				^

compilation aborted for /tmp/UB1804-64_K4.15.0_ICC19.0.0/x86_64-native-linuxapp-icc/adeb371164ac4d7d958708310b5827a0/dpdk/drivers/net/i40e/i40e_ethdev_vf.c (code 2)
/tmp/UB1804-64_K4.15.0_ICC19.0.0/x86_64-native-linuxapp-icc/adeb371164ac4d7d958708310b5827a0/dpdk/mk/internal/rte.compile-pre.mk:114: recipe for target 'i40e_ethdev_vf.o' failed
make[6]: *** [i40e_ethdev_vf.o] Error 2
make[6]: *** Waiting for unfinished jobs....
== Build drivers/net/octeontx
  CC nfp_cppcore.o
  PMDINFO i40e_ethdev.o.pmd.c
  CC i40e_ethdev.o.pmd.o
  LD i40e_ethdev.o
  CC nfp_cpp_pcie_ops.o
/tmp/UB1804-64_K4.15.0_ICC19.0.0/x86_64-native-linuxapp-icc/adeb371164ac4d7d958708310b5827a0/dpdk/mk/rte.subdir.mk:35: recipe for target 'i40e' failed
make[5]: *** [i40e] Error 2
make[5]: *** Waiting for unfinished jobs....
  CC nfp_mutex.o
  SYMLINK-FILE include/rte_pmd_bnxt.h
  CC bnxt_cpr.o
  CC bnxt_ethdev.o
--
  CC bnxt_rxtx_vec_sse.o
  AR librte_pmd_bnxt.a
  INSTALL-LIB librte_pmd_bnxt.a
  AR librte_pmd_ice.a
  INSTALL-LIB librte_pmd_ice.a
/tmp/UB1804-64_K4.15.0_ICC19.0.0/x86_64-native-linuxapp-icc/adeb371164ac4d7d958708310b5827a0/dpdk/mk/rte.subdir.mk:35: recipe for target 'net' failed
make[4]: *** [net] Error 2
/tmp/UB1804-64_K4.15.0_ICC19.0.0/x86_64-native-linuxapp-icc/adeb371164ac4d7d958708310b5827a0/dpdk/mk/rte.sdkbuild.mk:46: recipe for target 'drivers' failed
make[3]: *** [drivers] Error 2
/tmp/UB1804-64_K4.15.0_ICC19.0.0/x86_64-native-linuxapp-icc/adeb371164ac4d7d958708310b5827a0/dpdk/mk/rte.sdkroot.mk:98: recipe for target 'all' failed
make[2]: *** [all] Error 2
/tmp/UB1804-64_K4.15.0_ICC19.0.0/x86_64-native-linuxapp-icc/adeb371164ac4d7d958708310b5827a0/dpdk/mk/rte.sdkinstall.mk:60: recipe for target 'pre_install' failed
make[1]: *** [pre_install] Error 2
/tmp/UB1804-64_K4.15.0_ICC19.0.0/x86_64-native-linuxapp-icc/adeb371164ac4d7d958708310b5827a0/dpdk/mk/rte.sdkroot.mk:77: recipe for target 'install' failed
make: *** [install] Error 2


*Make Build Failed #5:
OS: UB1804-64
Target: x86_64-native-linuxapp-clang
                         ^~~
/tmp/UB1804-64_K4.15.0_Clang6.0.0/x86_64-native-linuxapp-clang/adeb371164ac4d7d958708310b5827a0/dpdk/x86_64-native-linuxapp-clang/include/rte_malloc.h:255:16: note: passing argument to parameter 'ptr' here
rte_free(void *ptr);
               ^
5 errors generated.
/tmp/UB1804-64_K4.15.0_Clang6.0.0/x86_64-native-linuxapp-clang/adeb371164ac4d7d958708310b5827a0/dpdk/mk/internal/rte.compile-pre.mk:114: recipe for target 'i40e_ethdev_vf.o' failed
make[6]: *** [i40e_ethdev_vf.o] Error 1
make[6]: *** Waiting for unfinished jobs....
  CC nfp_nffw.o
  LD ice_ethdev.o
  SYMLINK-FILE include/rte_pmd_bnxt.h
  CC hn_vf.o
--
  CC bnxt_cpr.o
  CC ice_switch_filter.o
  CC nfp_hwinfo.o
  CC bnxt_ethdev.o
  CC ixgbe_vf.o
/tmp/UB1804-64_K4.15.0_Clang6.0.0/x86_64-native-linuxapp-clang/adeb371164ac4d7d958708310b5827a0/dpdk/mk/rte.subdir.mk:35: recipe for target 'i40e' failed
make[5]: *** [i40e] Error 2
make[5]: *** Waiting for unfinished jobs....
  CC ixgbe_hv_vf.o
  AR librte_pmd_netvsc.a
  INSTALL-LIB librte_pmd_netvsc.a
  CC ixgbe_dcb.o
--
  CC bnxt_rxtx_vec_sse.o
  AR librte_pmd_ixgbe.a
  INSTALL-LIB librte_pmd_ixgbe.a
  AR librte_pmd_bnxt.a
  INSTALL-LIB librte_pmd_bnxt.a
/tmp/UB1804-64_K4.15.0_Clang6.0.0/x86_64-native-linuxapp-clang/adeb371164ac4d7d958708310b5827a0/dpdk/mk/rte.subdir.mk:35: recipe for target 'net' failed
make[4]: *** [net] Error 2
/tmp/UB1804-64_K4.15.0_Clang6.0.0/x86_64-native-linuxapp-clang/adeb371164ac4d7d958708310b5827a0/dpdk/mk/rte.sdkbuild.mk:46: recipe for target 'drivers' failed
make[3]: *** [drivers] Error 2
/tmp/UB1804-64_K4.15.0_Clang6.0.0/x86_64-native-linuxapp-clang/adeb371164ac4d7d958708310b5827a0/dpdk/mk/rte.sdkroot.mk:98: recipe for target 'all' failed
make[2]: *** [all] Error 2
/tmp/UB1804-64_K4.15.0_Clang6.0.0/x86_64-native-linuxapp-clang/adeb371164ac4d7d958708310b5827a0/dpdk/mk/rte.sdkinstall.mk:60: recipe for target 'pre_install' failed
make[1]: *** [pre_install] Error 2
/tmp/UB1804-64_K4.15.0_Clang6.0.0/x86_64-native-linuxapp-clang/adeb371164ac4d7d958708310b5827a0/dpdk/mk/rte.sdkroot.mk:77: recipe for target 'install' failed
make: *** [install] Error 2


*Make Build Failed #6:
OS: RHEL80-64
Target: x86_64-native-linuxapp-icc
/tmp/RHEL80-64_K3.10.0_ICC19.0.0/x86_64-native-linuxapp-icc/adeb371164ac4d7d958708310b5827a0/dpdk/drivers/net/i40e/i40e_ethdev_vf.c(2620): error #810: conversion from "uint8_t={__uint8_t={unsigned char}} *" to "uint32_t={__uint32_t={unsigned int}}" may lose significant bits
  				I40E_WRITE_REG(hw, I40E_VFQF_HLUT(i >> 2), lut);
  				^

compilation aborted for /tmp/RHEL80-64_K3.10.0_ICC19.0.0/x86_64-native-linuxapp-icc/adeb371164ac4d7d958708310b5827a0/dpdk/drivers/net/i40e/i40e_ethdev_vf.c (code 2)
make[6]: *** [/tmp/RHEL80-64_K3.10.0_ICC19.0.0/x86_64-native-linuxapp-icc/adeb371164ac4d7d958708310b5827a0/dpdk/mk/internal/rte.compile-pre.mk:114: i40e_ethdev_vf.o] Error 2
make[5]: *** [/tmp/RHEL80-64_K3.10.0_ICC19.0.0/x86_64-native-linuxapp-icc/adeb371164ac4d7d958708310b5827a0/dpdk/mk/rte.subdir.mk:37: i40e] Error 2
make[5]: *** Waiting for unfinished jobs....
  CC bnxt_filter.o
  AR librte_pmd_memif.a
  INSTALL-LIB librte_pmd_memif.a
  CC ice_fdir.o
--
  LD nfp_net.o
  AR librte_pmd_nfp.a
  INSTALL-LIB librte_pmd_nfp.a
  AR librte_pmd_ixgbe.a
  INSTALL-LIB librte_pmd_ixgbe.a
make[4]: *** [/tmp/RHEL80-64_K3.10.0_ICC19.0.0/x86_64-native-linuxapp-icc/adeb371164ac4d7d958708310b5827a0/dpdk/mk/rte.subdir.mk:35: net] Error 2
make[3]: *** [/tmp/RHEL80-64_K3.10.0_ICC19.0.0/x86_64-native-linuxapp-icc/adeb371164ac4d7d958708310b5827a0/dpdk/mk/rte.sdkbuild.mk:46: drivers] Error 2
make[2]: *** [/tmp/RHEL80-64_K3.10.0_ICC19.0.0/x86_64-native-linuxapp-icc/adeb371164ac4d7d958708310b5827a0/dpdk/mk/rte.sdkroot.mk:99: all] Error 2
make[1]: *** [/tmp/RHEL80-64_K3.10.0_ICC19.0.0/x86_64-native-linuxapp-icc/adeb371164ac4d7d958708310b5827a0/dpdk/mk/rte.sdkinstall.mk:61: pre_install] Error 2
make: *** [/tmp/RHEL80-64_K3.10.0_ICC19.0.0/x86_64-native-linuxapp-icc/adeb371164ac4d7d958708310b5827a0/dpdk/mk/rte.sdkroot.mk:77: install] Error 2


*Make Build Failed #7:
OS: RHEL80-64
Target: x86_64-native-linuxapp-gcc+debug
 rte_write32(uint32_t value, volatile void *addr)
             ~~~~~~~~~^~~~~
/tmp/RHEL80-64_K3.10.0_GCC8.2.1/x86_64-native-linuxapp-gcc+debug/adeb371164ac4d7d958708310b5827a0/dpdk/drivers/net/i40e/i40e_ethdev_vf.c: At top level:
cc1: error: unrecognized command line option ‘-Wno-address-of-packed-member’ [-Werror]
cc1: all warnings being treated as errors
make[6]: *** [/tmp/RHEL80-64_K3.10.0_GCC8.2.1/x86_64-native-linuxapp-gcc+debug/adeb371164ac4d7d958708310b5827a0/dpdk/mk/internal/rte.compile-pre.mk:114: i40e_ethdev_vf.o] Error 1
make[6]: *** Waiting for unfinished jobs....
  CC ixgbe_dcb.o
  CC ixgbe_dcb_82599.o
  CC ixgbe_dcb_82598.o
  AR librte_pmd_memif.a
  INSTALL-LIB librte_pmd_memif.a
  CC ice_nvm.o
== Build drivers/net/bnxt
make[5]: *** [/tmp/RHEL80-64_K3.10.0_GCC8.2.1/x86_64-native-linuxapp-gcc+debug/adeb371164ac4d7d958708310b5827a0/dpdk/mk/rte.subdir.mk:37: i40e] Error 2
make[5]: *** Waiting for unfinished jobs....
  CC ice_flex_pipe.o
  CC ixgbe_mbx.o
  CC ixgbe_rxtx.o
  CC ixgbe_ethdev.o
--
  CC bnxt_rxtx_vec_sse.o
  AR librte_pmd_nfp.a
  INSTALL-LIB librte_pmd_nfp.a
  AR librte_pmd_bnxt.a
  INSTALL-LIB librte_pmd_bnxt.a
make[4]: *** [/tmp/RHEL80-64_K3.10.0_GCC8.2.1/x86_64-native-linuxapp-gcc+debug/adeb371164ac4d7d958708310b5827a0/dpdk/mk/rte.subdir.mk:35: net] Error 2
make[3]: *** [/tmp/RHEL80-64_K3.10.0_GCC8.2.1/x86_64-native-linuxapp-gcc+debug/adeb371164ac4d7d958708310b5827a0/dpdk/mk/rte.sdkbuild.mk:46: drivers] Error 2
make[2]: *** [/tmp/RHEL80-64_K3.10.0_GCC8.2.1/x86_64-native-linuxapp-gcc+debug/adeb371164ac4d7d958708310b5827a0/dpdk/mk/rte.sdkroot.mk:99: all] Error 2
make[1]: *** [/tmp/RHEL80-64_K3.10.0_GCC8.2.1/x86_64-native-linuxapp-gcc+debug/adeb371164ac4d7d958708310b5827a0/dpdk/mk/rte.sdkinstall.mk:61: pre_install] Error 2
make: *** [/tmp/RHEL80-64_K3.10.0_GCC8.2.1/x86_64-native-linuxapp-gcc+debug/adeb371164ac4d7d958708310b5827a0/dpdk/mk/rte.sdkroot.mk:77: install] Error 2


*Make Build Failed #8:
OS: RHEL80-64
Target: x86_64-native-linuxapp-clang
                         ^~~
/tmp/RHEL80-64_K3.10.0_Clang6.0.1/x86_64-native-linuxapp-clang/adeb371164ac4d7d958708310b5827a0/dpdk/x86_64-native-linuxapp-clang/include/rte_malloc.h:255:16: note: passing argument to parameter 'ptr' here
rte_free(void *ptr);
               ^
5 errors generated.
make[6]: *** [/tmp/RHEL80-64_K3.10.0_Clang6.0.1/x86_64-native-linuxapp-clang/adeb371164ac4d7d958708310b5827a0/dpdk/mk/internal/rte.compile-pre.mk:114: i40e_ethdev_vf.o] Error 1
make[5]: *** [/tmp/RHEL80-64_K3.10.0_Clang6.0.1/x86_64-native-linuxapp-clang/adeb371164ac4d7d958708310b5827a0/dpdk/mk/rte.subdir.mk:35: i40e] Error 2
make[5]: *** Waiting for unfinished jobs....
  CC ice_dcb.o
  CC hn_rndis.o
  CC ixgbe_hv_vf.o
  PMDINFO virtio_cryptodev.o.pmd.c
--
  PMDINFO ixgbe_ethdev.o.pmd.c
  CC ixgbe_ethdev.o.pmd.o
  LD ixgbe_ethdev.o
  AR librte_pmd_ixgbe.a
  INSTALL-LIB librte_pmd_ixgbe.a
make[4]: *** [/tmp/RHEL80-64_K3.10.0_Clang6.0.1/x86_64-native-linuxapp-clang/adeb371164ac4d7d958708310b5827a0/dpdk/mk/rte.subdir.mk:35: net] Error 2
make[3]: *** [/tmp/RHEL80-64_K3.10.0_Clang6.0.1/x86_64-native-linuxapp-clang/adeb371164ac4d7d958708310b5827a0/dpdk/mk/rte.sdkbuild.mk:46: drivers] Error 2
make[2]: *** [/tmp/RHEL80-64_K3.10.0_Clang6.0.1/x86_64-native-linuxapp-clang/adeb371164ac4d7d958708310b5827a0/dpdk/mk/rte.sdkroot.mk:99: all] Error 2
make[1]: *** [/tmp/RHEL80-64_K3.10.0_Clang6.0.1/x86_64-native-linuxapp-clang/adeb371164ac4d7d958708310b5827a0/dpdk/mk/rte.sdkinstall.mk:61: pre_install] Error 2
make: *** [/tmp/RHEL80-64_K3.10.0_Clang6.0.1/x86_64-native-linuxapp-clang/adeb371164ac4d7d958708310b5827a0/dpdk/mk/rte.sdkroot.mk:77: install] Error 2


*Make Build Failed #9:
OS: RHEL80-64
Target: x86_64-native-linuxapp-gcc+shared
 rte_write32(uint32_t value, volatile void *addr)
             ~~~~~~~~~^~~~~
/tmp/RHEL80-64_K3.10.0_GCC8.2.1/x86_64-native-linuxapp-gcc+shared/adeb371164ac4d7d958708310b5827a0/dpdk/drivers/net/i40e/i40e_ethdev_vf.c: At top level:
cc1: error: unrecognized command line option ‘-Wno-address-of-packed-member’ [-Werror]
cc1: all warnings being treated as errors
make[6]: *** [/tmp/RHEL80-64_K3.10.0_GCC8.2.1/x86_64-native-linuxapp-gcc+shared/adeb371164ac4d7d958708310b5827a0/dpdk/mk/internal/rte.compile-pre.mk:114: i40e_ethdev_vf.o] Error 1
make[5]: *** [/tmp/RHEL80-64_K3.10.0_GCC8.2.1/x86_64-native-linuxapp-gcc+shared/adeb371164ac4d7d958708310b5827a0/dpdk/mk/rte.subdir.mk:35: i40e] Error 2
make[5]: *** Waiting for unfinished jobs....
  CC bnxt_txq.o
  PMDINFO rte_eth_pcap.o.pmd.c
  CC rte_eth_pcap.o.pmd.o
  LD rte_eth_pcap.o
--
  PMDINFO qede_ethdev.o.pmd.c
  CC qede_ethdev.o.pmd.o
  LD qede_ethdev.o
  LD librte_pmd_qede.so.1.1
  INSTALL-LIB librte_pmd_qede.so.1.1
make[4]: *** [/tmp/RHEL80-64_K3.10.0_GCC8.2.1/x86_64-native-linuxapp-gcc+shared/adeb371164ac4d7d958708310b5827a0/dpdk/mk/rte.subdir.mk:35: net] Error 2
make[3]: *** [/tmp/RHEL80-64_K3.10.0_GCC8.2.1/x86_64-native-linuxapp-gcc+shared/adeb371164ac4d7d958708310b5827a0/dpdk/mk/rte.sdkbuild.mk:46: drivers] Error 2
make[2]: *** [/tmp/RHEL80-64_K3.10.0_GCC8.2.1/x86_64-native-linuxapp-gcc+shared/adeb371164ac4d7d958708310b5827a0/dpdk/mk/rte.sdkroot.mk:99: all] Error 2
make[1]: *** [/tmp/RHEL80-64_K3.10.0_GCC8.2.1/x86_64-native-linuxapp-gcc+shared/adeb371164ac4d7d958708310b5827a0/dpdk/mk/rte.sdkinstall.mk:61: pre_install] Error 2
make: *** [/tmp/RHEL80-64_K3.10.0_GCC8.2.1/x86_64-native-linuxapp-gcc+shared/adeb371164ac4d7d958708310b5827a0/dpdk/mk/rte.sdkroot.mk:77: install] Error 2


*Make Build Failed #10:
OS: SUSE15-64
Target: x86_64-native-linuxapp-gcc
 rte_write32(uint32_t value, volatile void *addr)
 ^~~~~~~~~~~
/tmp/SUSE15-64_K4.12.14_GCC7.3.1/x86_64-native-linuxapp-gcc/adeb371164ac4d7d958708310b5827a0/dpdk/drivers/net/i40e/i40e_ethdev_vf.c: At top level:
cc1: error: unrecognized command line option ‘-Wno-address-of-packed-member’ [-Werror]
cc1: all warnings being treated as errors
make[6]: *** [/tmp/SUSE15-64_K4.12.14_GCC7.3.1/x86_64-native-linuxapp-gcc/adeb371164ac4d7d958708310b5827a0/dpdk/mk/internal/rte.compile-pre.mk:116: i40e_ethdev_vf.o] Error 1
make[6]: *** Waiting for unfinished jobs....
  AR librte_pmd_failsafe.a
  CC enic_rxtx_vec_avx2.o
  CC em_ethdev.o
  INSTALL-LIB librte_pmd_failsafe.a
--
  CC memif_socket.o
  PMDINFO i40e_ethdev.o.pmd.c
  CC i40e_ethdev.o.pmd.o
  LD i40e_ethdev.o
  CC ipn3ke_representor.o
make[5]: *** [/tmp/SUSE15-64_K4.12.14_GCC7.3.1/x86_64-native-linuxapp-gcc/adeb371164ac4d7d958708310b5827a0/dpdk/mk/rte.subdir.mk:37: i40e] Error 2
make[5]: *** Waiting for unfinished jobs....
  CC ixgbe_82598.o
  CC hinic_pmd_tx.o
  CC ixgbe_82599.o
  CC ixgbe_x540.o
--
  LD ice_ethdev.o
  AR librte_pmd_ixgbe.a
  INSTALL-LIB librte_pmd_ixgbe.a
  AR librte_pmd_ice.a
  INSTALL-LIB librte_pmd_ice.a
make[4]: *** [/tmp/SUSE15-64_K4.12.14_GCC7.3.1/x86_64-native-linuxapp-gcc/adeb371164ac4d7d958708310b5827a0/dpdk/mk/rte.subdir.mk:35: net] Error 2
make[3]: *** [/tmp/SUSE15-64_K4.12.14_GCC7.3.1/x86_64-native-linuxapp-gcc/adeb371164ac4d7d958708310b5827a0/dpdk/mk/rte.sdkbuild.mk:46: drivers] Error 2
make[2]: *** [/tmp/SUSE15-64_K4.12.14_GCC7.3.1/x86_64-native-linuxapp-gcc/adeb371164ac4d7d958708310b5827a0/dpdk/mk/rte.sdkroot.mk:99: all] Error 2
make[1]: *** [/tmp/SUSE15-64_K4.12.14_GCC7.3.1/x86_64-native-linuxapp-gcc/adeb371164ac4d7d958708310b5827a0/dpdk/mk/rte.sdkinstall.mk:61: pre_install] Error 2
make: *** [/tmp/SUSE15-64_K4.12.14_GCC7.3.1/x86_64-native-linuxapp-gcc/adeb371164ac4d7d958708310b5827a0/dpdk/mk/rte.sdkroot.mk:77: install] Error 2


*Make Build Failed #11:
OS: RHEL76-64
Target: x86_64-native-linuxapp-gcc
 rte_write32(uint32_t value, volatile void *addr)
 ^
/tmp/RHEL76-64_K3.10.0_GCC4.8.5/x86_64-native-linuxapp-gcc/adeb371164ac4d7d958708310b5827a0/dpdk/drivers/net/i40e/i40e_ethdev_vf.c: At top level:
cc1: error: unrecognized command line option "-Wno-address-of-packed-member" [-Werror]
cc1: all warnings being treated as errors
make[6]: *** [i40e_ethdev_vf.o] Error 1
make[6]: *** Waiting for unfinished jobs....
  CC ixgbe_phy.o
  AR librte_pmd_ice.a
== Build drivers/net/ring
  INSTALL-LIB librte_pmd_ice.a
== Build drivers/net/sfc
  PMDINFO rte_eth_pcap.o.pmd.c
make[5]: *** [i40e] Error 2
make[5]: *** Waiting for unfinished jobs....
  CC bnxt_ring.o
  CC rte_eth_pcap.o.pmd.o
  LD rte_eth_pcap.o
  PMDINFO nfp_net.o.pmd.c
--
  CC medford_nic.o
  AR librte_pmd_qede.a
  INSTALL-LIB librte_pmd_qede.a
  AR librte_pmd_sfc_efx.a
  INSTALL-LIB librte_pmd_sfc_efx.a
make[4]: *** [net] Error 2
make[3]: *** [drivers] Error 2
make[2]: *** [all] Error 2
make[1]: *** [pre_install] Error 2
make: *** [install] Error 2


*Make Build Failed #12:
OS: FC30-64
Target: x86_64-native-linuxapp-gcc
                 from /tmp/FC30-64_K4.20_GCC9.1.1/x86_64-native-linuxapp-gcc/adeb371164ac4d7d958708310b5827a0/dpdk/drivers/net/i40e/i40e_ethdev_vf.c:34:
/tmp/FC30-64_K4.20_GCC9.1.1/x86_64-native-linuxapp-gcc/adeb371164ac4d7d958708310b5827a0/dpdk/x86_64-native-linuxapp-gcc/include/generic/rte_io.h:335:22: note: expected ‘uint32_t’ {aka ‘unsigned int’} but argument is of type ‘uint8_t *’ {aka ‘unsigned char *’}
  335 | rte_write32(uint32_t value, volatile void *addr)
      |             ~~~~~~~~~^~~~~
cc1: all warnings being treated as errors
make[6]: *** [/tmp/FC30-64_K4.20_GCC9.1.1/x86_64-native-linuxapp-gcc/adeb371164ac4d7d958708310b5827a0/dpdk/mk/internal/rte.compile-pre.mk:116: i40e_ethdev_vf.o] Error 1
make[6]: *** Waiting for unfinished jobs....
  CC bnxt_ring.o
== Build drivers/net/octeontx
  AR librte_pmd_ice.a
  PMDINFO bnxt_ethdev.o.pmd.c
--
  CC rte_eth_null.o.pmd.o
  LD rte_eth_null.o
  AR librte_pmd_null.a
  INSTALL-LIB librte_pmd_null.a
== Build drivers/net/pcap
make[5]: *** [/tmp/FC30-64_K4.20_GCC9.1.1/x86_64-native-linuxapp-gcc/adeb371164ac4d7d958708310b5827a0/dpdk/mk/rte.subdir.mk:37: i40e] Error 2
make[5]: *** Waiting for unfinished jobs....
  CC ixgbe_fdir.o
  CC nfp_mip.o
  CC bnxt_rxr.o
  CC nfp_nffw.o
--
  LD otx2_ethdev.o
  AR librte_pmd_octeontx2.a
  INSTALL-LIB librte_pmd_octeontx2.a
  AR librte_pmd_bnxt.a
  INSTALL-LIB librte_pmd_bnxt.a
make[4]: *** [/tmp/FC30-64_K4.20_GCC9.1.1/x86_64-native-linuxapp-gcc/adeb371164ac4d7d958708310b5827a0/dpdk/mk/rte.subdir.mk:35: net] Error 2
make[3]: *** [/tmp/FC30-64_K4.20_GCC9.1.1/x86_64-native-linuxapp-gcc/adeb371164ac4d7d958708310b5827a0/dpdk/mk/rte.sdkbuild.mk:46: drivers] Error 2
make[2]: *** [/tmp/FC30-64_K4.20_GCC9.1.1/x86_64-native-linuxapp-gcc/adeb371164ac4d7d958708310b5827a0/dpdk/mk/rte.sdkroot.mk:99: all] Error 2
make[1]: *** [/tmp/FC30-64_K4.20_GCC9.1.1/x86_64-native-linuxapp-gcc/adeb371164ac4d7d958708310b5827a0/dpdk/mk/rte.sdkinstall.mk:61: pre_install] Error 2
make: *** [/tmp/FC30-64_K4.20_GCC9.1.1/x86_64-native-linuxapp-gcc/adeb371164ac4d7d958708310b5827a0/dpdk/mk/rte.sdkroot.mk:77: install] Error 2


*Make Build Failed #13:
OS: FC30-64
Target: x86_64-native-linuxapp-clang
rte_free(void *ptr);
               ^
5 errors generated.
  AR librte_pmd_lio.a
  INSTALL-LIB librte_pmd_lio.a
make[6]: *** [/tmp/FC30-64_K4.20_Clang8.0.0/x86_64-native-linuxapp-clang/adeb371164ac4d7d958708310b5827a0/dpdk/mk/internal/rte.compile-pre.mk:116: i40e_ethdev_vf.o] Error 1
make[6]: *** Waiting for unfinished jobs....
  CC i40e_pf.o
  CC hn_ethdev.o
== Build drivers/net/nfp
  CC ice_dcb.o
--
  INSTALL-LIB librte_pmd_hinic.a
  CC igb_flow.o
== Build drivers/net/bnxt
  CC ixgbe_82598.o
  CC hn_rxtx.o
make[5]: *** [/tmp/FC30-64_K4.20_Clang8.0.0/x86_64-native-linuxapp-clang/adeb371164ac4d7d958708310b5827a0/dpdk/mk/rte.subdir.mk:37: i40e] Error 2
make[5]: *** Waiting for unfinished jobs....
  CC nfp_cpp_pcie_ops.o
  CC nfp_mutex.o
  CC ipn3ke_tm.o
  CC em_ethdev.o
--
  PMDINFO ixgbe_ethdev.o.pmd.c
  CC ixgbe_ethdev.o.pmd.o
  LD ixgbe_ethdev.o
  AR librte_pmd_ixgbe.a
  INSTALL-LIB librte_pmd_ixgbe.a
make[4]: *** [/tmp/FC30-64_K4.20_Clang8.0.0/x86_64-native-linuxapp-clang/adeb371164ac4d7d958708310b5827a0/dpdk/mk/rte.subdir.mk:35: net] Error 2
make[3]: *** [/tmp/FC30-64_K4.20_Clang8.0.0/x86_64-native-linuxapp-clang/adeb371164ac4d7d958708310b5827a0/dpdk/mk/rte.sdkbuild.mk:46: drivers] Error 2
make[2]: *** [/tmp/FC30-64_K4.20_Clang8.0.0/x86_64-native-linuxapp-clang/adeb371164ac4d7d958708310b5827a0/dpdk/mk/rte.sdkroot.mk:99: all] Error 2
make[1]: *** [/tmp/FC30-64_K4.20_Clang8.0.0/x86_64-native-linuxapp-clang/adeb371164ac4d7d958708310b5827a0/dpdk/mk/rte.sdkinstall.mk:61: pre_install] Error 2
make: *** [/tmp/FC30-64_K4.20_Clang8.0.0/x86_64-native-linuxapp-clang/adeb371164ac4d7d958708310b5827a0/dpdk/mk/rte.sdkroot.mk:77: install] Error 2


*Make Build Failed #14:
OS: RHEL80-64
Target: x86_64-native-linuxapp-gcc
             ~~~~~~~~~^~~~~
/tmp/RHEL80-64_K3.10.0_GCC8.2.1/x86_64-native-linuxapp-gcc/adeb371164ac4d7d958708310b5827a0/dpdk/drivers/net/i40e/i40e_ethdev_vf.c: At top level:
cc1: error: unrecognized command line option ‘-Wno-address-of-packed-member’ [-Werror]
cc1: all warnings being treated as errors
  CC hinic_pmd_tx.o
make[6]: *** [/tmp/RHEL80-64_K3.10.0_GCC8.2.1/x86_64-native-linuxapp-gcc/adeb371164ac4d7d958708310b5827a0/dpdk/mk/internal/rte.compile-pre.mk:114: i40e_ethdev_vf.o] Error 1
make[6]: *** Waiting for unfinished jobs....
  CC iavf_rxtx.o
make[5]: *** [/tmp/RHEL80-64_K3.10.0_GCC8.2.1/x86_64-native-linuxapp-gcc/adeb371164ac4d7d958708310b5827a0/dpdk/mk/rte.subdir.mk:35: i40e] Error 2
make[5]: *** Waiting for unfinished jobs....
  CC iavf_rxtx_vec_sse.o
  AR librte_pmd_enic.a
  INSTALL-LIB librte_pmd_enic.a
  CC ice_controlq.o
--
  PMDINFO ixgbe_ethdev.o.pmd.c
  CC ixgbe_ethdev.o.pmd.o
  LD ixgbe_ethdev.o
  AR librte_pmd_ixgbe.a
  INSTALL-LIB librte_pmd_ixgbe.a
make[4]: *** [/tmp/RHEL80-64_K3.10.0_GCC8.2.1/x86_64-native-linuxapp-gcc/adeb371164ac4d7d958708310b5827a0/dpdk/mk/rte.subdir.mk:35: net] Error 2
make[3]: *** [/tmp/RHEL80-64_K3.10.0_GCC8.2.1/x86_64-native-linuxapp-gcc/adeb371164ac4d7d958708310b5827a0/dpdk/mk/rte.sdkbuild.mk:46: drivers] Error 2
make[2]: *** [/tmp/RHEL80-64_K3.10.0_GCC8.2.1/x86_64-native-linuxapp-gcc/adeb371164ac4d7d958708310b5827a0/dpdk/mk/rte.sdkroot.mk:99: all] Error 2
make[1]: *** [/tmp/RHEL80-64_K3.10.0_GCC8.2.1/x86_64-native-linuxapp-gcc/adeb371164ac4d7d958708310b5827a0/dpdk/mk/rte.sdkinstall.mk:61: pre_install] Error 2
make: *** [/tmp/RHEL80-64_K3.10.0_GCC8.2.1/x86_64-native-linuxapp-gcc/adeb371164ac4d7d958708310b5827a0/dpdk/mk/rte.sdkroot.mk:77: install] Error 2


*Make Build Failed #15:
OS: SUSE15-64
Target: x86_64-native-linuxapp-clang
                         ^~~
/tmp/SUSE15-64_K4.12.14_Clang5.0.1/x86_64-native-linuxapp-clang/adeb371164ac4d7d958708310b5827a0/dpdk/x86_64-native-linuxapp-clang/include/rte_malloc.h:255:16: note: passing argument to parameter 'ptr' here
rte_free(void *ptr);
               ^
5 errors generated.
make[6]: *** [/tmp/SUSE15-64_K4.12.14_Clang5.0.1/x86_64-native-linuxapp-clang/adeb371164ac4d7d958708310b5827a0/dpdk/mk/internal/rte.compile-pre.mk:116: i40e_ethdev_vf.o] Error 1
make[6]: *** Waiting for unfinished jobs....
  CC i40e_flow.o
  CC lio_mbox.o
  CC em_ethdev.o
  CC ixgbe_phy.o
--
  PMDINFO em_ethdev.o.pmd.c
  CC em_ethdev.o.pmd.o
  LD em_ethdev.o
  CC rte_eth_memif.o
== Build drivers/net/nfp
make[5]: *** [/tmp/SUSE15-64_K4.12.14_Clang5.0.1/x86_64-native-linuxapp-clang/adeb371164ac4d7d958708310b5827a0/dpdk/mk/rte.subdir.mk:37: i40e] Error 2
make[5]: *** Waiting for unfinished jobs....
  CC memif_socket.o
  CC hn_ethdev.o
  CC ixgbe_vf.o
  CC nfp_cppcore.o
--
  PMDINFO ixgbe_ethdev.o.pmd.c
  CC ixgbe_ethdev.o.pmd.o
  LD ixgbe_ethdev.o
  AR librte_pmd_ixgbe.a
  INSTALL-LIB librte_pmd_ixgbe.a
make[4]: *** [/tmp/SUSE15-64_K4.12.14_Clang5.0.1/x86_64-native-linuxapp-clang/adeb371164ac4d7d958708310b5827a0/dpdk/mk/rte.subdir.mk:35: net] Error 2
make[3]: *** [/tmp/SUSE15-64_K4.12.14_Clang5.0.1/x86_64-native-linuxapp-clang/adeb371164ac4d7d958708310b5827a0/dpdk/mk/rte.sdkbuild.mk:46: drivers] Error 2
make[2]: *** [/tmp/SUSE15-64_K4.12.14_Clang5.0.1/x86_64-native-linuxapp-clang/adeb371164ac4d7d958708310b5827a0/dpdk/mk/rte.sdkroot.mk:99: all] Error 2
make[1]: *** [/tmp/SUSE15-64_K4.12.14_Clang5.0.1/x86_64-native-linuxapp-clang/adeb371164ac4d7d958708310b5827a0/dpdk/mk/rte.sdkinstall.mk:61: pre_install] Error 2
make: *** [/tmp/SUSE15-64_K4.12.14_Clang5.0.1/x86_64-native-linuxapp-clang/adeb371164ac4d7d958708310b5827a0/dpdk/mk/rte.sdkroot.mk:77: install] Error 2


*Make Build Failed #16:
OS: UB1604-64
Target: x86_64-native-linuxapp-gcc
 rte_write32(uint32_t value, volatile void *addr)
 ^
/tmp/UB1604-64_K4.4.0_GCC5.4.0/x86_64-native-linuxapp-gcc/adeb371164ac4d7d958708310b5827a0/dpdk/drivers/net/i40e/i40e_ethdev_vf.c: At top level:
cc1: error: unrecognized command line option ‘-Wno-address-of-packed-member’ [-Werror]
cc1: all warnings being treated as errors
/tmp/UB1604-64_K4.4.0_GCC5.4.0/x86_64-native-linuxapp-gcc/adeb371164ac4d7d958708310b5827a0/dpdk/mk/internal/rte.compile-pre.mk:114: recipe for target 'i40e_ethdev_vf.o' failed
make[6]: *** [i40e_ethdev_vf.o] Error 1
make[6]: *** Waiting for unfinished jobs....
  CC ice_flow.o
  PMDINFO lio_ethdev.o.pmd.c
  CC lio_ethdev.o.pmd.o
  LD lio_ethdev.o
--
  CC ixgbe_api.o
  CC ice_rxtx.o
  PMDINFO i40e_ethdev.o.pmd.c
  CC i40e_ethdev.o.pmd.o
  LD i40e_ethdev.o
/tmp/UB1604-64_K4.4.0_GCC5.4.0/x86_64-native-linuxapp-gcc/adeb371164ac4d7d958708310b5827a0/dpdk/mk/rte.subdir.mk:35: recipe for target 'i40e' failed
make[5]: *** [i40e] Error 2
make[5]: *** Waiting for unfinished jobs....
  CC ice_rxtx_vec_sse.o
  CC rte_eth_null.o
  CC bnxt_ethdev.o
  CC nfp_cpp_pcie_ops.o
--
  PMDINFO ixgbe_ethdev.o.pmd.c
  CC ixgbe_ethdev.o.pmd.o
  LD ixgbe_ethdev.o
  AR librte_pmd_ixgbe.a
  INSTALL-LIB librte_pmd_ixgbe.a
/tmp/UB1604-64_K4.4.0_GCC5.4.0/x86_64-native-linuxapp-gcc/adeb371164ac4d7d958708310b5827a0/dpdk/mk/rte.subdir.mk:35: recipe for target 'net' failed
make[4]: *** [net] Error 2
/tmp/UB1604-64_K4.4.0_GCC5.4.0/x86_64-native-linuxapp-gcc/adeb371164ac4d7d958708310b5827a0/dpdk/mk/rte.sdkbuild.mk:46: recipe for target 'drivers' failed
make[3]: *** [drivers] Error 2
/tmp/UB1604-64_K4.4.0_GCC5.4.0/x86_64-native-linuxapp-gcc/adeb371164ac4d7d958708310b5827a0/dpdk/mk/rte.sdkroot.mk:98: recipe for target 'all' failed
make[2]: *** [all] Error 2
/tmp/UB1604-64_K4.4.0_GCC5.4.0/x86_64-native-linuxapp-gcc/adeb371164ac4d7d958708310b5827a0/dpdk/mk/rte.sdkinstall.mk:60: recipe for target 'pre_install' failed
make[1]: *** [pre_install] Error 2
/tmp/UB1604-64_K4.4.0_GCC5.4.0/x86_64-native-linuxapp-gcc/adeb371164ac4d7d958708310b5827a0/dpdk/mk/rte.sdkroot.mk:77: recipe for target 'install' failed
make: *** [install] Error 2


*Make Build Failed #17:
OS: UB1804-64
Target: x86_64-native-linuxapp-gcc
 rte_write32(uint32_t value, volatile void *addr)
 ^~~~~~~~~~~
/tmp/UB1804-64_K4.15.0_GCC7.3.0/x86_64-native-linuxapp-gcc/adeb371164ac4d7d958708310b5827a0/dpdk/drivers/net/i40e/i40e_ethdev_vf.c: At top level:
cc1: error: unrecognized command line option ‘-Wno-address-of-packed-member’ [-Werror]
cc1: all warnings being treated as errors
/tmp/UB1804-64_K4.15.0_GCC7.3.0/x86_64-native-linuxapp-gcc/adeb371164ac4d7d958708310b5827a0/dpdk/mk/internal/rte.compile-pre.mk:114: recipe for target 'i40e_ethdev_vf.o' failed
make[6]: *** [i40e_ethdev_vf.o] Error 1
make[6]: *** Waiting for unfinished jobs....
  CC nfp_nffw.o
  CC ixgbe_fdir.o
  CC nfp_hwinfo.o
  CC nfp_rtsym.o
--
  CC ice_dcb.o
  CC nfp_nsp_eth.o
  CC nfp_net.o
== Build drivers/net/octeontx
  CC bnxt_rxq.o
/tmp/UB1804-64_K4.15.0_GCC7.3.0/x86_64-native-linuxapp-gcc/adeb371164ac4d7d958708310b5827a0/dpdk/mk/rte.subdir.mk:35: recipe for target 'i40e' failed
make[5]: *** [i40e] Error 2
make[5]: *** Waiting for unfinished jobs....
  CC bnxt_rxr.o
  CC bnxt_stats.o
  CC octeontx_rxtx.o
  CC octeontx_pkovf.o
--
  LD ice_ethdev.o
  AR librte_pmd_ice.a
  INSTALL-LIB librte_pmd_ice.a
  AR librte_pmd_bnxt.a
  INSTALL-LIB librte_pmd_bnxt.a
/tmp/UB1804-64_K4.15.0_GCC7.3.0/x86_64-native-linuxapp-gcc/adeb371164ac4d7d958708310b5827a0/dpdk/mk/rte.subdir.mk:35: recipe for target 'net' failed
make[4]: *** [net] Error 2
/tmp/UB1804-64_K4.15.0_GCC7.3.0/x86_64-native-linuxapp-gcc/adeb371164ac4d7d958708310b5827a0/dpdk/mk/rte.sdkbuild.mk:46: recipe for target 'drivers' failed
make[3]: *** [drivers] Error 2
/tmp/UB1804-64_K4.15.0_GCC7.3.0/x86_64-native-linuxapp-gcc/adeb371164ac4d7d958708310b5827a0/dpdk/mk/rte.sdkroot.mk:98: recipe for target 'all' failed
make[2]: *** [all] Error 2
/tmp/UB1804-64_K4.15.0_GCC7.3.0/x86_64-native-linuxapp-gcc/adeb371164ac4d7d958708310b5827a0/dpdk/mk/rte.sdkinstall.mk:60: recipe for target 'pre_install' failed
make[1]: *** [pre_install] Error 2
/tmp/UB1804-64_K4.15.0_GCC7.3.0/x86_64-native-linuxapp-gcc/adeb371164ac4d7d958708310b5827a0/dpdk/mk/rte.sdkroot.mk:77: recipe for target 'install' failed
make: *** [install] Error 2


*Make Build Failed #18:
OS: FreeBSD12-64
Target: x86_64-native-bsdapp-clang
                         ^~~
/tmp/FreeBSD12-64_K19.02_Clang6.0.1/x86_64-native-bsdapp-clang/adeb371164ac4d7d958708310b5827a0/dpdk/x86_64-native-bsdapp-clang/include/rte_malloc.h:255:16: note: passing argument to parameter 'ptr' here
rte_free(void *ptr);
               ^
5 errors generated.
gmake[6]: *** [/tmp/FreeBSD12-64_K19.02_Clang6.0.1/x86_64-native-bsdapp-clang/adeb371164ac4d7d958708310b5827a0/dpdk/mk/internal/rte.compile-pre.mk:114: i40e_ethdev_vf.o] Error 1
  CC i40e_pf.o
gmake[6]: *** Waiting for unfinished jobs....
  CC ice_flow.o
== Build drivers/net/bnxt
  PMDINFO i40e_ethdev.o.pmd.c
--
  INSTALL-LIB librte_pmd_lio.a
  CC ixgbe_x550.o
  SYMLINK-FILE include/rte_pmd_bnxt.h
  CC ice_dcb.o
  CC igb_rxtx.o
gmake[5]: *** [/tmp/FreeBSD12-64_K19.02_Clang6.0.1/x86_64-native-bsdapp-clang/adeb371164ac4d7d958708310b5827a0/dpdk/mk/rte.subdir.mk:36: i40e] Error 2
gmake[5]: *** Waiting for unfinished jobs....
  CC ixgbe_phy.o
  PMDINFO igb_ethdev.o.pmd.c
  CC igb_ethdev.o.pmd.o
== Build drivers/net/null
--
  CC ixgbe_vf_representor.o
  AR librte_pmd_ixgbe.a
  INSTALL-LIB librte_pmd_ixgbe.a
  AR librte_pmd_bnxt.a
  INSTALL-LIB librte_pmd_bnxt.a
gmake[4]: *** [/tmp/FreeBSD12-64_K19.02_Clang6.0.1/x86_64-native-bsdapp-clang/adeb371164ac4d7d958708310b5827a0/dpdk/mk/rte.subdir.mk:35: net] Error 2
gmake[3]: *** [/tmp/FreeBSD12-64_K19.02_Clang6.0.1/x86_64-native-bsdapp-clang/adeb371164ac4d7d958708310b5827a0/dpdk/mk/rte.sdkbuild.mk:46: drivers] Error 2
gmake[2]: *** [/tmp/FreeBSD12-64_K19.02_Clang6.0.1/x86_64-native-bsdapp-clang/adeb371164ac4d7d958708310b5827a0/dpdk/mk/rte.sdkroot.mk:99: all] Error 2
gmake[1]: *** [/tmp/FreeBSD12-64_K19.02_Clang6.0.1/x86_64-native-bsdapp-clang/adeb371164ac4d7d958708310b5827a0/dpdk/mk/rte.sdkinstall.mk:61: pre_install] Error 2
gmake: *** [/tmp/FreeBSD12-64_K19.02_Clang6.0.1/x86_64-native-bsdapp-clang/adeb371164ac4d7d958708310b5827a0/dpdk/mk/rte.sdkroot.mk:77: install] Error 2


*Make Build Failed #19:
OS: FreeBSD12-64
Target: x86_64-native-bsdapp-gcc+shared
 rte_write32(uint32_t value, volatile void *addr)
 ^~~~~~~~~~~
/tmp/FreeBSD12-64_K19.02_GCC7.3.0/x86_64-native-bsdapp-gcc+shared/adeb371164ac4d7d958708310b5827a0/dpdk/drivers/net/i40e/i40e_ethdev_vf.c: At top level:
cc1: error: unrecognized command line option '-Wno-address-of-packed-member' [-Werror]
cc1: all warnings being treated as errors
gmake[6]: *** [/tmp/FreeBSD12-64_K19.02_GCC7.3.0/x86_64-native-bsdapp-gcc+shared/adeb371164ac4d7d958708310b5827a0/dpdk/mk/internal/rte.compile-pre.mk:116: i40e_ethdev_vf.o] Error 1
gmake[6]: *** Waiting for unfinished jobs....
  CC igb_rxtx.o
  PMDINFO igb_ethdev.o.pmd.c
  CC igb_ethdev.o.pmd.o
gmake[5]: *** [/tmp/FreeBSD12-64_K19.02_GCC7.3.0/x86_64-native-bsdapp-gcc+shared/adeb371164ac4d7d958708310b5827a0/dpdk/mk/rte.subdir.mk:37: i40e] Error 2
gmake[5]: *** Waiting for unfinished jobs....
  CC igb_pf.o
  LD igb_ethdev.o
  PMDINFO rte_eth_null.o.pmd.c
  CC rte_eth_null.o.pmd.o
--
  CC otx2_ethdev_devargs.o
  LD librte_pmd_octeontx2.so.1.1
  LD librte_pmd_ixgbe.so.2.1
  INSTALL-LIB librte_pmd_octeontx2.so.1.1
  INSTALL-LIB librte_pmd_ixgbe.so.2.1
gmake[4]: *** [/tmp/FreeBSD12-64_K19.02_GCC7.3.0/x86_64-native-bsdapp-gcc+shared/adeb371164ac4d7d958708310b5827a0/dpdk/mk/rte.subdir.mk:35: net] Error 2
gmake[3]: *** [/tmp/FreeBSD12-64_K19.02_GCC7.3.0/x86_64-native-bsdapp-gcc+shared/adeb371164ac4d7d958708310b5827a0/dpdk/mk/rte.sdkbuild.mk:46: drivers] Error 2
gmake[2]: *** [/tmp/FreeBSD12-64_K19.02_GCC7.3.0/x86_64-native-bsdapp-gcc+shared/adeb371164ac4d7d958708310b5827a0/dpdk/mk/rte.sdkroot.mk:99: all] Error 2
gmake[1]: *** [/tmp/FreeBSD12-64_K19.02_GCC7.3.0/x86_64-native-bsdapp-gcc+shared/adeb371164ac4d7d958708310b5827a0/dpdk/mk/rte.sdkinstall.mk:61: pre_install] Error 2
gmake: *** [/tmp/FreeBSD12-64_K19.02_GCC7.3.0/x86_64-native-bsdapp-gcc+shared/adeb371164ac4d7d958708310b5827a0/dpdk/mk/rte.sdkroot.mk:77: install] Error 2


*Make Build Failed #20:
OS: CENTOS76-64
Target: x86_64-native-linuxapp-gcc
 rte_write32(uint32_t value, volatile void *addr)
 ^
/tmp/CENTOS76-64_K3.10.0_GCC4.8.5/x86_64-native-linuxapp-gcc/adeb371164ac4d7d958708310b5827a0/dpdk/drivers/net/i40e/i40e_ethdev_vf.c: At top level:
cc1: error: unrecognized command line option "-Wno-address-of-packed-member" [-Werror]
cc1: all warnings being treated as errors
make[6]: *** [i40e_ethdev_vf.o] Error 1
make[6]: *** Waiting for unfinished jobs....
  CC ice_switch.o
  CC igb_pf.o
  CC ixgbe_x540.o
  CC hn_ethdev.o
--
  PMDINFO i40e_ethdev.o.pmd.c
  CC i40e_ethdev.o.pmd.o
  CC hn_rxtx.o
  LD i40e_ethdev.o
  SYMLINK-FILE include/rte_pmd_bnxt.h
make[5]: *** [i40e] Error 2
make[5]: *** Waiting for unfinished jobs....
  CC nfp_cpp_pcie_ops.o
  CC em_ethdev.o
  CC bnxt_cpr.o
  AR librte_pmd_iavf.a
--
  PMDINFO ixgbe_ethdev.o.pmd.c
  CC ixgbe_ethdev.o.pmd.o
  LD ixgbe_ethdev.o
  AR librte_pmd_ixgbe.a
  INSTALL-LIB librte_pmd_ixgbe.a
make[4]: *** [net] Error 2
make[3]: *** [drivers] Error 2
make[2]: *** [all] Error 2
make[1]: *** [pre_install] Error 2
make: *** [install] Error 2


*Make Build Failed #21:
OS: FreeBSD12-64
Target: x86_64-native-bsdapp-gcc
 ^~~~~~~~~~~
/tmp/FreeBSD12-64_K19.02_GCC7.3.0/x86_64-native-bsdapp-gcc/adeb371164ac4d7d958708310b5827a0/dpdk/drivers/net/i40e/i40e_ethdev_vf.c: At top level:
cc1: error: unrecognized command line option '-Wno-address-of-packed-member' [-Werror]
  AR librte_pmd_e1000.a
cc1: all warnings being treated as errors
gmake[6]: *** [/tmp/FreeBSD12-64_K19.02_GCC7.3.0/x86_64-native-bsdapp-gcc/adeb371164ac4d7d958708310b5827a0/dpdk/mk/internal/rte.compile-pre.mk:116: i40e_ethdev_vf.o] Error 1
gmake[6]: *** Waiting for unfinished jobs....
  CC ice_flow.o
  INSTALL-LIB librte_pmd_e1000.a
  CC ixgbe_x540.o
  PMDINFO lio_ethdev.o.pmd.c
--
  CC ice_ethdev.o
  PMDINFO i40e_ethdev.o.pmd.c
  CC i40e_ethdev.o.pmd.o
  LD i40e_ethdev.o
  CC lio_mbox.o
gmake[5]: *** [/tmp/FreeBSD12-64_K19.02_GCC7.3.0/x86_64-native-bsdapp-gcc/adeb371164ac4d7d958708310b5827a0/dpdk/mk/rte.subdir.mk:37: i40e] Error 2
gmake[5]: *** Waiting for unfinished jobs....
  CC ixgbe_vf.o
  CC ixgbe_hv_vf.o
  SYMLINK-FILE include/rte_pmd_bnxt.h
  CC bnxt_cpr.o
--
  CC bnxt_rxtx_vec_sse.o
  AR librte_pmd_ixgbe.a
  INSTALL-LIB librte_pmd_ixgbe.a
  AR librte_pmd_bnxt.a
  INSTALL-LIB librte_pmd_bnxt.a
gmake[4]: *** [/tmp/FreeBSD12-64_K19.02_GCC7.3.0/x86_64-native-bsdapp-gcc/adeb371164ac4d7d958708310b5827a0/dpdk/mk/rte.subdir.mk:35: net] Error 2
gmake[3]: *** [/tmp/FreeBSD12-64_K19.02_GCC7.3.0/x86_64-native-bsdapp-gcc/adeb371164ac4d7d958708310b5827a0/dpdk/mk/rte.sdkbuild.mk:46: drivers] Error 2
gmake[2]: *** [/tmp/FreeBSD12-64_K19.02_GCC7.3.0/x86_64-native-bsdapp-gcc/adeb371164ac4d7d958708310b5827a0/dpdk/mk/rte.sdkroot.mk:99: all] Error 2
gmake[1]: *** [/tmp/FreeBSD12-64_K19.02_GCC7.3.0/x86_64-native-bsdapp-gcc/adeb371164ac4d7d958708310b5827a0/dpdk/mk/rte.sdkinstall.mk:61: pre_install] Error 2
gmake: *** [/tmp/FreeBSD12-64_K19.02_GCC7.3.0/x86_64-native-bsdapp-gcc/adeb371164ac4d7d958708310b5827a0/dpdk/mk/rte.sdkroot.mk:77: install] Error 2


*Make Build Failed #22:
OS: FreeBSD12-64
Target: x86_64-native-bsdapp-gcc+debug
 rte_write32(uint32_t value, volatile void *addr)
 ^~~~~~~~~~~
/tmp/FreeBSD12-64_K19.02_GCC7.3.0/x86_64-native-bsdapp-gcc+debug/adeb371164ac4d7d958708310b5827a0/dpdk/drivers/net/i40e/i40e_ethdev_vf.c: At top level:
cc1: error: unrecognized command line option '-Wno-address-of-packed-member' [-Werror]
cc1: all warnings being treated as errors
gmake[6]: *** [/tmp/FreeBSD12-64_K19.02_GCC7.3.0/x86_64-native-bsdapp-gcc+debug/adeb371164ac4d7d958708310b5827a0/dpdk/mk/internal/rte.compile-pre.mk:116: i40e_ethdev_vf.o] Error 1
gmake[5]: *** [/tmp/FreeBSD12-64_K19.02_GCC7.3.0/x86_64-native-bsdapp-gcc+debug/adeb371164ac4d7d958708310b5827a0/dpdk/mk/rte.subdir.mk:35: i40e] Error 2
gmake[5]: *** Waiting for unfinished jobs....
  SYMLINK-FILE include/rte_eth_ring.h
  CC ecore_dev.o
  CC ixgbe_dcb.o
  CC rte_eth_ring.o
--
  CC hunt_nic.o
  CC medford_nic.o
  CC medford2_nic.o
  AR librte_pmd_sfc_efx.a
  INSTALL-LIB librte_pmd_sfc_efx.a
gmake[4]: *** [/tmp/FreeBSD12-64_K19.02_GCC7.3.0/x86_64-native-bsdapp-gcc+debug/adeb371164ac4d7d958708310b5827a0/dpdk/mk/rte.subdir.mk:35: net] Error 2
gmake[3]: *** [/tmp/FreeBSD12-64_K19.02_GCC7.3.0/x86_64-native-bsdapp-gcc+debug/adeb371164ac4d7d958708310b5827a0/dpdk/mk/rte.sdkbuild.mk:46: drivers] Error 2
gmake[2]: *** [/tmp/FreeBSD12-64_K19.02_GCC7.3.0/x86_64-native-bsdapp-gcc+debug/adeb371164ac4d7d958708310b5827a0/dpdk/mk/rte.sdkroot.mk:99: all] Error 2
gmake[1]: *** [/tmp/FreeBSD12-64_K19.02_GCC7.3.0/x86_64-native-bsdapp-gcc+debug/adeb371164ac4d7d958708310b5827a0/dpdk/mk/rte.sdkinstall.mk:61: pre_install] Error 2
gmake: *** [/tmp/FreeBSD12-64_K19.02_GCC7.3.0/x86_64-native-bsdapp-gcc+debug/adeb371164ac4d7d958708310b5827a0/dpdk/mk/rte.sdkroot.mk:77: install] Error 2

*Meson Build Failed #1:
OS: RHEL80-64
Target:build-gcc-static
FAILED: drivers/a715181@@tmp_rte_pmd_i40e@sta/net_i40e_i40e_ethdev_vf.c.o 
gcc -Idrivers/a715181@@tmp_rte_pmd_i40e@sta -Idrivers -I../drivers -Idrivers/net/i40e -I../drivers/net/i40e -Idrivers/net/i40e/base -I../drivers/net/i40e/base -Ilib/librte_ethdev -I../lib/librte_ethdev -I. -I../ -Iconfig -I../config -Ilib/librte_eal/common/include -I../lib/librte_eal/common/include -I../lib/librte_eal/linux/eal/include -Ilib/librte_eal/common -I../lib/librte_eal/common -Ilib/librte_eal/common/include/arch/x86 -I../lib/librte_eal/common/include/arch/x86 -Ilib/librte_eal -I../lib/librte_eal -Ilib/librte_kvargs -I../lib/librte_kvargs -Ilib/librte_net -I../lib/librte_net -Ilib/librte_mbuf -I../lib/librte_mbuf -Ilib/librte_mempool -I../lib/librte_mempool -Ilib/librte_ring -I../lib/librte_ring -Ilib/librte_meter -I../lib/librte_meter -Idrivers/bus/pci -I../drivers/bus/pci -I../drivers/bus/pci/linux -Ilib/librte_pci -I../lib/librte_pci -Idrivers/bus/vdev -I../drivers/bus/vdev -Ilib/librte_hash -I../lib/librte_hash -fdiagnostics-color=always -pipe -D_FILE_OFFSET_BITS=64 -Wall -Winvalid-pch -Werror -O3 -include rte_config.h -Wunused-parameter -Wsign-compare -Wcast-qual -D_GNU_SOURCE -fPIC -march=native -mno-avx512f -Wno-format-truncation -DPF_DRIVER -DVF_DRIVER -DINTEGRATED_VF -DX722_A0_SUPPORT -DALLOW_EXPERIMENTAL_API -DCC_AVX2_SUPPORT -MD -MQ 'drivers/a715181@@tmp_rte_pmd_i40e@sta/net_i40e_i40e_ethdev_vf.c.o' -MF 'drivers/a715181@@tmp_rte_pmd_i40e@sta/net_i40e_i40e_ethdev_vf.c.o.d' -o 'drivers/a715181@@tmp_rte_pmd_i40e@sta/net_i40e_i40e_ethdev_vf.c.o' -c ../drivers/net/i40e/i40e_ethdev_vf.c
../drivers/net/i40e/i40e_ethdev_vf.c: In function ‘i40evf_config_rss’:
../drivers/net/i40e/i40e_ethdev_vf.c:2603:11: error: conflicting types for ‘lut’
  uint8_t *lut;
           ^~~
../drivers/net/i40e/i40e_ethdev_vf.c:2600:17: note: previous definition of ‘lut’ was here
  uint32_t i, j, lut = 0, nb_q = (I40E_VFQF_HLUT_MAX_INDEX + 1) * 4;
                 ^~~
../drivers/net/i40e/i40e_ethdev_vf.c:2618:15: error: invalid operands to binary << (have ‘uint8_t *’ {aka ‘unsigned char *’} and ‘int’)
    lut = (lut << 8) | j;
               ^~
In file included from ../drivers/net/i40e/base/i40e_type.h:9,
                 from ../drivers/net/i40e/base/i40e_prototype.h:8,
                 from ../drivers/net/i40e/i40e_ethdev_vf.c:34:
../drivers/net/i40e/base/i40e_osdep.h:137:14: error: passing argument 1 of ‘rte_write32’ makes integer from pointer without a cast [-Werror=int-conversion]
  rte_write32((rte_cpu_to_le_32(value)), reg)
              ^~~~~~~~~~~~~~~~~~~~~~~~~
../drivers/net/i40e/base/i40e_osdep.h:146:2: note: in expansion of macro ‘I40E_PCI_REG_WRITE’
  I40E_PCI_REG_WRITE(I40E_PCI_REG_ADDR((hw), (reg)), (value))
  ^~~~~~~~~~~~~~~~~~
../drivers/net/i40e/i40e_ethdev_vf.c:2620:5: note: in expansion of macro ‘I40E_WRITE_REG’
     I40E_WRITE_REG(hw, I40E_VFQF_HLUT(i >> 2), lut);
     ^~~~~~~~~~~~~~
In file included from ../lib/librte_eal/common/include/arch/x86/rte_io.h:12,
                 from ../drivers/net/i40e/base/i40e_osdep.h:20,
                 from ../drivers/net/i40e/base/i40e_type.h:9,
                 from ../drivers/net/i40e/base/i40e_prototype.h:8,
                 from ../drivers/net/i40e/i40e_ethdev_vf.c:34:
../lib/librte_eal/common/include/generic/rte_io.h:335:22: note: expected ‘uint32_t’ {aka ‘unsigned int’} but argument is of type ‘uint8_t *’ {aka ‘unsigned char *’}
 rte_write32(uint32_t value, volatile void *addr)
             ~~~~~~~~~^~~~~
cc1: all warnings being treated as errors
[792/1824] Compiling C object 'drivers/net/i40e/base/3c1f984@@i40e_base@sta/i40e_nvm.c.o'.
[793/1824] Compiling C object 'drivers/a715181@@tmp_rte_pmd_i40e@sta/net_i40e_i40e_pf.c.o'.
[794/1824] Compiling C object 'drivers/net/i40e/base/3c1f984@@i40e_base@sta/i40e_common.c.o'.
[795/1824] Compiling C object 'drivers/a715181@@tmp_rte_pmd_i40e@sta/net_i40e_i40e_rxtx.c.o'.
[796/1824] Compiling C object 'drivers/a715181@@tmp_rte_pmd_i40e@sta/net_i40e_i40e_ethdev.c.o'.
ninja: build stopped: subcommand failed




*Meson Build Failed #2:
OS: FC30-64
Target:build-gcc-static
FAILED: drivers/a715181@@tmp_rte_pmd_i40e@sta/net_i40e_i40e_ethdev_vf.c.o 
gcc -Idrivers/a715181@@tmp_rte_pmd_i40e@sta -Idrivers -I../drivers -Idrivers/net/i40e -I../drivers/net/i40e -Idrivers/net/i40e/base -I../drivers/net/i40e/base -Ilib/librte_ethdev -I../lib/librte_ethdev -I. -I../ -Iconfig -I../config -Ilib/librte_eal/common/include -I../lib/librte_eal/common/include -I../lib/librte_eal/linux/eal/include -Ilib/librte_eal/common -I../lib/librte_eal/common -Ilib/librte_eal/common/include/arch/x86 -I../lib/librte_eal/common/include/arch/x86 -Ilib/librte_eal -I../lib/librte_eal -Ilib/librte_kvargs -I../lib/librte_kvargs -Ilib/librte_net -I../lib/librte_net -Ilib/librte_mbuf -I../lib/librte_mbuf -Ilib/librte_mempool -I../lib/librte_mempool -Ilib/librte_ring -I../lib/librte_ring -Ilib/librte_meter -I../lib/librte_meter -Idrivers/bus/pci -I../drivers/bus/pci -I../drivers/bus/pci/linux -Ilib/librte_pci -I../lib/librte_pci -Idrivers/bus/vdev -I../drivers/bus/vdev -Ilib/librte_hash -I../lib/librte_hash -fdiagnostics-color=always -pipe -D_FILE_OFFSET_BITS=64 -Wall -Winvalid-pch -Werror -O3 -include rte_config.h -Wunused-parameter -Wsign-compare -Wcast-qual -Wno-address-of-packed-member -D_GNU_SOURCE -fPIC -march=native -mno-avx512f -Wno-format-truncation -DPF_DRIVER -DVF_DRIVER -DINTEGRATED_VF -DX722_A0_SUPPORT -DALLOW_EXPERIMENTAL_API -DCC_AVX2_SUPPORT -MD -MQ 'drivers/a715181@@tmp_rte_pmd_i40e@sta/net_i40e_i40e_ethdev_vf.c.o' -MF 'drivers/a715181@@tmp_rte_pmd_i40e@sta/net_i40e_i40e_ethdev_vf.c.o.d' -o 'drivers/a715181@@tmp_rte_pmd_i40e@sta/net_i40e_i40e_ethdev_vf.c.o' -c ../drivers/net/i40e/i40e_ethdev_vf.c
../drivers/net/i40e/i40e_ethdev_vf.c: In function ‘i40evf_config_rss’:
../drivers/net/i40e/i40e_ethdev_vf.c:2603:11: error: conflicting types for ‘lut’
 2603 |  uint8_t *lut;
      |           ^~~
../drivers/net/i40e/i40e_ethdev_vf.c:2600:17: note: previous definition of ‘lut’ was here
 2600 |  uint32_t i, j, lut = 0, nb_q = (I40E_VFQF_HLUT_MAX_INDEX + 1) * 4;
      |                 ^~~
../drivers/net/i40e/i40e_ethdev_vf.c:2618:15: error: invalid operands to binary << (have ‘uint8_t *’ {aka ‘unsigned char *’} and ‘int’)
 2618 |    lut = (lut << 8) | j;
      |               ^~
In file included from ../drivers/net/i40e/base/i40e_type.h:9,
                 from ../drivers/net/i40e/base/i40e_prototype.h:8,
                 from ../drivers/net/i40e/i40e_ethdev_vf.c:34:
../drivers/net/i40e/base/i40e_osdep.h:137:14: error: passing argument 1 of ‘rte_write32’ makes integer from pointer without a cast [-Werror=int-conversion]
  137 |  rte_write32((rte_cpu_to_le_32(value)), reg)
      |              ^~~~~~~~~~~~~~~~~~~~~~~~~
      |              |
      |              uint8_t * {aka unsigned char *}
../drivers/net/i40e/base/i40e_osdep.h:146:2: note: in expansion of macro ‘I40E_PCI_REG_WRITE’
  146 |  I40E_PCI_REG_WRITE(I40E_PCI_REG_ADDR((hw), (reg)), (value))
      |  ^~~~~~~~~~~~~~~~~~
../drivers/net/i40e/i40e_ethdev_vf.c:2620:5: note: in expansion of macro ‘I40E_WRITE_REG’
 2620 |     I40E_WRITE_REG(hw, I40E_VFQF_HLUT(i >> 2), lut);
      |     ^~~~~~~~~~~~~~
In file included from ../lib/librte_eal/common/include/arch/x86/rte_io.h:12,
                 from ../drivers/net/i40e/base/i40e_osdep.h:20,
                 from ../drivers/net/i40e/base/i40e_type.h:9,
                 from ../drivers/net/i40e/base/i40e_prototype.h:8,
                 from ../drivers/net/i40e/i40e_ethdev_vf.c:34:
../lib/librte_eal/common/include/generic/rte_io.h:335:22: note: expected ‘uint32_t’ {aka ‘unsigned int’} but argument is of type ‘uint8_t *’ {aka ‘unsigned char *’}
  335 | rte_write32(uint32_t value, volatile void *addr)
      |             ~~~~~~~~~^~~~~
cc1: all warnings being treated as errors
[782/1784] Compiling C object 'drivers/a715181@@tmp_rte_pmd_i40e@sta/net_i40e_i40e_pf.c.o'.
[783/1784] Compiling C object 'drivers/net/i40e/base/3c1f984@@i40e_base@sta/i40e_common.c.o'.
[784/1784] Compiling C object 'drivers/a715181@@tmp_rte_pmd_i40e@sta/net_i40e_i40e_tm.c.o'.
[785/1784] Compiling C object 'drivers/a715181@@tmp_rte_pmd_i40e@sta/net_i40e_i40e_fdir.c.o'.
[786/1784] Compiling C object 'drivers/a715181@@tmp_rte_pmd_i40e@sta/net_i40e_i40e_flow.c.o'.
[787/1784] Compiling C object 'drivers/a715181@@tmp_rte_pmd_i40e@sta/net_i40e_i40e_rxtx.c.o'.
[788/1784] Compiling C object 'drivers/a715181@@tmp_rte_pmd_i40e@sta/net_i40e_i40e_ethdev.c.o'.
ninja: build stopped: subcommand failed




*Meson Build Failed #3:
OS: UB1604-32
Target:build-gcc-static
FAILED: drivers/a715181@@tmp_rte_pmd_i40e@sta/net_i40e_i40e_ethdev_vf.c.o 
gcc -Idrivers/a715181@@tmp_rte_pmd_i40e@sta -Idrivers -I../drivers -Idrivers/net/i40e -I../drivers/net/i40e -Idrivers/net/i40e/base -I../drivers/net/i40e/base -Ilib/librte_ethdev -I../lib/librte_ethdev -I. -I../ -Iconfig -I../config -Ilib/librte_eal/common/include -I../lib/librte_eal/common/include -I../lib/librte_eal/linux/eal/include -Ilib/librte_eal/common -I../lib/librte_eal/common -Ilib/librte_eal/common/include/arch/x86 -I../lib/librte_eal/common/include/arch/x86 -Ilib/librte_eal -I../lib/librte_eal -Ilib/librte_kvargs -I../lib/librte_kvargs -Ilib/librte_net -I../lib/librte_net -Ilib/librte_mbuf -I../lib/librte_mbuf -Ilib/librte_mempool -I../lib/librte_mempool -Ilib/librte_ring -I../lib/librte_ring -Ilib/librte_meter -I../lib/librte_meter -Idrivers/bus/pci -I../drivers/bus/pci -I../drivers/bus/pci/linux -Ilib/librte_pci -I../lib/librte_pci -Idrivers/bus/vdev -I../drivers/bus/vdev -Ilib/librte_hash -I../lib/librte_hash -fdiagnostics-color=always -pipe -D_FILE_OFFSET_BITS=64 -Wall -Winvalid-pch -Werror -O3 -include rte_config.h -Wunused-parameter -Wsign-compare -Wcast-qual -Wno-pointer-to-int-cast -D_GNU_SOURCE -fPIC -march=native -DPF_DRIVER -DVF_DRIVER -DINTEGRATED_VF -DX722_A0_SUPPORT -DALLOW_EXPERIMENTAL_API -DCC_AVX2_SUPPORT -MD -MQ 'drivers/a715181@@tmp_rte_pmd_i40e@sta/net_i40e_i40e_ethdev_vf.c.o' -MF 'drivers/a715181@@tmp_rte_pmd_i40e@sta/net_i40e_i40e_ethdev_vf.c.o.d' -o 'drivers/a715181@@tmp_rte_pmd_i40e@sta/net_i40e_i40e_ethdev_vf.c.o' -c ../drivers/net/i40e/i40e_ethdev_vf.c
../drivers/net/i40e/i40e_ethdev_vf.c: In function ‘i40evf_config_rss’:
../drivers/net/i40e/i40e_ethdev_vf.c:2603:11: error: conflicting types for ‘lut’
  uint8_t *lut;
           ^
../drivers/net/i40e/i40e_ethdev_vf.c:2600:17: note: previous definition of ‘lut’ was here
  uint32_t i, j, lut = 0, nb_q = (I40E_VFQF_HLUT_MAX_INDEX + 1) * 4;
                 ^
../drivers/net/i40e/i40e_ethdev_vf.c:2618:15: error: invalid operands to binary << (have ‘uint8_t * {aka unsigned char *}’ and ‘int’)
    lut = (lut << 8) | j;
               ^
In file included from ../drivers/net/i40e/base/i40e_type.h:9:0,
                 from ../drivers/net/i40e/base/i40e_prototype.h:8,
                 from ../drivers/net/i40e/i40e_ethdev_vf.c:34:
../drivers/net/i40e/base/i40e_osdep.h:137:14: error: passing argument 1 of ‘rte_write32’ makes integer from pointer without a cast [-Werror=int-conversion]
  rte_write32((rte_cpu_to_le_32(value)), reg)
              ^
../drivers/net/i40e/base/i40e_osdep.h:146:2: note: in expansion of macro ‘I40E_PCI_REG_WRITE’
  I40E_PCI_REG_WRITE(I40E_PCI_REG_ADDR((hw), (reg)), (value))
  ^
../drivers/net/i40e/i40e_ethdev_vf.c:2620:5: note: in expansion of macro ‘I40E_WRITE_REG’
     I40E_WRITE_REG(hw, I40E_VFQF_HLUT(i >> 2), lut);
     ^
In file included from ../lib/librte_eal/common/include/arch/x86/rte_io.h:12:0,
                 from ../drivers/net/i40e/base/i40e_osdep.h:20,
                 from ../drivers/net/i40e/base/i40e_type.h:9,
                 from ../drivers/net/i40e/base/i40e_prototype.h:8,
                 from ../drivers/net/i40e/i40e_ethdev_vf.c:34:
../lib/librte_eal/common/include/generic/rte_io.h:335:1: note: expected ‘uint32_t {aka unsigned int}’ but argument is of type ‘uint8_t * {aka unsigned char *}’
 rte_write32(uint32_t value, volatile void *addr)
 ^
cc1: all warnings being treated as errors
[774/1656] Compiling C object 'drivers/net/i40e/base/3c1f984@@i40e_base@sta/i40e_common.c.o'.
[775/1656] Compiling C object 'drivers/a715181@@tmp_rte_pmd_i40e@sta/net_i40e_i40e_pf.c.o'.
[776/1656] Compiling C object 'drivers/a715181@@tmp_rte_pmd_i40e@sta/net_i40e_i40e_rxtx.c.o'.
[777/1656] Compiling C object 'drivers/a715181@@tmp_rte_pmd_i40e@sta/net_i40e_i40e_ethdev.c.o'.
[778/1656] Compiling C object 'drivers/a715181@@tmp_rte_pmd_octeontx2_event@sta/event_octeontx2_otx2_worker.c.o'.
ninja: build stopped: subcommand failed




*Meson Build Failed #4:
OS: SUSE15-64
Target:build-gcc-static
FAILED: drivers/a715181@@tmp_rte_pmd_i40e@sta/net_i40e_i40e_ethdev_vf.c.o 
gcc -Idrivers/a715181@@tmp_rte_pmd_i40e@sta -Idrivers -I../drivers -Idrivers/net/i40e -I../drivers/net/i40e -Idrivers/net/i40e/base -I../drivers/net/i40e/base -Ilib/librte_ethdev -I../lib/librte_ethdev -I. -I../ -Iconfig -I../config -Ilib/librte_eal/common/include -I../lib/librte_eal/common/include -I../lib/librte_eal/linux/eal/include -Ilib/librte_eal/common -I../lib/librte_eal/common -Ilib/librte_eal/common/include/arch/x86 -I../lib/librte_eal/common/include/arch/x86 -Ilib/librte_eal -I../lib/librte_eal -Ilib/librte_kvargs -I../lib/librte_kvargs -Ilib/librte_net -I../lib/librte_net -Ilib/librte_mbuf -I../lib/librte_mbuf -Ilib/librte_mempool -I../lib/librte_mempool -Ilib/librte_ring -I../lib/librte_ring -Ilib/librte_meter -I../lib/librte_meter -Idrivers/bus/pci -I../drivers/bus/pci -I../drivers/bus/pci/linux -Ilib/librte_pci -I../lib/librte_pci -Idrivers/bus/vdev -I../drivers/bus/vdev -Ilib/librte_hash -I../lib/librte_hash -fdiagnostics-color=always -pipe -D_FILE_OFFSET_BITS=64 -Wall -Winvalid-pch -Werror -O3 -include rte_config.h -Wunused-parameter -Wsign-compare -Wcast-qual -D_GNU_SOURCE -fPIC -march=native -Wno-format-truncation -DPF_DRIVER -DVF_DRIVER -DINTEGRATED_VF -DX722_A0_SUPPORT -DALLOW_EXPERIMENTAL_API -DCC_AVX2_SUPPORT -MD -MQ 'drivers/a715181@@tmp_rte_pmd_i40e@sta/net_i40e_i40e_ethdev_vf.c.o' -MF 'drivers/a715181@@tmp_rte_pmd_i40e@sta/net_i40e_i40e_ethdev_vf.c.o.d' -o 'drivers/a715181@@tmp_rte_pmd_i40e@sta/net_i40e_i40e_ethdev_vf.c.o' -c ../drivers/net/i40e/i40e_ethdev_vf.c
../drivers/net/i40e/i40e_ethdev_vf.c: In function ‘i40evf_config_rss’:
../drivers/net/i40e/i40e_ethdev_vf.c:2603:11: error: conflicting types for ‘lut’
  uint8_t *lut;
           ^~~
../drivers/net/i40e/i40e_ethdev_vf.c:2600:17: note: previous definition of ‘lut’ was here
  uint32_t i, j, lut = 0, nb_q = (I40E_VFQF_HLUT_MAX_INDEX + 1) * 4;
                 ^~~
../drivers/net/i40e/i40e_ethdev_vf.c:2618:15: error: invalid operands to binary << (have ‘uint8_t * {aka unsigned char *}’ and ‘int’)
    lut = (lut << 8) | j;
               ^~
In file included from ../drivers/net/i40e/base/i40e_type.h:9:0,
                 from ../drivers/net/i40e/base/i40e_prototype.h:8,
                 from ../drivers/net/i40e/i40e_ethdev_vf.c:34:
../drivers/net/i40e/base/i40e_osdep.h:137:14: error: passing argument 1 of ‘rte_write32’ makes integer from pointer without a cast [-Werror=int-conversion]
  rte_write32((rte_cpu_to_le_32(value)), reg)
              ^
../drivers/net/i40e/base/i40e_osdep.h:146:2: note: in expansion of macro ‘I40E_PCI_REG_WRITE’
  I40E_PCI_REG_WRITE(I40E_PCI_REG_ADDR((hw), (reg)), (value))
  ^~~~~~~~~~~~~~~~~~
../drivers/net/i40e/i40e_ethdev_vf.c:2620:5: note: in expansion of macro ‘I40E_WRITE_REG’
     I40E_WRITE_REG(hw, I40E_VFQF_HLUT(i >> 2), lut);
     ^~~~~~~~~~~~~~
In file included from ../lib/librte_eal/common/include/arch/x86/rte_io.h:12:0,
                 from ../drivers/net/i40e/base/i40e_osdep.h:20,
                 from ../drivers/net/i40e/base/i40e_type.h:9,
                 from ../drivers/net/i40e/base/i40e_prototype.h:8,
                 from ../drivers/net/i40e/i40e_ethdev_vf.c:34:
../lib/librte_eal/common/include/generic/rte_io.h:335:1: note: expected ‘uint32_t {aka unsigned int}’ but argument is of type ‘uint8_t * {aka unsigned char *}’
 rte_write32(uint32_t value, volatile void *addr)
 ^~~~~~~~~~~
cc1: all warnings being treated as errors
[784/1831] Compiling C object 'drivers/a715181@@tmp_rte_pmd_i40e@sta/net_i40e_i40e_pf.c.o'.
[785/1831] Compiling C object 'drivers/a715181@@tmp_rte_pmd_fm10k@sta/net_fm10k_fm10k_ethdev.c.o'.
[786/1831] Compiling C object 'drivers/net/i40e/base/3c1f984@@i40e_base@sta/i40e_nvm.c.o'.
[787/1831] Compiling C object 'drivers/net/i40e/base/3c1f984@@i40e_base@sta/i40e_common.c.o'.
[788/1831] Compiling C object 'drivers/a715181@@tmp_rte_pmd_i40e@sta/net_i40e_i40e_fdir.c.o'.
[789/1831] Compiling C object 'drivers/a715181@@tmp_rte_pmd_i40e@sta/net_i40e_i40e_rxtx.c.o'.
[790/1831] Compiling C object 'drivers/a715181@@tmp_rte_pmd_i40e@sta/net_i40e_i40e_ethdev.c.o'.
ninja: build stopped: subcommand failed




*Meson Build Failed #5:
OS: UB1804-64
Target:build-gcc-static
FAILED: drivers/a715181@@tmp_rte_pmd_i40e@sta/net_i40e_i40e_ethdev_vf.c.o 
gcc -Idrivers/a715181@@tmp_rte_pmd_i40e@sta -Idrivers -I../drivers -Idrivers/net/i40e -I../drivers/net/i40e -Idrivers/net/i40e/base -I../drivers/net/i40e/base -Ilib/librte_ethdev -I../lib/librte_ethdev -I. -I../ -Iconfig -I../config -Ilib/librte_eal/common/include -I../lib/librte_eal/common/include -I../lib/librte_eal/linux/eal/include -Ilib/librte_eal/common -I../lib/librte_eal/common -Ilib/librte_eal/common/include/arch/x86 -I../lib/librte_eal/common/include/arch/x86 -Ilib/librte_eal -I../lib/librte_eal -Ilib/librte_kvargs -I../lib/librte_kvargs -Ilib/librte_net -I../lib/librte_net -Ilib/librte_mbuf -I../lib/librte_mbuf -Ilib/librte_mempool -I../lib/librte_mempool -Ilib/librte_ring -I../lib/librte_ring -Ilib/librte_meter -I../lib/librte_meter -Idrivers/bus/pci -I../drivers/bus/pci -I../drivers/bus/pci/linux -Ilib/librte_pci -I../lib/librte_pci -Idrivers/bus/vdev -I../drivers/bus/vdev -Ilib/librte_hash -I../lib/librte_hash -fdiagnostics-color=always -pipe -D_FILE_OFFSET_BITS=64 -Wall -Winvalid-pch -Werror -O3 -include rte_config.h -Wunused-parameter -Wsign-compare -Wcast-qual -D_GNU_SOURCE -fPIC -march=native -mno-avx512f -Wno-format-truncation -DPF_DRIVER -DVF_DRIVER -DINTEGRATED_VF -DX722_A0_SUPPORT -DALLOW_EXPERIMENTAL_API -DCC_AVX2_SUPPORT -MD -MQ 'drivers/a715181@@tmp_rte_pmd_i40e@sta/net_i40e_i40e_ethdev_vf.c.o' -MF 'drivers/a715181@@tmp_rte_pmd_i40e@sta/net_i40e_i40e_ethdev_vf.c.o.d' -o 'drivers/a715181@@tmp_rte_pmd_i40e@sta/net_i40e_i40e_ethdev_vf.c.o' -c ../drivers/net/i40e/i40e_ethdev_vf.c
../drivers/net/i40e/i40e_ethdev_vf.c: In function ‘i40evf_config_rss’:
../drivers/net/i40e/i40e_ethdev_vf.c:2603:11: error: conflicting types for ‘lut’
  uint8_t *lut;
           ^~~
../drivers/net/i40e/i40e_ethdev_vf.c:2600:17: note: previous definition of ‘lut’ was here
  uint32_t i, j, lut = 0, nb_q = (I40E_VFQF_HLUT_MAX_INDEX + 1) * 4;
                 ^~~
../drivers/net/i40e/i40e_ethdev_vf.c:2618:15: error: invalid operands to binary << (have ‘uint8_t * {aka unsigned char *}’ and ‘int’)
    lut = (lut << 8) | j;
               ^~
In file included from ../drivers/net/i40e/base/i40e_type.h:9:0,
                 from ../drivers/net/i40e/base/i40e_prototype.h:8,
                 from ../drivers/net/i40e/i40e_ethdev_vf.c:34:
../drivers/net/i40e/base/i40e_osdep.h:137:14: error: passing argument 1 of ‘rte_write32’ makes integer from pointer without a cast [-Werror=int-conversion]
  rte_write32((rte_cpu_to_le_32(value)), reg)
              ^
../drivers/net/i40e/base/i40e_osdep.h:146:2: note: in expansion of macro ‘I40E_PCI_REG_WRITE’
  I40E_PCI_REG_WRITE(I40E_PCI_REG_ADDR((hw), (reg)), (value))
  ^~~~~~~~~~~~~~~~~~
../drivers/net/i40e/i40e_ethdev_vf.c:2620:5: note: in expansion of macro ‘I40E_WRITE_REG’
     I40E_WRITE_REG(hw, I40E_VFQF_HLUT(i >> 2), lut);
     ^~~~~~~~~~~~~~
In file included from ../lib/librte_eal/common/include/arch/x86/rte_io.h:12:0,
                 from ../drivers/net/i40e/base/i40e_osdep.h:20,
                 from ../drivers/net/i40e/base/i40e_type.h:9,
                 from ../drivers/net/i40e/base/i40e_prototype.h:8,
                 from ../drivers/net/i40e/i40e_ethdev_vf.c:34:
../lib/librte_eal/common/include/generic/rte_io.h:335:1: note: expected ‘uint32_t {aka unsigned int}’ but argument is of type ‘uint8_t * {aka unsigned char *}’
 rte_write32(uint32_t value, volatile void *addr)
 ^~~~~~~~~~~
cc1: all warnings being treated as errors
[794/1791] Compiling C object 'drivers/a715181@@tmp_rte_pmd_i40e@sta/net_i40e_i40e_pf.c.o'.
[795/1791] Compiling C object 'drivers/a715181@@tmp_rte_pmd_i40e@sta/net_i40e_i40e_fdir.c.o'.
[796/1791] Compiling C object 'drivers/a715181@@tmp_rte_pmd_i40e@sta/net_i40e_i40e_flow.c.o'.
[797/1791] Compiling C object 'drivers/a715181@@tmp_rte_pmd_i40e@sta/net_i40e_i40e_rxtx.c.o'.
[798/1791] Compiling C object 'drivers/a715181@@tmp_rte_pmd_i40e@sta/net_i40e_i40e_ethdev.c.o'.
ninja: build stopped: subcommand failed




*Meson Build Failed #6:
OS: FreeBSD12-64
Target:build-gcc-static
FAILED: drivers/a715181@@tmp_rte_pmd_i40e@sta/net_i40e_i40e_ethdev_vf.c.o 
ccache gcc -Idrivers/a715181@@tmp_rte_pmd_i40e@sta -Idrivers -I../drivers -Idrivers/net/i40e -I../drivers/net/i40e -Idrivers/net/i40e/base -I../drivers/net/i40e/base -Ilib/librte_ethdev -I../lib/librte_ethdev -I. -I../ -Iconfig -I../config -Ilib/librte_eal/common/include -I../lib/librte_eal/common/include -I../lib/librte_eal/freebsd/eal/include -Ilib/librte_eal/common -I../lib/librte_eal/common -Ilib/librte_eal/common/include/arch/x86 -I../lib/librte_eal/common/include/arch/x86 -Ilib/librte_eal -I../lib/librte_eal -Ilib/librte_kvargs -I../lib/librte_kvargs -Ilib/librte_net -I../lib/librte_net -Ilib/librte_mbuf -I../lib/librte_mbuf -Ilib/librte_mempool -I../lib/librte_mempool -Ilib/librte_ring -I../lib/librte_ring -Ilib/librte_meter -I../lib/librte_meter -Idrivers/bus/pci -I../drivers/bus/pci -I../drivers/bus/pci/bsd -Ilib/librte_pci -I../lib/librte_pci -Idrivers/bus/vdev -I../drivers/bus/vdev -Ilib/librte_hash -I../lib/librte_hash -fdiagnostics-color=always -pipe -D_FILE_OFFSET_BITS=64 -Wall -Winvalid-pch -Werror -O3 -include rte_config.h -Wunused-parameter -Wsign-compare -Wcast-qual -D_GNU_SOURCE -D__BSD_VISIBLE -fPIC -march=native -Wno-format-truncation -DPF_DRIVER -DVF_DRIVER -DINTEGRATED_VF -DX722_A0_SUPPORT -DALLOW_EXPERIMENTAL_API -DCC_AVX2_SUPPORT -MD -MQ 'drivers/a715181@@tmp_rte_pmd_i40e@sta/net_i40e_i40e_ethdev_vf.c.o' -MF 'drivers/a715181@@tmp_rte_pmd_i40e@sta/net_i40e_i40e_ethdev_vf.c.o.d' -o 'drivers/a715181@@tmp_rte_pmd_i40e@sta/net_i40e_i40e_ethdev_vf.c.o' -c ../drivers/net/i40e/i40e_ethdev_vf.c
../drivers/net/i40e/i40e_ethdev_vf.c: In function 'i40evf_config_rss':
../drivers/net/i40e/i40e_ethdev_vf.c:2603:11: error: conflicting types for 'lut'
  uint8_t *lut;
           ^~~
../drivers/net/i40e/i40e_ethdev_vf.c:2600:17: note: previous definition of 'lut' was here
  uint32_t i, j, lut = 0, nb_q = (I40E_VFQF_HLUT_MAX_INDEX + 1) * 4;
                 ^~~
../drivers/net/i40e/i40e_ethdev_vf.c:2618:15: error: invalid operands to binary << (have 'uint8_t * {aka unsigned char *}' and 'int')
    lut = (lut << 8) | j;
               ^~
In file included from ../drivers/net/i40e/base/i40e_type.h:9:0,
                 from ../drivers/net/i40e/base/i40e_prototype.h:8,
                 from ../drivers/net/i40e/i40e_ethdev_vf.c:34:
../drivers/net/i40e/base/i40e_osdep.h:137:14: error: passing argument 1 of 'rte_write32' makes integer from pointer without a cast [-Werror=int-conversion]
  rte_write32((rte_cpu_to_le_32(value)), reg)
              ^
../drivers/net/i40e/base/i40e_osdep.h:146:2: note: in expansion of macro 'I40E_PCI_REG_WRITE'
  I40E_PCI_REG_WRITE(I40E_PCI_REG_ADDR((hw), (reg)), (value))
  ^~~~~~~~~~~~~~~~~~
../drivers/net/i40e/i40e_ethdev_vf.c:2620:5: note: in expansion of macro 'I40E_WRITE_REG'
     I40E_WRITE_REG(hw, I40E_VFQF_HLUT(i >> 2), lut);
     ^~~~~~~~~~~~~~
In file included from ../lib/librte_eal/common/include/arch/x86/rte_io.h:12:0,
                 from ../drivers/net/i40e/base/i40e_osdep.h:20,
                 from ../drivers/net/i40e/base/i40e_type.h:9,
                 from ../drivers/net/i40e/base/i40e_prototype.h:8,
                 from ../drivers/net/i40e/i40e_ethdev_vf.c:34:
../lib/librte_eal/common/include/generic/rte_io.h:335:1: note: expected 'uint32_t {aka unsigned int}' but argument is of type 'uint8_t * {aka unsigned char *}'
 rte_write32(uint32_t value, volatile void *addr)
 ^~~~~~~~~~~
cc1: all warnings being treated as errors
[853/1413] Compiling C object 'drivers/a715181@@rte_pmd_null@sta/meson-generated_.._rte_pmd_null.pmd.c.o'.
[854/1413] Compiling C object 'drivers/a715181@@rte_pmd_null@sha/meson-generated_.._rte_pmd_null.pmd.c.o'.
[855/1413] Compiling C object 'drivers/a715181@@rte_pmd_liquidio@sta/meson-generated_.._rte_pmd_liquidio.pmd.c.o'.
[856/1413] Compiling C object 'drivers/a715181@@tmp_rte_pmd_octeontx@sta/net_octeontx_octeontx_ethdev.c.o'.
[857/1413] Generating rte_pmd_ixgbe.pmd.c with a custom command.
ninja: build stopped: subcommand failed



DPDK STV team

^ permalink raw reply	[flat|nested] only message in thread

only message in thread, back to index

Thread overview: (only message) (download: mbox.gz / follow: Atom feed)
-- links below jump to the message on this page --
2019-08-12  9:13 [dpdk-test-report] |FAILURE| pw57619[v4] net/i40e: fix vf runtime queues rss config sys_stv

automatic DPDK test reports

Archives are clonable:
	git clone --mirror http://inbox.dpdk.org/test-report/0 test-report/git/0.git

	# If you have public-inbox 1.1+ installed, you may
	# initialize and index your mirror using the following commands:
	public-inbox-init -V2 test-report test-report/ http://inbox.dpdk.org/test-report \
		test-report@dpdk.org
	public-inbox-index test-report


Newsgroup available over NNTP:
	nntp://inbox.dpdk.org/inbox.dpdk.test-report


AGPL code for this site: git clone https://public-inbox.org/ public-inbox