automatic DPDK test reports
 help / color / Atom feed
* [dpdk-test-report] |FAILURE| pw57632[5/6] devtools: test compiler availability only once
@ 2019-08-12 23:48 sys_stv
  0 siblings, 0 replies; only message in thread
From: sys_stv @ 2019-08-12 23:48 UTC (permalink / raw)
  To: test-report

[-- Attachment #1: Type: text/plain, Size: 37468 bytes --]

Test-Label: Intel-compilation
Test-Status: FAILURE
http://dpdk.org/patch/57632

_Compilation issues_

Submitter: Thomas Monjalon <thomas@monjalon.net>
Date: 2019-08-12 23:03:57
Reply_mail: 20190812230358.988-6-thomas@monjalon.net
DPDK git baseline: Repo:dpdk, CommitID: b81660d09e9caa928ab1c683cd0fbfbe2439ac3d

Makefile build Summary: 22 Builds Done, 22 Successful, 0 Failures

Meson build Summary: 8 Builds Done, 2 Successful, 6 Failures

               +==============================================+===========+==========+
               |                   Makefile                   |   Meson   | Document |
+--------------+------+-------+------+------------+-----------+-----------+----------+
| os           | gcc  | clang | icc  | gcc+shared | gcc+debug | gcc/clang | pdf/html |
+--------------+------+-------+------+------------+-----------+-----------+----------+
| RHEL76-64    | pass |       |      |            |           |           |          |
| CENTOS76-64  | pass |       |      |            |           |           |          |
| UB1804-64    | pass | pass  | pass |            |           | FAIL      | pass     |
| UB1604-32    | pass |       |      |            |           | FAIL      |          |
| UB1904-64    | pass |       |      |            |           |           |          |
| UB1604-64    | pass | pass  |      |            |           |           |          |
| FC30-64      | pass | pass  |      |            |           | FAIL      |          |
| WIN10-64     |      |       |      |            |           | pass      |          |
| FreeBSD12-64 | pass | pass  |      | pass       | pass      | FAIL      |          |
| RHEL80-64    | pass | pass  | pass | pass       | pass      | FAIL      |          |
| SUSE15-64    | pass | pass  |      |            |           | FAIL      |          |
+--------------+------+-------+------+------------+-----------+-----------+----------+

Test environment and configuration as below:

** Makefile build **


OS: RHEL76-64
	Kernel Version: 3.10.0-957.el7.x86_64
	CPU info: Intel(R) Xeon(R) CPU E5-2699 v4 @ 2.20GHz
	GCC Version: gcc (GCC) 4.8.5 20150623 (Red Hat 4.8.5-36)
	Clang Version: NA
	x86_64-native-linuxapp-gcc


OS: CENTOS76-64
	Kernel Version: 3.10.0-957.10.1.el7.x86_64
	CPU info: Intel(R) Xeon(R) CPU E5-2699 v4 @ 2.20GHz
	GCC Version: gcc (GCC) 4.8.5 20150623 (Red Hat 4.8.5-36)
	Clang Version: 3.4.2 (tags/RELEASE_34/dot2-final)
	x86_64-native-linuxapp-gcc


OS: UB1804-64
	Kernel Version: 4.15.0-20-generic
	CPU info: Intel(R) Xeon(R) CPU E5-2699 v3 @ 2.30GHz
	GCC Version: gcc (Ubuntu 7.3.0-27ubuntu1~18.04) 7.3.0
	Clang Version: 6.0.0-1ubuntu2 (tags/RELEASE_600/final)
	x86_64-native-linuxapp-icc
	x86_64-native-linuxapp-clang
	x86_64-native-linuxapp-gcc


OS: UB1904-64
	Kernel Version: 5.0.0-13-generic
	CPU info: Intel(R) Xeon(R) CPU E5-2699 v3 @ 2.30GHz
	GCC Version: gcc (Ubuntu 8.3.0-6ubuntu1) 8.3.0
	Clang Version: 8.0.0-3 (tags/RELEASE_800/final)
	x86_64-native-linuxapp-gcc


OS: UB1604-32
	Kernel Version: 4.4.0-131-generic
	CPU info: Intel(R) Xeon(R) CPU E5-2699 v3 @ 2.30GHz
	GCC Version: gcc (Ubuntu 5.4.0-6ubuntu1~16.04.11) 5.4.0 20160609
	Clang Version: 3.8.0-2ubuntu4 (tags/RELEASE_380/final)
	i686-native-linuxapp-gcc


OS: UB1604-64
	Kernel Version: 4.4.0-47-generic
	CPU info: Intel(R) Xeon(R) CPU E5-2699 v3 @ 2.30GHz
	GCC Version: gcc (Ubuntu 5.4.0-6ubuntu1~16.04.10) 5.4.0 20160609
	Clang Version: 3.8.0-2ubuntu4 (tags/RELEASE_380/final)
	x86_64-native-linuxapp-clang
	x86_64-native-linuxapp-gcc


OS: FC30-64
	Kernel Version: 5.1.7-300.fc30.x86_64
	CPU info: Intel(R) Xeon(R) CPU E5-2699 v4 @ 2.20GHz
	GCC Version: gcc (GCC) 9.1.1 20190503 (Red Hat 9.1.1-1)
	Clang Version: 8.0.0 (Fedora 8.0.0-1.fc30)
	x86_64-native-linuxapp-clang
	x86_64-native-linuxapp-gcc


OS: FreeBSD12-64
	Kernel Version: 12.0-RC3
	CPU info: Intel(R) Xeon(R) CPU E5-2699 v4 @ 2.20GHz (2194.98-MHz K8-class CPU)
	GCC Version: gcc (FreeBSD Ports Collection) 7.3.0
	Clang Version: 6.0.1 (tags/RELEASE_601/final 335540) (based on LLVM 6.0.1)
	x86_64-native-bsdapp-gcc+debug
	x86_64-native-bsdapp-gcc+shared
	x86_64-native-bsdapp-gcc
	x86_64-native-bsdapp-clang


OS: RHEL80-64
	Kernel Version: 4.18.0-80.el8.x86_64
	CPU info: Intel(R) Xeon(R) CPU E5-2699 v4 @ 2.20GHz
	GCC Version: gcc (GCC) 8.2.1 20180905 (Red Hat 8.2.1-3)
	Clang Version: NA
	x86_64-native-linuxapp-gcc+debug
	x86_64-native-linuxapp-gcc+shared
	x86_64-native-linuxapp-icc
	x86_64-native-linuxapp-clang
	x86_64-native-linuxapp-gcc


OS: SUSE15-64
	Kernel Version: 4.12.14-lp150.11-default
	CPU info: Intel(R) Xeon(R) CPU E5-2699 v4 @ 2.20GHz
	GCC Version: gcc (SUSE Linux) 7.3.1 20180323 [gcc-7-branch revision 258812]
	Clang Version: 5.0.1 (tags/RELEASE_501/final 312548)
	x86_64-native-linuxapp-gcc
	x86_64-native-linuxapp-clang


** Meson build **


OS: UB1804-64
	Kernel Version: 4.15.0-20-generic
	CPU info: Intel(R) Xeon(R) CPU E5-2699 v4 @ 2.20GHz
	GCC Version: gcc (Ubuntu 7.3.0-27ubuntu1~18.04) 7.3.0
	Clang Version: 6.0.0-1ubuntu2 (tags/RELEASE_600/final)
	x86_64-native-linuxapp-doc
	build-gcc-static
	build-gcc-shared
	build-clang-static
	build-clang-shared
	build-x86-default
	build-arm64-host-clang
	build-arm64-armada
	build-arm64-armv8
	build-arm64-bluefield
	build-arm64-dpaa2
	build-arm64-dpaa
	build-arm64-octeontx2
	build-arm64-thunderx2
	build-arm64-thunderx


OS: UB1604-32
	Kernel Version: 4.4.0-131-generic
	CPU info: Intel(R) Xeon(R) CPU E5-2699 v4 @ 2.20GHz
	GCC Version: gcc (Ubuntu 5.4.0-6ubuntu1~16.04.11) 5.4.0 20160609
	Clang Version: 3.8.0-2ubuntu4 (tags/RELEASE_380/final)
	build-gcc-static
	build-gcc-shared
	build-clang-static
	build-clang-shared
	build-x86-default
	build-arm64-host-clang
	build-arm64-armada
	build-arm64-armv8
	build-arm64-bluefield
	build-arm64-dpaa2
	build-arm64-dpaa
	build-arm64-octeontx2
	build-arm64-thunderx2
	build-arm64-thunderx


OS: FC30-64
	Kernel Version: 5.0.9-301.fc30.x86_64
	CPU info: Intel(R) Xeon(R) CPU E5-2699 v4 @ 2.20GHz
	GCC Version: gcc (GCC) 9.1.1 20190503 (Red Hat 9.1.1-1)
	Clang Version: 8.0.0 (Fedora 8.0.0-1.fc30)
	build-gcc-static
	build-gcc-shared
	build-clang-static
	build-clang-shared
	build-x86-default
	build-arm64-host-clang
	build-arm64-armada
	build-arm64-armv8
	build-arm64-bluefield
	build-arm64-dpaa2
	build-arm64-dpaa
	build-arm64-octeontx2
	build-arm64-thunderx2
	build-arm64-thunderx


OS: WIN10-64
	Kernel Version: N/A
	CPU info: N/A
	GCC Version: N/A
	Clang Version: Clang 8.0.0
	x86_64-windows-clang


OS: FreeBSD12-64
	Kernel Version: 12.0-RC3
	CPU info: Intel(R) Xeon(R) CPU E5-2699 v4 @ 2.20GHz (2194.99-MHz K8-class CPU)
	GCC Version: gcc (FreeBSD Ports Collection) 7.3.0
	Clang Version: 6.0.1 (tags/RELEASE_601/final 335540) (based on LLVM 6.0.1)
	build-gcc-static
	build-gcc-shared
	build-clang-static
	build-clang-shared
	build-x86-default
	build-arm64-host-clang
	build-arm64-armada
	build-arm64-armv8
	build-arm64-bluefield
	build-arm64-dpaa2
	build-arm64-dpaa
	build-arm64-octeontx2
	build-arm64-thunderx2
	build-arm64-thunderx


OS: RHEL80-64
	Kernel Version: 4.18.0-80.el8.x86_64
	CPU info: Intel(R) Xeon(R) CPU E5-2699 v4 @ 2.20GHz
	GCC Version: gcc (GCC) 8.2.1 20180905 (Red Hat 8.2.1-3)
	Clang Version: NA
	build-gcc-static
	build-gcc-shared
	build-x86-default
	build-arm64-armada
	build-arm64-armv8
	build-arm64-bluefield
	build-arm64-dpaa2
	build-arm64-dpaa
	build-arm64-octeontx2
	build-arm64-thunderx2
	build-arm64-thunderx


OS: SUSE15-64
	Kernel Version: 4.12.14-lp150.11-default
	CPU info: Intel(R) Xeon(R) CPU E5-2699 v4 @ 2.20GHz
	GCC Version: gcc (SUSE Linux) 7.3.1 20180323 [gcc-7-branch revision 258812]
	Clang Version: 5.0.1 (tags/RELEASE_501/final 312548)
	build-gcc-static
	build-gcc-shared
	build-clang-static
	build-clang-shared
	build-x86-default
	build-arm64-host-clang
	build-arm64-armada
	build-arm64-armv8
	build-arm64-bluefield
	build-arm64-dpaa2
	build-arm64-dpaa
	build-arm64-octeontx2
	build-arm64-thunderx2
	build-arm64-thunderx


*Meson Build Failed #1:
OS: SUSE15-64
Target:build-gcc-static
Build type: cross build
Program cat found: YES (/usr/bin/cat)
Project name: DPDK
Project version: 19.08.0

meson.build:4:0: ERROR: Unknown compiler(s): [['aarch64-linux-gnu-gcc']]
The follow exceptions were encountered:
Running "aarch64-linux-gnu-gcc --version" gave "[Errno 2] No such file or directory: 'aarch64-linux-gnu-gcc': 'aarch64-linux-gnu-gcc'"

A full log can be found at /tmp/SUSE15-64_K4.12.14_GCC7.3.1/x86_64-native-linuxapp-gcc/1a49ae4a61f3447b8b807c2d63c659b9/dpdk/build-arm64-host-clang/meson-logs/meson-log.txt
ninja -C build-arm64-host-clang
--
Build type: cross build
Program cat found: YES (/usr/bin/cat)
Project name: DPDK
Project version: 19.08.0

meson.build:4:0: ERROR: Unknown compiler(s): [['aarch64-linux-gnu-gcc']]
The follow exceptions were encountered:
Running "aarch64-linux-gnu-gcc --version" gave "[Errno 2] No such file or directory: 'aarch64-linux-gnu-gcc': 'aarch64-linux-gnu-gcc'"

A full log can be found at /tmp/SUSE15-64_K4.12.14_GCC7.3.1/x86_64-native-linuxapp-gcc/1a49ae4a61f3447b8b807c2d63c659b9/dpdk/build-arm64-armada/meson-logs/meson-log.txt
ninja -C build-arm64-armada
--
Build type: cross build
Program cat found: YES (/usr/bin/cat)
Project name: DPDK
Project version: 19.08.0

meson.build:4:0: ERROR: Unknown compiler(s): [['aarch64-linux-gnu-gcc']]
The follow exceptions were encountered:
Running "aarch64-linux-gnu-gcc --version" gave "[Errno 2] No such file or directory: 'aarch64-linux-gnu-gcc': 'aarch64-linux-gnu-gcc'"

A full log can be found at /tmp/SUSE15-64_K4.12.14_GCC7.3.1/x86_64-native-linuxapp-gcc/1a49ae4a61f3447b8b807c2d63c659b9/dpdk/build-arm64-armv8/meson-logs/meson-log.txt
ninja -C build-arm64-armv8
--
Build type: cross build
Program cat found: YES (/usr/bin/cat)
Project name: DPDK
Project version: 19.08.0

meson.build:4:0: ERROR: Unknown compiler(s): [['aarch64-linux-gnu-gcc']]
The follow exceptions were encountered:
Running "aarch64-linux-gnu-gcc --version" gave "[Errno 2] No such file or directory: 'aarch64-linux-gnu-gcc': 'aarch64-linux-gnu-gcc'"

A full log can be found at /tmp/SUSE15-64_K4.12.14_GCC7.3.1/x86_64-native-linuxapp-gcc/1a49ae4a61f3447b8b807c2d63c659b9/dpdk/build-arm64-bluefield/meson-logs/meson-log.txt
ninja -C build-arm64-bluefield
--
Build type: cross build
Program cat found: YES (/usr/bin/cat)
Project name: DPDK
Project version: 19.08.0

meson.build:4:0: ERROR: Unknown compiler(s): [['aarch64-linux-gnu-gcc']]
The follow exceptions were encountered:
Running "aarch64-linux-gnu-gcc --version" gave "[Errno 2] No such file or directory: 'aarch64-linux-gnu-gcc': 'aarch64-linux-gnu-gcc'"

A full log can be found at /tmp/SUSE15-64_K4.12.14_GCC7.3.1/x86_64-native-linuxapp-gcc/1a49ae4a61f3447b8b807c2d63c659b9/dpdk/build-arm64-dpaa2/meson-logs/meson-log.txt
ninja -C build-arm64-dpaa2
--
Build type: cross build
Program cat found: YES (/usr/bin/cat)
Project name: DPDK
Project version: 19.08.0

meson.build:4:0: ERROR: Unknown compiler(s): [['aarch64-linux-gnu-gcc']]
The follow exceptions were encountered:
Running "aarch64-linux-gnu-gcc --version" gave "[Errno 2] No such file or directory: 'aarch64-linux-gnu-gcc': 'aarch64-linux-gnu-gcc'"

A full log can be found at /tmp/SUSE15-64_K4.12.14_GCC7.3.1/x86_64-native-linuxapp-gcc/1a49ae4a61f3447b8b807c2d63c659b9/dpdk/build-arm64-dpaa/meson-logs/meson-log.txt
ninja -C build-arm64-dpaa
--
Build type: cross build
Program cat found: YES (/usr/bin/cat)
Project name: DPDK
Project version: 19.08.0

meson.build:4:0: ERROR: Unknown compiler(s): [['aarch64-linux-gnu-gcc']]
The follow exceptions were encountered:
Running "aarch64-linux-gnu-gcc --version" gave "[Errno 2] No such file or directory: 'aarch64-linux-gnu-gcc': 'aarch64-linux-gnu-gcc'"

A full log can be found at /tmp/SUSE15-64_K4.12.14_GCC7.3.1/x86_64-native-linuxapp-gcc/1a49ae4a61f3447b8b807c2d63c659b9/dpdk/build-arm64-octeontx2/meson-logs/meson-log.txt
ninja -C build-arm64-octeontx2
--
Build type: cross build
Program cat found: YES (/usr/bin/cat)
Project name: DPDK
Project version: 19.08.0

meson.build:4:0: ERROR: Unknown compiler(s): [['aarch64-linux-gnu-gcc']]
The follow exceptions were encountered:
Running "aarch64-linux-gnu-gcc --version" gave "[Errno 2] No such file or directory: 'aarch64-linux-gnu-gcc': 'aarch64-linux-gnu-gcc'"

A full log can be found at /tmp/SUSE15-64_K4.12.14_GCC7.3.1/x86_64-native-linuxapp-gcc/1a49ae4a61f3447b8b807c2d63c659b9/dpdk/build-arm64-thunderx2/meson-logs/meson-log.txt
ninja -C build-arm64-thunderx2
--
Build type: cross build
Program cat found: YES (/usr/bin/cat)
Project name: DPDK
Project version: 19.08.0

meson.build:4:0: ERROR: Unknown compiler(s): [['aarch64-linux-gnu-gcc']]
The follow exceptions were encountered:
Running "aarch64-linux-gnu-gcc --version" gave "[Errno 2] No such file or directory: 'aarch64-linux-gnu-gcc': 'aarch64-linux-gnu-gcc'"

A full log can be found at /tmp/SUSE15-64_K4.12.14_GCC7.3.1/x86_64-native-linuxapp-gcc/1a49ae4a61f3447b8b807c2d63c659b9/dpdk/build-arm64-thunderx/meson-logs/meson-log.txt
ninja -C build-arm64-thunderx


*Meson Build Failed #2:
OS: RHEL80-64
Target:build-gcc-static
Build type: cross build
Program cat found: YES (/usr/bin/cat)
Project name: DPDK
Project version: 19.08.0

meson.build:4:0: ERROR: Unknown compiler(s): [['aarch64-linux-gnu-gcc']]
The follow exceptions were encountered:
Running "aarch64-linux-gnu-gcc --version" gave "[Errno 2] No such file or directory: 'aarch64-linux-gnu-gcc': 'aarch64-linux-gnu-gcc'"

A full log can be found at /tmp/RHEL80-64_K3.10.0_GCC8.2.1/x86_64-native-linuxapp-gcc/1a49ae4a61f3447b8b807c2d63c659b9/dpdk/build-arm64-armada/meson-logs/meson-log.txt
ninja -C build-arm64-armada
--
Build type: cross build
Program cat found: YES (/usr/bin/cat)
Project name: DPDK
Project version: 19.08.0

meson.build:4:0: ERROR: Unknown compiler(s): [['aarch64-linux-gnu-gcc']]
The follow exceptions were encountered:
Running "aarch64-linux-gnu-gcc --version" gave "[Errno 2] No such file or directory: 'aarch64-linux-gnu-gcc': 'aarch64-linux-gnu-gcc'"

A full log can be found at /tmp/RHEL80-64_K3.10.0_GCC8.2.1/x86_64-native-linuxapp-gcc/1a49ae4a61f3447b8b807c2d63c659b9/dpdk/build-arm64-armv8/meson-logs/meson-log.txt
ninja -C build-arm64-armv8
--
Build type: cross build
Program cat found: YES (/usr/bin/cat)
Project name: DPDK
Project version: 19.08.0

meson.build:4:0: ERROR: Unknown compiler(s): [['aarch64-linux-gnu-gcc']]
The follow exceptions were encountered:
Running "aarch64-linux-gnu-gcc --version" gave "[Errno 2] No such file or directory: 'aarch64-linux-gnu-gcc': 'aarch64-linux-gnu-gcc'"

A full log can be found at /tmp/RHEL80-64_K3.10.0_GCC8.2.1/x86_64-native-linuxapp-gcc/1a49ae4a61f3447b8b807c2d63c659b9/dpdk/build-arm64-bluefield/meson-logs/meson-log.txt
ninja -C build-arm64-bluefield
--
Build type: cross build
Program cat found: YES (/usr/bin/cat)
Project name: DPDK
Project version: 19.08.0

meson.build:4:0: ERROR: Unknown compiler(s): [['aarch64-linux-gnu-gcc']]
The follow exceptions were encountered:
Running "aarch64-linux-gnu-gcc --version" gave "[Errno 2] No such file or directory: 'aarch64-linux-gnu-gcc': 'aarch64-linux-gnu-gcc'"

A full log can be found at /tmp/RHEL80-64_K3.10.0_GCC8.2.1/x86_64-native-linuxapp-gcc/1a49ae4a61f3447b8b807c2d63c659b9/dpdk/build-arm64-dpaa2/meson-logs/meson-log.txt
ninja -C build-arm64-dpaa2
--
Build type: cross build
Program cat found: YES (/usr/bin/cat)
Project name: DPDK
Project version: 19.08.0

meson.build:4:0: ERROR: Unknown compiler(s): [['aarch64-linux-gnu-gcc']]
The follow exceptions were encountered:
Running "aarch64-linux-gnu-gcc --version" gave "[Errno 2] No such file or directory: 'aarch64-linux-gnu-gcc': 'aarch64-linux-gnu-gcc'"

A full log can be found at /tmp/RHEL80-64_K3.10.0_GCC8.2.1/x86_64-native-linuxapp-gcc/1a49ae4a61f3447b8b807c2d63c659b9/dpdk/build-arm64-dpaa/meson-logs/meson-log.txt
ninja -C build-arm64-dpaa
--
Build type: cross build
Program cat found: YES (/usr/bin/cat)
Project name: DPDK
Project version: 19.08.0

meson.build:4:0: ERROR: Unknown compiler(s): [['aarch64-linux-gnu-gcc']]
The follow exceptions were encountered:
Running "aarch64-linux-gnu-gcc --version" gave "[Errno 2] No such file or directory: 'aarch64-linux-gnu-gcc': 'aarch64-linux-gnu-gcc'"

A full log can be found at /tmp/RHEL80-64_K3.10.0_GCC8.2.1/x86_64-native-linuxapp-gcc/1a49ae4a61f3447b8b807c2d63c659b9/dpdk/build-arm64-octeontx2/meson-logs/meson-log.txt
ninja -C build-arm64-octeontx2
--
Build type: cross build
Program cat found: YES (/usr/bin/cat)
Project name: DPDK
Project version: 19.08.0

meson.build:4:0: ERROR: Unknown compiler(s): [['aarch64-linux-gnu-gcc']]
The follow exceptions were encountered:
Running "aarch64-linux-gnu-gcc --version" gave "[Errno 2] No such file or directory: 'aarch64-linux-gnu-gcc': 'aarch64-linux-gnu-gcc'"

A full log can be found at /tmp/RHEL80-64_K3.10.0_GCC8.2.1/x86_64-native-linuxapp-gcc/1a49ae4a61f3447b8b807c2d63c659b9/dpdk/build-arm64-thunderx2/meson-logs/meson-log.txt
ninja -C build-arm64-thunderx2
--
Build type: cross build
Program cat found: YES (/usr/bin/cat)
Project name: DPDK
Project version: 19.08.0

meson.build:4:0: ERROR: Unknown compiler(s): [['aarch64-linux-gnu-gcc']]
The follow exceptions were encountered:
Running "aarch64-linux-gnu-gcc --version" gave "[Errno 2] No such file or directory: 'aarch64-linux-gnu-gcc': 'aarch64-linux-gnu-gcc'"

A full log can be found at /tmp/RHEL80-64_K3.10.0_GCC8.2.1/x86_64-native-linuxapp-gcc/1a49ae4a61f3447b8b807c2d63c659b9/dpdk/build-arm64-thunderx/meson-logs/meson-log.txt
ninja -C build-arm64-thunderx


*Meson Build Failed #3:
OS: FC30-64
Target:build-gcc-static
Build type: cross build
Program cat found: YES (/usr/bin/cat)
Project name: DPDK
Project version: 19.08.0

meson.build:4:0: ERROR: Unknown compiler(s): [['aarch64-linux-gnu-gcc']]
The follow exceptions were encountered:
Running "aarch64-linux-gnu-gcc --version" gave "[Errno 2] No such file or directory: 'aarch64-linux-gnu-gcc': 'aarch64-linux-gnu-gcc'"

A full log can be found at /tmp/FC30-64_K4.20_GCC9.1.1/x86_64-native-linuxapp-gcc/1a49ae4a61f3447b8b807c2d63c659b9/dpdk/build-arm64-host-clang/meson-logs/meson-log.txt
ninja -C build-arm64-host-clang
--
Build type: cross build
Program cat found: YES (/usr/bin/cat)
Project name: DPDK
Project version: 19.08.0

meson.build:4:0: ERROR: Unknown compiler(s): [['aarch64-linux-gnu-gcc']]
The follow exceptions were encountered:
Running "aarch64-linux-gnu-gcc --version" gave "[Errno 2] No such file or directory: 'aarch64-linux-gnu-gcc': 'aarch64-linux-gnu-gcc'"

A full log can be found at /tmp/FC30-64_K4.20_GCC9.1.1/x86_64-native-linuxapp-gcc/1a49ae4a61f3447b8b807c2d63c659b9/dpdk/build-arm64-armada/meson-logs/meson-log.txt
ninja -C build-arm64-armada
--
Build type: cross build
Program cat found: YES (/usr/bin/cat)
Project name: DPDK
Project version: 19.08.0

meson.build:4:0: ERROR: Unknown compiler(s): [['aarch64-linux-gnu-gcc']]
The follow exceptions were encountered:
Running "aarch64-linux-gnu-gcc --version" gave "[Errno 2] No such file or directory: 'aarch64-linux-gnu-gcc': 'aarch64-linux-gnu-gcc'"

A full log can be found at /tmp/FC30-64_K4.20_GCC9.1.1/x86_64-native-linuxapp-gcc/1a49ae4a61f3447b8b807c2d63c659b9/dpdk/build-arm64-armv8/meson-logs/meson-log.txt
ninja -C build-arm64-armv8
--
Build type: cross build
Program cat found: YES (/usr/bin/cat)
Project name: DPDK
Project version: 19.08.0

meson.build:4:0: ERROR: Unknown compiler(s): [['aarch64-linux-gnu-gcc']]
The follow exceptions were encountered:
Running "aarch64-linux-gnu-gcc --version" gave "[Errno 2] No such file or directory: 'aarch64-linux-gnu-gcc': 'aarch64-linux-gnu-gcc'"

A full log can be found at /tmp/FC30-64_K4.20_GCC9.1.1/x86_64-native-linuxapp-gcc/1a49ae4a61f3447b8b807c2d63c659b9/dpdk/build-arm64-bluefield/meson-logs/meson-log.txt
ninja -C build-arm64-bluefield
--
Build type: cross build
Program cat found: YES (/usr/bin/cat)
Project name: DPDK
Project version: 19.08.0

meson.build:4:0: ERROR: Unknown compiler(s): [['aarch64-linux-gnu-gcc']]
The follow exceptions were encountered:
Running "aarch64-linux-gnu-gcc --version" gave "[Errno 2] No such file or directory: 'aarch64-linux-gnu-gcc': 'aarch64-linux-gnu-gcc'"

A full log can be found at /tmp/FC30-64_K4.20_GCC9.1.1/x86_64-native-linuxapp-gcc/1a49ae4a61f3447b8b807c2d63c659b9/dpdk/build-arm64-dpaa2/meson-logs/meson-log.txt
ninja -C build-arm64-dpaa2
--
Build type: cross build
Program cat found: YES (/usr/bin/cat)
Project name: DPDK
Project version: 19.08.0

meson.build:4:0: ERROR: Unknown compiler(s): [['aarch64-linux-gnu-gcc']]
The follow exceptions were encountered:
Running "aarch64-linux-gnu-gcc --version" gave "[Errno 2] No such file or directory: 'aarch64-linux-gnu-gcc': 'aarch64-linux-gnu-gcc'"

A full log can be found at /tmp/FC30-64_K4.20_GCC9.1.1/x86_64-native-linuxapp-gcc/1a49ae4a61f3447b8b807c2d63c659b9/dpdk/build-arm64-dpaa/meson-logs/meson-log.txt
ninja -C build-arm64-dpaa
--
Build type: cross build
Program cat found: YES (/usr/bin/cat)
Project name: DPDK
Project version: 19.08.0

meson.build:4:0: ERROR: Unknown compiler(s): [['aarch64-linux-gnu-gcc']]
The follow exceptions were encountered:
Running "aarch64-linux-gnu-gcc --version" gave "[Errno 2] No such file or directory: 'aarch64-linux-gnu-gcc': 'aarch64-linux-gnu-gcc'"

A full log can be found at /tmp/FC30-64_K4.20_GCC9.1.1/x86_64-native-linuxapp-gcc/1a49ae4a61f3447b8b807c2d63c659b9/dpdk/build-arm64-octeontx2/meson-logs/meson-log.txt
ninja -C build-arm64-octeontx2
--
Build type: cross build
Program cat found: YES (/usr/bin/cat)
Project name: DPDK
Project version: 19.08.0

meson.build:4:0: ERROR: Unknown compiler(s): [['aarch64-linux-gnu-gcc']]
The follow exceptions were encountered:
Running "aarch64-linux-gnu-gcc --version" gave "[Errno 2] No such file or directory: 'aarch64-linux-gnu-gcc': 'aarch64-linux-gnu-gcc'"

A full log can be found at /tmp/FC30-64_K4.20_GCC9.1.1/x86_64-native-linuxapp-gcc/1a49ae4a61f3447b8b807c2d63c659b9/dpdk/build-arm64-thunderx2/meson-logs/meson-log.txt
ninja -C build-arm64-thunderx2
--
Build type: cross build
Program cat found: YES (/usr/bin/cat)
Project name: DPDK
Project version: 19.08.0

meson.build:4:0: ERROR: Unknown compiler(s): [['aarch64-linux-gnu-gcc']]
The follow exceptions were encountered:
Running "aarch64-linux-gnu-gcc --version" gave "[Errno 2] No such file or directory: 'aarch64-linux-gnu-gcc': 'aarch64-linux-gnu-gcc'"

A full log can be found at /tmp/FC30-64_K4.20_GCC9.1.1/x86_64-native-linuxapp-gcc/1a49ae4a61f3447b8b807c2d63c659b9/dpdk/build-arm64-thunderx/meson-logs/meson-log.txt
ninja -C build-arm64-thunderx


*Meson Build Failed #4:
OS: UB1604-32
Target:build-gcc-static
Build type: cross build
Program cat found: YES (/bin/cat)
Project name: DPDK
Project version: 19.08.0

meson.build:4:0: ERROR: Unknown compiler(s): [['aarch64-linux-gnu-gcc']]
The follow exceptions were encountered:
Running "aarch64-linux-gnu-gcc --version" gave "[Errno 2] No such file or directory: 'aarch64-linux-gnu-gcc'"

A full log can be found at /tmp/UB1604-32_K4.4.0_GCC5.4.0/i686-native-linuxapp-gcc/1a49ae4a61f3447b8b807c2d63c659b9/dpdk/build-arm64-host-clang/meson-logs/meson-log.txt
ninja -C build-arm64-host-clang
--
Build type: cross build
Program cat found: YES (/bin/cat)
Project name: DPDK
Project version: 19.08.0

meson.build:4:0: ERROR: Unknown compiler(s): [['aarch64-linux-gnu-gcc']]
The follow exceptions were encountered:
Running "aarch64-linux-gnu-gcc --version" gave "[Errno 2] No such file or directory: 'aarch64-linux-gnu-gcc'"

A full log can be found at /tmp/UB1604-32_K4.4.0_GCC5.4.0/i686-native-linuxapp-gcc/1a49ae4a61f3447b8b807c2d63c659b9/dpdk/build-arm64-armada/meson-logs/meson-log.txt
ninja -C build-arm64-armada
--
Build type: cross build
Program cat found: YES (/bin/cat)
Project name: DPDK
Project version: 19.08.0

meson.build:4:0: ERROR: Unknown compiler(s): [['aarch64-linux-gnu-gcc']]
The follow exceptions were encountered:
Running "aarch64-linux-gnu-gcc --version" gave "[Errno 2] No such file or directory: 'aarch64-linux-gnu-gcc'"

A full log can be found at /tmp/UB1604-32_K4.4.0_GCC5.4.0/i686-native-linuxapp-gcc/1a49ae4a61f3447b8b807c2d63c659b9/dpdk/build-arm64-armv8/meson-logs/meson-log.txt
ninja -C build-arm64-armv8
--
Build type: cross build
Program cat found: YES (/bin/cat)
Project name: DPDK
Project version: 19.08.0

meson.build:4:0: ERROR: Unknown compiler(s): [['aarch64-linux-gnu-gcc']]
The follow exceptions were encountered:
Running "aarch64-linux-gnu-gcc --version" gave "[Errno 2] No such file or directory: 'aarch64-linux-gnu-gcc'"

A full log can be found at /tmp/UB1604-32_K4.4.0_GCC5.4.0/i686-native-linuxapp-gcc/1a49ae4a61f3447b8b807c2d63c659b9/dpdk/build-arm64-bluefield/meson-logs/meson-log.txt
ninja -C build-arm64-bluefield
--
Build type: cross build
Program cat found: YES (/bin/cat)
Project name: DPDK
Project version: 19.08.0

meson.build:4:0: ERROR: Unknown compiler(s): [['aarch64-linux-gnu-gcc']]
The follow exceptions were encountered:
Running "aarch64-linux-gnu-gcc --version" gave "[Errno 2] No such file or directory: 'aarch64-linux-gnu-gcc'"

A full log can be found at /tmp/UB1604-32_K4.4.0_GCC5.4.0/i686-native-linuxapp-gcc/1a49ae4a61f3447b8b807c2d63c659b9/dpdk/build-arm64-dpaa2/meson-logs/meson-log.txt
ninja -C build-arm64-dpaa2
--
Build type: cross build
Program cat found: YES (/bin/cat)
Project name: DPDK
Project version: 19.08.0

meson.build:4:0: ERROR: Unknown compiler(s): [['aarch64-linux-gnu-gcc']]
The follow exceptions were encountered:
Running "aarch64-linux-gnu-gcc --version" gave "[Errno 2] No such file or directory: 'aarch64-linux-gnu-gcc'"

A full log can be found at /tmp/UB1604-32_K4.4.0_GCC5.4.0/i686-native-linuxapp-gcc/1a49ae4a61f3447b8b807c2d63c659b9/dpdk/build-arm64-dpaa/meson-logs/meson-log.txt
ninja -C build-arm64-dpaa
--
Build type: cross build
Program cat found: YES (/bin/cat)
Project name: DPDK
Project version: 19.08.0

meson.build:4:0: ERROR: Unknown compiler(s): [['aarch64-linux-gnu-gcc']]
The follow exceptions were encountered:
Running "aarch64-linux-gnu-gcc --version" gave "[Errno 2] No such file or directory: 'aarch64-linux-gnu-gcc'"

A full log can be found at /tmp/UB1604-32_K4.4.0_GCC5.4.0/i686-native-linuxapp-gcc/1a49ae4a61f3447b8b807c2d63c659b9/dpdk/build-arm64-octeontx2/meson-logs/meson-log.txt
ninja -C build-arm64-octeontx2
--
Build type: cross build
Program cat found: YES (/bin/cat)
Project name: DPDK
Project version: 19.08.0

meson.build:4:0: ERROR: Unknown compiler(s): [['aarch64-linux-gnu-gcc']]
The follow exceptions were encountered:
Running "aarch64-linux-gnu-gcc --version" gave "[Errno 2] No such file or directory: 'aarch64-linux-gnu-gcc'"

A full log can be found at /tmp/UB1604-32_K4.4.0_GCC5.4.0/i686-native-linuxapp-gcc/1a49ae4a61f3447b8b807c2d63c659b9/dpdk/build-arm64-thunderx2/meson-logs/meson-log.txt
ninja -C build-arm64-thunderx2
--
Build type: cross build
Program cat found: YES (/bin/cat)
Project name: DPDK
Project version: 19.08.0

meson.build:4:0: ERROR: Unknown compiler(s): [['aarch64-linux-gnu-gcc']]
The follow exceptions were encountered:
Running "aarch64-linux-gnu-gcc --version" gave "[Errno 2] No such file or directory: 'aarch64-linux-gnu-gcc'"

A full log can be found at /tmp/UB1604-32_K4.4.0_GCC5.4.0/i686-native-linuxapp-gcc/1a49ae4a61f3447b8b807c2d63c659b9/dpdk/build-arm64-thunderx/meson-logs/meson-log.txt
ninja -C build-arm64-thunderx


*Meson Build Failed #5:
OS: UB1804-64
Target:build-gcc-static
Build type: cross build
Program cat found: YES (/bin/cat)
Project name: DPDK
Project version: 19.08.0

meson.build:4:0: ERROR: Unknown compiler(s): [['aarch64-linux-gnu-gcc']]
The follow exceptions were encountered:
Running "aarch64-linux-gnu-gcc --version" gave "[Errno 2] No such file or directory: 'aarch64-linux-gnu-gcc': 'aarch64-linux-gnu-gcc'"

A full log can be found at /tmp/UB1804-64_K4.15.0_GCC7.3.0/x86_64-native-linuxapp-gcc/1a49ae4a61f3447b8b807c2d63c659b9/dpdk/build-arm64-host-clang/meson-logs/meson-log.txt
ninja -C build-arm64-host-clang
--
Build type: cross build
Program cat found: YES (/bin/cat)
Project name: DPDK
Project version: 19.08.0

meson.build:4:0: ERROR: Unknown compiler(s): [['aarch64-linux-gnu-gcc']]
The follow exceptions were encountered:
Running "aarch64-linux-gnu-gcc --version" gave "[Errno 2] No such file or directory: 'aarch64-linux-gnu-gcc': 'aarch64-linux-gnu-gcc'"

A full log can be found at /tmp/UB1804-64_K4.15.0_GCC7.3.0/x86_64-native-linuxapp-gcc/1a49ae4a61f3447b8b807c2d63c659b9/dpdk/build-arm64-armada/meson-logs/meson-log.txt
ninja -C build-arm64-armada
--
Build type: cross build
Program cat found: YES (/bin/cat)
Project name: DPDK
Project version: 19.08.0

meson.build:4:0: ERROR: Unknown compiler(s): [['aarch64-linux-gnu-gcc']]
The follow exceptions were encountered:
Running "aarch64-linux-gnu-gcc --version" gave "[Errno 2] No such file or directory: 'aarch64-linux-gnu-gcc': 'aarch64-linux-gnu-gcc'"

A full log can be found at /tmp/UB1804-64_K4.15.0_GCC7.3.0/x86_64-native-linuxapp-gcc/1a49ae4a61f3447b8b807c2d63c659b9/dpdk/build-arm64-armv8/meson-logs/meson-log.txt
ninja -C build-arm64-armv8
--
Build type: cross build
Program cat found: YES (/bin/cat)
Project name: DPDK
Project version: 19.08.0

meson.build:4:0: ERROR: Unknown compiler(s): [['aarch64-linux-gnu-gcc']]
The follow exceptions were encountered:
Running "aarch64-linux-gnu-gcc --version" gave "[Errno 2] No such file or directory: 'aarch64-linux-gnu-gcc': 'aarch64-linux-gnu-gcc'"

A full log can be found at /tmp/UB1804-64_K4.15.0_GCC7.3.0/x86_64-native-linuxapp-gcc/1a49ae4a61f3447b8b807c2d63c659b9/dpdk/build-arm64-bluefield/meson-logs/meson-log.txt
ninja -C build-arm64-bluefield
--
Build type: cross build
Program cat found: YES (/bin/cat)
Project name: DPDK
Project version: 19.08.0

meson.build:4:0: ERROR: Unknown compiler(s): [['aarch64-linux-gnu-gcc']]
The follow exceptions were encountered:
Running "aarch64-linux-gnu-gcc --version" gave "[Errno 2] No such file or directory: 'aarch64-linux-gnu-gcc': 'aarch64-linux-gnu-gcc'"

A full log can be found at /tmp/UB1804-64_K4.15.0_GCC7.3.0/x86_64-native-linuxapp-gcc/1a49ae4a61f3447b8b807c2d63c659b9/dpdk/build-arm64-dpaa2/meson-logs/meson-log.txt
ninja -C build-arm64-dpaa2
--
Build type: cross build
Program cat found: YES (/bin/cat)
Project name: DPDK
Project version: 19.08.0

meson.build:4:0: ERROR: Unknown compiler(s): [['aarch64-linux-gnu-gcc']]
The follow exceptions were encountered:
Running "aarch64-linux-gnu-gcc --version" gave "[Errno 2] No such file or directory: 'aarch64-linux-gnu-gcc': 'aarch64-linux-gnu-gcc'"

A full log can be found at /tmp/UB1804-64_K4.15.0_GCC7.3.0/x86_64-native-linuxapp-gcc/1a49ae4a61f3447b8b807c2d63c659b9/dpdk/build-arm64-dpaa/meson-logs/meson-log.txt
ninja -C build-arm64-dpaa
--
Build type: cross build
Program cat found: YES (/bin/cat)
Project name: DPDK
Project version: 19.08.0

meson.build:4:0: ERROR: Unknown compiler(s): [['aarch64-linux-gnu-gcc']]
The follow exceptions were encountered:
Running "aarch64-linux-gnu-gcc --version" gave "[Errno 2] No such file or directory: 'aarch64-linux-gnu-gcc': 'aarch64-linux-gnu-gcc'"

A full log can be found at /tmp/UB1804-64_K4.15.0_GCC7.3.0/x86_64-native-linuxapp-gcc/1a49ae4a61f3447b8b807c2d63c659b9/dpdk/build-arm64-octeontx2/meson-logs/meson-log.txt
ninja -C build-arm64-octeontx2
--
Build type: cross build
Program cat found: YES (/bin/cat)
Project name: DPDK
Project version: 19.08.0

meson.build:4:0: ERROR: Unknown compiler(s): [['aarch64-linux-gnu-gcc']]
The follow exceptions were encountered:
Running "aarch64-linux-gnu-gcc --version" gave "[Errno 2] No such file or directory: 'aarch64-linux-gnu-gcc': 'aarch64-linux-gnu-gcc'"

A full log can be found at /tmp/UB1804-64_K4.15.0_GCC7.3.0/x86_64-native-linuxapp-gcc/1a49ae4a61f3447b8b807c2d63c659b9/dpdk/build-arm64-thunderx2/meson-logs/meson-log.txt
ninja -C build-arm64-thunderx2
--
Build type: cross build
Program cat found: YES (/bin/cat)
Project name: DPDK
Project version: 19.08.0

meson.build:4:0: ERROR: Unknown compiler(s): [['aarch64-linux-gnu-gcc']]
The follow exceptions were encountered:
Running "aarch64-linux-gnu-gcc --version" gave "[Errno 2] No such file or directory: 'aarch64-linux-gnu-gcc': 'aarch64-linux-gnu-gcc'"

A full log can be found at /tmp/UB1804-64_K4.15.0_GCC7.3.0/x86_64-native-linuxapp-gcc/1a49ae4a61f3447b8b807c2d63c659b9/dpdk/build-arm64-thunderx/meson-logs/meson-log.txt
ninja -C build-arm64-thunderx


*Meson Build Failed #6:
OS: FreeBSD12-64
Target:build-gcc-static
Build type: cross build
Program cat found: YES (/bin/cat)
Project name: DPDK
Project version: 19.08.0

meson.build:4:0: ERROR: Unknown compiler(s): [['aarch64-linux-gnu-gcc']]
The follow exceptions were encountered:
Running "aarch64-linux-gnu-gcc --version" gave "[Errno 2] No such file or directory: 'aarch64-linux-gnu-gcc': 'aarch64-linux-gnu-gcc'"

A full log can be found at /tmp/FreeBSD12-64_K19.02_GCC7.3.0/x86_64-native-bsdapp-gcc/1a49ae4a61f3447b8b807c2d63c659b9/dpdk/build-arm64-host-clang/meson-logs/meson-log.txt
ninja -C build-arm64-host-clang
--
Build type: cross build
Program cat found: YES (/bin/cat)
Project name: DPDK
Project version: 19.08.0

meson.build:4:0: ERROR: Unknown compiler(s): [['aarch64-linux-gnu-gcc']]
The follow exceptions were encountered:
Running "aarch64-linux-gnu-gcc --version" gave "[Errno 2] No such file or directory: 'aarch64-linux-gnu-gcc': 'aarch64-linux-gnu-gcc'"

A full log can be found at /tmp/FreeBSD12-64_K19.02_GCC7.3.0/x86_64-native-bsdapp-gcc/1a49ae4a61f3447b8b807c2d63c659b9/dpdk/build-arm64-armada/meson-logs/meson-log.txt
ninja -C build-arm64-armada
--
Build type: cross build
Program cat found: YES (/bin/cat)
Project name: DPDK
Project version: 19.08.0

meson.build:4:0: ERROR: Unknown compiler(s): [['aarch64-linux-gnu-gcc']]
The follow exceptions were encountered:
Running "aarch64-linux-gnu-gcc --version" gave "[Errno 2] No such file or directory: 'aarch64-linux-gnu-gcc': 'aarch64-linux-gnu-gcc'"

A full log can be found at /tmp/FreeBSD12-64_K19.02_GCC7.3.0/x86_64-native-bsdapp-gcc/1a49ae4a61f3447b8b807c2d63c659b9/dpdk/build-arm64-armv8/meson-logs/meson-log.txt
ninja -C build-arm64-armv8
--
Build type: cross build
Program cat found: YES (/bin/cat)
Project name: DPDK
Project version: 19.08.0

meson.build:4:0: ERROR: Unknown compiler(s): [['aarch64-linux-gnu-gcc']]
The follow exceptions were encountered:
Running "aarch64-linux-gnu-gcc --version" gave "[Errno 2] No such file or directory: 'aarch64-linux-gnu-gcc': 'aarch64-linux-gnu-gcc'"

A full log can be found at /tmp/FreeBSD12-64_K19.02_GCC7.3.0/x86_64-native-bsdapp-gcc/1a49ae4a61f3447b8b807c2d63c659b9/dpdk/build-arm64-bluefield/meson-logs/meson-log.txt
ninja -C build-arm64-bluefield
--
Build type: cross build
Program cat found: YES (/bin/cat)
Project name: DPDK
Project version: 19.08.0

meson.build:4:0: ERROR: Unknown compiler(s): [['aarch64-linux-gnu-gcc']]
The follow exceptions were encountered:
Running "aarch64-linux-gnu-gcc --version" gave "[Errno 2] No such file or directory: 'aarch64-linux-gnu-gcc': 'aarch64-linux-gnu-gcc'"

A full log can be found at /tmp/FreeBSD12-64_K19.02_GCC7.3.0/x86_64-native-bsdapp-gcc/1a49ae4a61f3447b8b807c2d63c659b9/dpdk/build-arm64-dpaa2/meson-logs/meson-log.txt
ninja -C build-arm64-dpaa2
--
Build type: cross build
Program cat found: YES (/bin/cat)
Project name: DPDK
Project version: 19.08.0

meson.build:4:0: ERROR: Unknown compiler(s): [['aarch64-linux-gnu-gcc']]
The follow exceptions were encountered:
Running "aarch64-linux-gnu-gcc --version" gave "[Errno 2] No such file or directory: 'aarch64-linux-gnu-gcc': 'aarch64-linux-gnu-gcc'"

A full log can be found at /tmp/FreeBSD12-64_K19.02_GCC7.3.0/x86_64-native-bsdapp-gcc/1a49ae4a61f3447b8b807c2d63c659b9/dpdk/build-arm64-dpaa/meson-logs/meson-log.txt
ninja -C build-arm64-dpaa
--
Build type: cross build
Program cat found: YES (/bin/cat)
Project name: DPDK
Project version: 19.08.0

meson.build:4:0: ERROR: Unknown compiler(s): [['aarch64-linux-gnu-gcc']]
The follow exceptions were encountered:
Running "aarch64-linux-gnu-gcc --version" gave "[Errno 2] No such file or directory: 'aarch64-linux-gnu-gcc': 'aarch64-linux-gnu-gcc'"

A full log can be found at /tmp/FreeBSD12-64_K19.02_GCC7.3.0/x86_64-native-bsdapp-gcc/1a49ae4a61f3447b8b807c2d63c659b9/dpdk/build-arm64-octeontx2/meson-logs/meson-log.txt
ninja -C build-arm64-octeontx2
--
Build type: cross build
Program cat found: YES (/bin/cat)
Project name: DPDK
Project version: 19.08.0

meson.build:4:0: ERROR: Unknown compiler(s): [['aarch64-linux-gnu-gcc']]
The follow exceptions were encountered:
Running "aarch64-linux-gnu-gcc --version" gave "[Errno 2] No such file or directory: 'aarch64-linux-gnu-gcc': 'aarch64-linux-gnu-gcc'"

A full log can be found at /tmp/FreeBSD12-64_K19.02_GCC7.3.0/x86_64-native-bsdapp-gcc/1a49ae4a61f3447b8b807c2d63c659b9/dpdk/build-arm64-thunderx2/meson-logs/meson-log.txt
ninja -C build-arm64-thunderx2
--
Build type: cross build
Program cat found: YES (/bin/cat)
Project name: DPDK
Project version: 19.08.0

meson.build:4:0: ERROR: Unknown compiler(s): [['aarch64-linux-gnu-gcc']]
The follow exceptions were encountered:
Running "aarch64-linux-gnu-gcc --version" gave "[Errno 2] No such file or directory: 'aarch64-linux-gnu-gcc': 'aarch64-linux-gnu-gcc'"

A full log can be found at /tmp/FreeBSD12-64_K19.02_GCC7.3.0/x86_64-native-bsdapp-gcc/1a49ae4a61f3447b8b807c2d63c659b9/dpdk/build-arm64-thunderx/meson-logs/meson-log.txt
ninja -C build-arm64-thunderx

DPDK STV team

^ permalink raw reply	[flat|nested] only message in thread

only message in thread, back to index

Thread overview: (only message) (download: mbox.gz / follow: Atom feed)
-- links below jump to the message on this page --
2019-08-12 23:48 [dpdk-test-report] |FAILURE| pw57632[5/6] devtools: test compiler availability only once sys_stv

automatic DPDK test reports

Archives are clonable:
	git clone --mirror http://inbox.dpdk.org/test-report/0 test-report/git/0.git

	# If you have public-inbox 1.1+ installed, you may
	# initialize and index your mirror using the following commands:
	public-inbox-init -V2 test-report test-report/ http://inbox.dpdk.org/test-report \
		test-report@dpdk.org
	public-inbox-index test-report


Newsgroup available over NNTP:
	nntp://inbox.dpdk.org/inbox.dpdk.test-report


AGPL code for this site: git clone https://public-inbox.org/ public-inbox